carbondata-commits mailing list archives

Site index · List index
Message view « Date » · « Thread »
Top « Date » · « Thread »
From Apache Jenkins Server <jenk...@builds.apache.org>
Subject Build failed in Jenkins: carbondata-master-spark-2.1 #1382
Date Fri, 15 Sep 2017 08:12:01 GMT
See <https://builds.apache.org/job/carbondata-master-spark-2.1/1382/display/redirect>

------------------------------------------
[...truncated 1.38 MB...]
INFO: TIMELINE: Query 20170915_081128_00017_n4nzz :: Transaction:[0e6d9ffe-830c-40e1-af09-edede4cb6c0c]
:: elapsed 173ms :: planning 54ms :: scheduling 119ms :: running 0ms :: finishing 119ms ::
begin 2017-09-15T08:11:28.186Z :: end 2017-09-15T08:11:28.359Z
- test and filter clause with greater than expression *** FAILED ***
  actualResult.toString().equals(expectedResult.toString()) was false (PrestoAllDataTypeTest.scala:223)
2017-09-15 08:11:28 INFO  PrestoServer$:101 - ***** executing the query ***** 
 SELECT ID,DATE,COUNTRY,NAME,PHONETYPE,SERIALNAME,SALARY,BONUS FROM TESTDB.TESTTABLE WHERE
BONUS>=1234.444 GROUP BY ID,DATE,COUNTRY,NAME,PHONETYPE,SERIALNAME,SALARY,BONUS ORDER BY
ID
Sep 15, 2017 8:11:28 AM io.airlift.log.Logger info
INFO: TIMELINE: Query 20170915_081128_00018_n4nzz :: Transaction:[04afb802-7cda-4bce-b4b4-e6080cbcee30]
:: elapsed 430ms :: planning 278ms :: scheduling 152ms :: running 0ms :: finishing 152ms ::
begin 2017-09-15T08:11:28.452Z :: end 2017-09-15T08:11:28.882Z
- test and filter clause with greater than equal to expression *** FAILED ***
  actualResult.toString().equals(expectedResult.toString()) was false (PrestoAllDataTypeTest.scala:267)
2017-09-15 08:11:29 INFO  PrestoServer$:101 - ***** executing the query ***** 
 SELECT ID,DATE,COUNTRY,NAME,PHONETYPE,SERIALNAME,SALARY,BONUS FROM TESTDB.TESTTABLE WHERE
BONUS<=1234.444 GROUP BY ID,DATE,COUNTRY,NAME,PHONETYPE,SERIALNAME,SALARY,BONUS ORDER BY
ID LIMIT 2
Sep 15, 2017 8:11:29 AM io.airlift.log.Logger info
INFO: TIMELINE: Query 20170915_081128_00019_n4nzz :: Transaction:[c0d871f9-a6a2-44b4-9e94-6d6ae05009ac]
:: elapsed 216ms :: planning 112ms :: scheduling 104ms :: running 0ms :: finishing 104ms ::
begin 2017-09-15T08:11:28.931Z :: end 2017-09-15T08:11:29.147Z
2017-09-15 08:11:29 INFO  PrestoServer$:101 - ***** executing the query ***** 
 SELECT ID FROM TESTDB.TESTTABLE WHERE BONUS=1234.444
- test and filter clause with less than equal to expression *** FAILED ***
  actualResult.toString().equals(expectedResult.toString()) was false (PrestoAllDataTypeTest.scala:292)
Sep 15, 2017 8:11:29 AM io.airlift.log.Logger info
INFO: TIMELINE: Query 20170915_081129_00020_n4nzz :: Transaction:[88475bec-f4f7-4911-a777-a317d711bcfc]
:: elapsed 193ms :: planning 90ms :: scheduling 103ms :: running 0ms :: finishing 103ms ::
begin 2017-09-15T08:11:29.180Z :: end 2017-09-15T08:11:29.373Z
Sep 15, 2017 8:11:29 AM io.airlift.log.Logger info
INFO: TIMELINE: Query 20170915_081129_00021_n4nzz :: Transaction:[2a808bbf-4da9-4692-a83c-49bc5cb8fe02]
:: elapsed 97ms :: planning 56ms :: scheduling 41ms :: running 0ms :: finishing 41ms :: begin
2017-09-15T08:11:29.412Z :: end 2017-09-15T08:11:29.509Z
2017-09-15 08:11:29 INFO  PrestoServer$:101 - ***** executing the query ***** 
 SELECT ID,DATE,COUNTRY,NAME,PHONETYPE,SERIALNAME,SALARY,BONUS FROM TESTDB.TESTTABLE WHERE
BONUS>1234 AND ID<2 GROUP BY ID,DATE,COUNTRY,NAME,PHONETYPE,SERIALNAME,SALARY,BONUS
ORDER BY ID
- test equal to expression on decimal value *** FAILED ***
  actualResult.equals(expectedResult) was false (PrestoAllDataTypeTest.scala:301)
- test less than expression with and operator *** FAILED ***
  actualResult.toString().equals(expectedResult.toString()) was false (PrestoAllDataTypeTest.scala:317)
2017-09-15 08:11:29 INFO  PrestoServer$:101 - ***** executing the query ***** 
 SELECT NAME from testdb.testtable WHERE PHONETYPE IN('phone1848','phone706')
Sep 15, 2017 8:11:29 AM io.airlift.log.Logger info
INFO: TIMELINE: Query 20170915_081129_00022_n4nzz :: Transaction:[be0ebb2d-2d4c-40ab-9376-fcff14ffff95]
:: elapsed 225ms :: planning 123ms :: scheduling 102ms :: running 0ms :: finishing 102ms ::
begin 2017-09-15T08:11:29.544Z :: end 2017-09-15T08:11:29.769Z
2017-09-15 08:11:30 INFO  PrestoServer$:101 - ***** executing the query ***** 
 SELECT NAME from testdb.testtable WHERE PHONETYPE NOT IN('phone1848','phone706')
Sep 15, 2017 8:11:30 AM io.airlift.log.Logger info
INFO: TIMELINE: Query 20170915_081129_00023_n4nzz :: Transaction:[dd890fd5-7542-4825-9fa9-830da063d1ba]
:: elapsed 705ms :: planning 673ms :: scheduling 32ms :: running 0ms :: finishing 32ms ::
begin 2017-09-15T08:11:29.828Z :: end 2017-09-15T08:11:30.533Z
- test the result for in clause *** FAILED ***
  actualResult.equals(expectedResult) was false (PrestoAllDataTypeTest.scala:327)
2017-09-15 08:11:30 INFO  PrestoServer$:101 - ***** executing the query ***** 
 SELECT ID FROM TESTDB.TESTTABLE WHERE DATE IS NULL
- test the result for not in clause *** FAILED ***
  actualResult.equals(expectedResult) was false (PrestoAllDataTypeTest.scala:341)
Sep 15, 2017 8:11:30 AM io.airlift.log.Logger info
INFO: TIMELINE: Query 20170915_081130_00024_n4nzz :: Transaction:[65cadd58-d148-49ae-a3a0-d9c43e24482c]
:: elapsed 108ms :: planning 79ms :: scheduling 29ms :: running 0ms :: finishing 29ms :: begin
2017-09-15T08:11:30.558Z :: end 2017-09-15T08:11:30.666Z
Sep 15, 2017 8:11:30 AM io.airlift.log.Logger info
INFO: TIMELINE: Query 20170915_081130_00025_n4nzz :: Transaction:[6d75dbf4-e040-413d-afe0-967872077e3f]
:: elapsed 82ms :: planning 51ms :: scheduling 31ms :: running 0ms :: finishing 31ms :: begin
2017-09-15T08:11:30.689Z :: end 2017-09-15T08:11:30.771Z
2017-09-15 08:11:30 INFO  PrestoServer$:101 - ***** executing the query ***** 
 SELECT NAME FROM TESTDB.TESTTABLE WHERE DATE IS NOT NULL AND ID=9
- test for null operator on date data type *** FAILED ***
  actualResult.equals(expectedResult) was false (PrestoAllDataTypeTest.scala:347)
2017-09-15 08:11:30 INFO  PrestoServer$:101 - ***** executing the query ***** 
 SELECT NAME FROM TESTDB.TESTTABLE WHERE DOB IS NOT NULL AND ID=9
Sep 15, 2017 8:11:30 AM io.airlift.log.Logger info
INFO: TIMELINE: Query 20170915_081130_00026_n4nzz :: Transaction:[7535455a-928d-487a-ae2c-32ed30bdee46]
:: elapsed 99ms :: planning 73ms :: scheduling 26ms :: running 0ms :: finishing 26ms :: begin
2017-09-15T08:11:30.799Z :: end 2017-09-15T08:11:30.898Z
- test for not null operator on date data type *** FAILED ***
  actualResult.equals(expectedResult) was false (PrestoAllDataTypeTest.scala:354)
Sep 15, 2017 8:11:31 AM io.airlift.log.Logger info
INFO: TIMELINE: Query 20170915_081130_00027_n4nzz :: Transaction:[73c158d3-0aa4-469c-b97f-0659deb13059]
:: elapsed 134ms :: planning 95ms :: scheduling 39ms :: running 0ms :: finishing 39ms :: begin
2017-09-15T08:11:30.921Z :: end 2017-09-15T08:11:31.055Z
2017-09-15 08:11:31 INFO  PrestoServer$:101 - ***** executing the query ***** 
 SELECT NAME FROM TESTDB.TESTTABLE WHERE DOB IS NULL AND ID=1
- test for not null operator on timestamp type *** FAILED ***
  actualResult.equals(expectedResult) was false (PrestoAllDataTypeTest.scala:362)
- test for null operator on timestamp type *** FAILED ***
  actualResult.equals(expectedResult) was false (PrestoAllDataTypeTest.scala:369)
Sep 15, 2017 8:11:31 AM io.airlift.log.Logger info
INFO: TIMELINE: Query 20170915_081131_00028_n4nzz :: Transaction:[8f9baf6e-f7b5-48b0-b946-ed7e5f05d505]
:: elapsed 91ms :: planning 61ms :: scheduling 30ms :: running 0ms :: finishing 30ms :: begin
2017-09-15T08:11:31.080Z :: end 2017-09-15T08:11:31.171Z
2017-09-15 08:11:31 INFO  PrestoServer$:101 - ***** executing the query ***** 
 SELECT DISTINCT SHORTFIELD from testdb.testtable ORDER BY SHORTFIELD 
2017-09-15 08:11:31 INFO  PrestoServer$:101 - ***** executing the query ***** 
 SELECT ID from testdb.testtable WHERE SHORTFIELD IS NULL ORDER BY SHORTFIELD 
- test the result for short datatype with order by clause *** FAILED ***
  actualResult.equals(expectedResult) was false (PrestoAllDataTypeTest.scala:385)
Sep 15, 2017 8:11:31 AM io.airlift.log.Logger info
INFO: TIMELINE: Query 20170915_081131_00029_n4nzz :: Transaction:[0a251fba-d124-4de3-b3a5-cf913d3366d6]
:: elapsed 156ms :: planning 49ms :: scheduling 107ms :: running 0ms :: finishing 107ms ::
begin 2017-09-15T08:11:31.200Z :: end 2017-09-15T08:11:31.356Z
2017-09-15 08:11:31 INFO  PrestoServer$:101 - ***** executing the query ***** 
 SELECT ID from testdb.testtable WHERE SHORTFIELD>11 
Sep 15, 2017 8:11:31 AM io.airlift.log.Logger info
INFO: TIMELINE: Query 20170915_081131_00030_n4nzz :: Transaction:[b4b5ae41-3462-4194-9ef3-9dc25ef83656]
:: elapsed 141ms :: planning 50ms :: scheduling 91ms :: running 0ms :: finishing 91ms :: begin
2017-09-15T08:11:31.372Z :: end 2017-09-15T08:11:31.513Z
- test the result for short datatype in clause where field is null *** FAILED ***
  actualResult.equals(expectedResult) was false (PrestoAllDataTypeTest.scala:393)
Sep 15, 2017 8:11:31 AM io.airlift.log.Logger info
INFO: TIMELINE: Query 20170915_081131_00031_n4nzz :: Transaction:[4937dabb-4df1-4f55-a55d-d13b81390787]
:: elapsed 78ms :: planning 54ms :: scheduling 24ms :: running 0ms :: finishing 24ms :: begin
2017-09-15T08:11:31.549Z :: end 2017-09-15T08:11:31.627Z
- test the result for short datatype with greater than operator *** FAILED ***
  actualResult.equals(expectedResult) was false (PrestoAllDataTypeTest.scala:401)
Sep 15, 2017 8:11:31 AM io.airlift.log.Logger info
INFO: Life cycle stopping...
Sep 15, 2017 8:11:31 AM org.eclipse.jetty.server.AbstractConnector doStop
INFO: Stopped http@4ef277ef{HTTP/1.1,[http/1.1, h2c, h2c-17, h2c-16, h2c-15, h2c-14]}{127.0.0.1:8086}
Sep 15, 2017 8:11:31 AM org.eclipse.jetty.server.handler.ContextHandler doStop
INFO: Stopped o.e.j.s.ServletContextHandler@2c51c756{/,null,UNAVAILABLE,@http}
Sep 15, 2017 8:11:31 AM org.eclipse.jetty.util.thread.QueuedThreadPool doStop
WARNING: http-worker{STOPPING,2<=14<=200,i=12,q=12} Couldn't stop Thread[http-worker-377,5,main]
Sep 15, 2017 8:11:31 AM org.eclipse.jetty.util.thread.QueuedThreadPool doStop
WARNING: http-worker{STOPPING,2<=14<=200,i=2,q=9} Couldn't stop Thread[http-worker-195,5,]
Sep 15, 2017 8:11:31 AM org.eclipse.jetty.util.thread.QueuedThreadPool doStop
WARNING: http-worker{STOPPING,2<=14<=200,i=0,q=9} Couldn't stop Thread[http-worker-387,5,]
Sep 15, 2017 8:11:31 AM io.airlift.log.Logger info
INFO: Life cycle stopped.
Sep 15, 2017 8:11:31 AM io.airlift.log.Logger info
INFO: Life cycle stopping...
Sep 15, 2017 8:11:31 AM org.eclipse.jetty.server.AbstractConnector doStop
INFO: Stopped http@31c0c7e5{HTTP/1.1,[http/1.1, h2c, h2c-17, h2c-16, h2c-15, h2c-14]}{127.0.0.1:44639}
Sep 15, 2017 8:11:31 AM org.eclipse.jetty.server.handler.ContextHandler doStop
INFO: Stopped o.e.j.s.ServletContextHandler@67f266bd{/,null,UNAVAILABLE,@http}
Sep 15, 2017 8:11:31 AM org.eclipse.jetty.util.thread.QueuedThreadPool doStop
WARNING: http-worker{STOPPING,2<=11<=200,i=10,q=10} Couldn't stop Thread[http-worker-139,5,]
Sep 15, 2017 8:11:31 AM org.eclipse.jetty.util.thread.QueuedThreadPool doStop
WARNING: http-worker{STOPPING,2<=11<=200,i=3,q=8} Couldn't stop Thread[http-worker-143,5,]
Sep 15, 2017 8:11:31 AM org.eclipse.jetty.util.thread.QueuedThreadPool doStop
WARNING: http-worker{STOPPING,2<=11<=200,i=0,q=7} Couldn't stop Thread[http-worker-297,5,]
Sep 15, 2017 8:11:31 AM io.airlift.log.Logger info
INFO: Life cycle stopped.
Sep 15, 2017 8:11:31 AM io.airlift.log.Logger info
INFO: Life cycle stopping...
Sep 15, 2017 8:11:31 AM org.eclipse.jetty.server.AbstractConnector doStop
INFO: Stopped http@4adcc981{HTTP/1.1,[http/1.1, h2c, h2c-17, h2c-16, h2c-15, h2c-14]}{127.0.0.1:45769}
Sep 15, 2017 8:11:31 AM org.eclipse.jetty.server.handler.ContextHandler doStop
INFO: Stopped o.e.j.s.ServletContextHandler@729d6ee2{/,null,UNAVAILABLE,@http}
Sep 15, 2017 8:11:31 AM org.eclipse.jetty.util.thread.QueuedThreadPool doStop
WARNING: http-worker{STOPPING,2<=9<=200,i=7,q=7} Couldn't stop Thread[http-worker-296,5,]
Sep 15, 2017 8:11:31 AM org.eclipse.jetty.util.thread.QueuedThreadPool doStop
WARNING: http-worker{STOPPING,2<=9<=200,i=0,q=6} Couldn't stop Thread[http-worker-105,5,]
Sep 15, 2017 8:11:31 AM org.eclipse.jetty.util.thread.QueuedThreadPool doStop
WARNING: http-worker{STOPPING,2<=9<=200,i=0,q=6} Couldn't stop Thread[http-worker-108,5,]
Sep 15, 2017 8:11:31 AM io.airlift.log.Logger info
INFO: Life cycle stopped.
Sep 15, 2017 8:11:31 AM io.airlift.log.Logger info
INFO: Life cycle stopping...
Sep 15, 2017 8:11:31 AM org.eclipse.jetty.server.AbstractConnector doStop
INFO: Stopped http@38929da{HTTP/1.1,[http/1.1, h2c, h2c-17, h2c-16, h2c-15, h2c-14]}{127.0.0.1:39549}
Sep 15, 2017 8:11:31 AM org.eclipse.jetty.server.handler.ContextHandler doStop
INFO: Stopped o.e.j.s.ServletContextHandler@1e6d30c0{/,null,UNAVAILABLE,@http}
Sep 15, 2017 8:11:31 AM org.eclipse.jetty.util.thread.QueuedThreadPool doStop
WARNING: http-worker{STOPPING,2<=10<=200,i=2,q=2} Couldn't stop Thread[http-worker-74,5,main]
Sep 15, 2017 8:11:31 AM org.eclipse.jetty.util.thread.QueuedThreadPool doStop
WARNING: http-worker{STOPPING,2<=10<=200,i=0,q=1} Couldn't stop Thread[http-worker-392,5,]
Sep 15, 2017 8:11:31 AM io.airlift.log.Logger info
INFO: Life cycle stopped.
Sep 15, 2017 8:11:31 AM io.airlift.log.Logger info
INFO: Life cycle stopping...
Sep 15, 2017 8:11:31 AM org.eclipse.jetty.server.AbstractConnector doStop
INFO: Stopped http@7da635c0{HTTP/1.1,[http/1.1, h2c, h2c-17, h2c-16, h2c-15, h2c-14]}{127.0.0.1:37211}
Sep 15, 2017 8:11:31 AM org.eclipse.jetty.server.handler.ContextHandler doStop
INFO: Stopped o.e.j.s.ServletContextHandler@3d615b2e{/,null,UNAVAILABLE,@http}
Sep 15, 2017 8:11:31 AM org.eclipse.jetty.util.thread.QueuedThreadPool doStop
WARNING: http-worker{STOPPING,2<=8<=200,i=3,q=2} Couldn't stop Thread[http-worker-393,5,main]
Sep 15, 2017 8:11:31 AM org.eclipse.jetty.util.thread.QueuedThreadPool doStop
WARNING: http-worker{STOPPING,2<=8<=200,i=0,q=1} Couldn't stop Thread[http-worker-80,5,]
Sep 15, 2017 8:11:31 AM io.airlift.log.Logger info
INFO: Life cycle stopped.
2017-09-15 08:11:31 INFO  PrestoServer$:88 - ***** Stopping The Server *****
Run completed in 38 seconds, 747 milliseconds.
Total number of tests run: 32
Suites: completed 2, aborted 0
Tests: succeeded 6, failed 26, canceled 0, ignored 0, pending 0
*** 26 TESTS FAILED ***
[JENKINS] Recording test results
[INFO] ------------------------------------------------------------------------
[INFO] Reactor Summary:
[INFO] 
[INFO] Apache CarbonData :: Parent ........................ SUCCESS [  9.631 s]
[INFO] Apache CarbonData :: Common ........................ SUCCESS [ 18.955 s]
[INFO] Apache CarbonData :: Core .......................... SUCCESS [03:18 min]
[INFO] Apache CarbonData :: Processing .................... SUCCESS [01:02 min]
[INFO] Apache CarbonData :: Hadoop ........................ SUCCESS [ 38.739 s]
[INFO] Apache CarbonData :: Spark Common .................. SUCCESS [02:11 min]
[INFO] Apache CarbonData :: Spark2 ........................ SUCCESS [07:50 min]
[INFO] Apache CarbonData :: Spark Common Test ............. SUCCESS [21:39 min]
[INFO] Apache CarbonData :: Assembly ...................... SUCCESS [ 10.081 s]
[INFO] Apache CarbonData :: Hive .......................... SUCCESS [01:00 min]
[INFO] Apache CarbonData :: presto ........................ FAILURE [02:14 min]
[INFO] Apache CarbonData :: Spark2 Examples ............... SKIPPED
[INFO] ------------------------------------------------------------------------
[INFO] BUILD FAILURE
[INFO] ------------------------------------------------------------------------
[INFO] Total time: 40:44 min
[INFO] Finished at: 2017-09-15T08:11:36+00:00
[INFO] Final Memory: 184M/1369M
[INFO] ------------------------------------------------------------------------
[ERROR] Failed to execute goal org.scalatest:scalatest-maven-plugin:1.0:test (test) on project
carbondata-presto: There are test failures -> [Help 1]
org.apache.maven.lifecycle.LifecycleExecutionException: Failed to execute goal org.scalatest:scalatest-maven-plugin:1.0:test
(test) on project carbondata-presto: There are test failures
	at org.apache.maven.lifecycle.internal.MojoExecutor.execute(MojoExecutor.java:212)
	at org.apache.maven.lifecycle.internal.MojoExecutor.execute(MojoExecutor.java:153)
	at org.apache.maven.lifecycle.internal.MojoExecutor.execute(MojoExecutor.java:145)
	at org.apache.maven.lifecycle.internal.LifecycleModuleBuilder.buildProject(LifecycleModuleBuilder.java:116)
	at org.apache.maven.lifecycle.internal.LifecycleModuleBuilder.buildProject(LifecycleModuleBuilder.java:80)
	at org.apache.maven.lifecycle.internal.builder.singlethreaded.SingleThreadedBuilder.build(SingleThreadedBuilder.java:51)
	at org.apache.maven.lifecycle.internal.LifecycleStarter.execute(LifecycleStarter.java:128)
	at org.apache.maven.DefaultMaven.doExecute(DefaultMaven.java:307)
	at org.apache.maven.DefaultMaven.doExecute(DefaultMaven.java:193)
	at org.apache.maven.DefaultMaven.execute(DefaultMaven.java:106)
	at org.jvnet.hudson.maven3.launcher.Maven33Launcher.main(Maven33Launcher.java:129)
	at sun.reflect.NativeMethodAccessorImpl.invoke0(Native Method)
	at sun.reflect.NativeMethodAccessorImpl.invoke(NativeMethodAccessorImpl.java:62)
	at sun.reflect.DelegatingMethodAccessorImpl.invoke(DelegatingMethodAccessorImpl.java:43)
	at java.lang.reflect.Method.invoke(Method.java:498)
	at org.codehaus.plexus.classworlds.launcher.Launcher.launchStandard(Launcher.java:330)
	at org.codehaus.plexus.classworlds.launcher.Launcher.launch(Launcher.java:238)
	at jenkins.maven3.agent.Maven33Main.launch(Maven33Main.java:176)
	at sun.reflect.NativeMethodAccessorImpl.invoke0(Native Method)
	at sun.reflect.NativeMethodAccessorImpl.invoke(NativeMethodAccessorImpl.java:62)
	at sun.reflect.DelegatingMethodAccessorImpl.invoke(DelegatingMethodAccessorImpl.java:43)
	at java.lang.reflect.Method.invoke(Method.java:498)
	at hudson.maven.Maven3Builder.call(Maven3Builder.java:139)
	at hudson.maven.Maven3Builder.call(Maven3Builder.java:70)
	at hudson.remoting.UserRequest.perform(UserRequest.java:153)
	at hudson.remoting.UserRequest.perform(UserRequest.java:50)
	at hudson.remoting.Request$2.run(Request.java:336)
	at hudson.remoting.InterceptingExecutorService$1.call(InterceptingExecutorService.java:68)
	at java.util.concurrent.FutureTask.run(FutureTask.java:266)
	at java.util.concurrent.ThreadPoolExecutor.runWorker(ThreadPoolExecutor.java:1149)
	at java.util.concurrent.ThreadPoolExecutor$Worker.run(ThreadPoolExecutor.java:624)
	at java.lang.Thread.run(Thread.java:748)
Caused by: org.apache.maven.plugin.MojoFailureException: There are test failures
	at org.scalatest.tools.maven.TestMojo.execute(TestMojo.java:107)
	at org.apache.maven.plugin.DefaultBuildPluginManager.executeMojo(DefaultBuildPluginManager.java:134)
	at org.apache.maven.lifecycle.internal.MojoExecutor.execute(MojoExecutor.java:207)
	... 31 more
[ERROR] 
[ERROR] Re-run Maven using the -X switch to enable full debug logging.
[ERROR] 
[ERROR] For more information about the errors and possible solutions, please read the following
articles:
[ERROR] [Help 1] http://cwiki.apache.org/confluence/display/MAVEN/MojoFailureException
[ERROR] 
[ERROR] After correcting the problems, you can resume the build with the command
[ERROR]   mvn <goals> -rf :carbondata-presto
Waiting for Jenkins to finish collecting data
[JENKINS] Archiving <https://builds.apache.org/job/carbondata-master-spark-2.1/ws/processing/pom.xml>
to org.apache.carbondata/carbondata-processing/1.2.0-SNAPSHOT/carbondata-processing-1.2.0-SNAPSHOT.pom
[JENKINS] Archiving <https://builds.apache.org/job/carbondata-master-spark-2.1/ws/processing/target/carbondata-processing-1.2.0-SNAPSHOT.jar>
to org.apache.carbondata/carbondata-processing/1.2.0-SNAPSHOT/carbondata-processing-1.2.0-SNAPSHOT.jar
[JENKINS] Archiving <https://builds.apache.org/job/carbondata-master-spark-2.1/ws/integration/spark2/pom.xml>
to org.apache.carbondata/carbondata-spark2/1.2.0-SNAPSHOT/carbondata-spark2-1.2.0-SNAPSHOT.pom
[JENKINS] Archiving <https://builds.apache.org/job/carbondata-master-spark-2.1/ws/integration/spark2/target/carbondata-spark2-1.2.0-SNAPSHOT.jar>
to org.apache.carbondata/carbondata-spark2/1.2.0-SNAPSHOT/carbondata-spark2-1.2.0-SNAPSHOT.jar
[JENKINS] Archiving <https://builds.apache.org/job/carbondata-master-spark-2.1/ws/assembly/pom.xml>
to org.apache.carbondata/carbondata-assembly/1.2.0-SNAPSHOT/carbondata-assembly-1.2.0-SNAPSHOT.pom
[JENKINS] Archiving <https://builds.apache.org/job/carbondata-master-spark-2.1/ws/integration/spark-common/pom.xml>
to org.apache.carbondata/carbondata-spark-common/1.2.0-SNAPSHOT/carbondata-spark-common-1.2.0-SNAPSHOT.pom
[JENKINS] Archiving <https://builds.apache.org/job/carbondata-master-spark-2.1/ws/integration/spark-common/target/carbondata-spark-common-1.2.0-SNAPSHOT.jar>
to org.apache.carbondata/carbondata-spark-common/1.2.0-SNAPSHOT/carbondata-spark-common-1.2.0-SNAPSHOT.jar
[JENKINS] Archiving <https://builds.apache.org/job/carbondata-master-spark-2.1/ws/pom.xml>
to org.apache.carbondata/carbondata-parent/1.2.0-SNAPSHOT/carbondata-parent-1.2.0-SNAPSHOT.pom
[JENKINS] Archiving <https://builds.apache.org/job/carbondata-master-spark-2.1/ws/core/pom.xml>
to org.apache.carbondata/carbondata-core/1.2.0-SNAPSHOT/carbondata-core-1.2.0-SNAPSHOT.pom
[JENKINS] Archiving <https://builds.apache.org/job/carbondata-master-spark-2.1/ws/core/target/carbondata-core-1.2.0-SNAPSHOT.jar>
to org.apache.carbondata/carbondata-core/1.2.0-SNAPSHOT/carbondata-core-1.2.0-SNAPSHOT.jar
[JENKINS] Archiving <https://builds.apache.org/job/carbondata-master-spark-2.1/ws/hadoop/pom.xml>
to org.apache.carbondata/carbondata-hadoop/1.2.0-SNAPSHOT/carbondata-hadoop-1.2.0-SNAPSHOT.pom
[JENKINS] Archiving <https://builds.apache.org/job/carbondata-master-spark-2.1/ws/hadoop/target/carbondata-hadoop-1.2.0-SNAPSHOT.jar>
to org.apache.carbondata/carbondata-hadoop/1.2.0-SNAPSHOT/carbondata-hadoop-1.2.0-SNAPSHOT.jar
[JENKINS] Archiving <https://builds.apache.org/job/carbondata-master-spark-2.1/ws/integration/presto/pom.xml>
to org.apache.carbondata/carbondata-presto/1.2.0-SNAPSHOT/carbondata-presto-1.2.0-SNAPSHOT.pom
[JENKINS] Archiving <https://builds.apache.org/job/carbondata-master-spark-2.1/ws/integration/hive/pom.xml>
to org.apache.carbondata/carbondata-hive/1.2.0-SNAPSHOT/carbondata-hive-1.2.0-SNAPSHOT.pom
[JENKINS] Archiving <https://builds.apache.org/job/carbondata-master-spark-2.1/ws/integration/hive/target/carbondata-hive-1.2.0-SNAPSHOT.jar>
to org.apache.carbondata/carbondata-hive/1.2.0-SNAPSHOT/carbondata-hive-1.2.0-SNAPSHOT.jar
[JENKINS] Archiving <https://builds.apache.org/job/carbondata-master-spark-2.1/ws/common/pom.xml>
to org.apache.carbondata/carbondata-common/1.2.0-SNAPSHOT/carbondata-common-1.2.0-SNAPSHOT.pom
[JENKINS] Archiving <https://builds.apache.org/job/carbondata-master-spark-2.1/ws/common/target/carbondata-common-1.2.0-SNAPSHOT.jar>
to org.apache.carbondata/carbondata-common/1.2.0-SNAPSHOT/carbondata-common-1.2.0-SNAPSHOT.jar
[JENKINS] Archiving <https://builds.apache.org/job/carbondata-master-spark-2.1/ws/integration/spark-common-test/pom.xml>
to org.apache.carbondata/carbondata-spark-common-test/1.2.0-SNAPSHOT/carbondata-spark-common-test-1.2.0-SNAPSHOT.pom
[JENKINS] Archiving <https://builds.apache.org/job/carbondata-master-spark-2.1/ws/integration/spark-common-test/target/carbondata-spark-common-test-1.2.0-SNAPSHOT.jar>
to org.apache.carbondata/carbondata-spark-common-test/1.2.0-SNAPSHOT/carbondata-spark-common-test-1.2.0-SNAPSHOT.jar
[JENKINS] Archiving <https://builds.apache.org/job/carbondata-master-spark-2.1/ws/examples/spark2/pom.xml>
to org.apache.carbondata/carbondata-examples-spark2/1.2.0-SNAPSHOT/carbondata-examples-spark2-1.2.0-SNAPSHOT.pom
Sending e-mails to: commits@carbondata.apache.org chenliang613@apache.org
channel stopped
Not sending mail to unregistered user ravi.pesala@gmail.com

Mime
View raw message