carbondata-commits mailing list archives

Site index · List index
Message view « Date » · « Thread »
Top « Date » · « Thread »
From Apache Jenkins Server <jenk...@builds.apache.org>
Subject Build failed in Jenkins: carbondata-master-spark-2.1 » Apache CarbonData :: presto #1380
Date Fri, 15 Sep 2017 04:41:52 GMT
See <https://builds.apache.org/job/carbondata-master-spark-2.1/org.apache.carbondata$carbondata-presto/1380/display/redirect>

------------------------------------------
[...truncated 173.64 KB...]
 SELECT COUNT(BONUS) AS RESULT FROM TESTDB.TESTTABLE 
- test the result for count()clause with distinct operator on decimal column in presto
Sep 15, 2017 4:41:07 AM io.airlift.log.Logger info
INFO: TIMELINE: Query 20170915_044107_00008_4vd7x :: Transaction:[f6690c9e-e2c4-4125-a7f4-d6de4a37d497]
:: elapsed 51ms :: planning 24ms :: scheduling 27ms :: running 0ms :: finishing 27ms :: begin
2017-09-15T04:41:07.108Z :: end 2017-09-15T04:41:07.159Z
- test the result for count()clause with out  distinct operator on decimal column in
presto
2017-09-15 04:41:07 INFO  PrestoServer$:101 - ***** executing the query ***** 
 SELECT SUM(DISTINCT BONUS) AS RESULT FROM TESTDB.TESTTABLE 
- test the result for sum()with out distinct operator for decimal column in presto
2017-09-15 04:41:07 INFO  PrestoServer$:101 - ***** executing the query ***** 
 SELECT SUM(DISTINCT BONUS) AS RESULT FROM TESTDB.TESTTABLE 
Sep 15, 2017 4:41:07 AM io.airlift.log.Logger info
INFO: TIMELINE: Query 20170915_044107_00009_4vd7x :: Transaction:[6e27847c-1570-4a36-ac92-381f0687ce9e]
:: elapsed 140ms :: planning 38ms :: scheduling 102ms :: running 0ms :: finishing 102ms ::
begin 2017-09-15T04:41:07.173Z :: end 2017-09-15T04:41:07.313Z
2017-09-15 04:41:07 INFO  PrestoServer$:101 - ***** executing the query ***** 
 SELECT AVG(DISTINCT BONUS) AS RESULT FROM TESTDB.TESTTABLE 
Sep 15, 2017 4:41:07 AM io.airlift.log.Logger info
INFO: TIMELINE: Query 20170915_044107_00010_4vd7x :: Transaction:[856627fd-00f2-42e8-b02c-4d76aec8e078]
:: elapsed 105ms :: planning 28ms :: scheduling 77ms :: running 0ms :: finishing 77ms :: begin
2017-09-15T04:41:07.328Z :: end 2017-09-15T04:41:07.433Z
- test the result for sum() with distinct operator for decimal column in presto *** FAILED
***
  java.lang.NullPointerException:
  at org.apache.carbondata.presto.integrationtest.PrestoAllDataTypeTest$$anonfun$11.apply$mcV$sp(PrestoAllDataTypeTest.scala:115)
  at org.apache.carbondata.presto.integrationtest.PrestoAllDataTypeTest$$anonfun$11.apply(PrestoAllDataTypeTest.scala:110)
  at org.apache.carbondata.presto.integrationtest.PrestoAllDataTypeTest$$anonfun$11.apply(PrestoAllDataTypeTest.scala:110)
  at org.scalatest.Transformer$$anonfun$apply$1.apply$mcV$sp(Transformer.scala:22)
  at org.scalatest.OutcomeOf$class.outcomeOf(OutcomeOf.scala:85)
  at org.scalatest.OutcomeOf$.outcomeOf(OutcomeOf.scala:104)
  at org.scalatest.Transformer.apply(Transformer.scala:22)
  at org.scalatest.Transformer.apply(Transformer.scala:20)
  at org.scalatest.FunSuiteLike$$anon$1.apply(FunSuiteLike.scala:166)
  at org.scalatest.Suite$class.withFixture(Suite.scala:1122)
  ...
- test the result for avg() with distinct operator on decimal coin presto
2017-09-15 04:41:07 INFO  PrestoServer$:101 - ***** executing the query ***** 
 SELECT MIN(BONUS) AS RESULT FROM TESTDB.TESTTABLE 
Sep 15, 2017 4:41:07 AM io.airlift.log.Logger info
INFO: TIMELINE: Query 20170915_044107_00011_4vd7x :: Transaction:[0a77eaff-e688-4698-9eba-19a03f11e16c]
:: elapsed 93ms :: planning 37ms :: scheduling 56ms :: running 0ms :: finishing 56ms :: begin
2017-09-15T04:41:07.447Z :: end 2017-09-15T04:41:07.540Z
- test the result for min() with distinct operator in decimalType of presto
Sep 15, 2017 4:41:07 AM io.airlift.log.Logger info
INFO: TIMELINE: Query 20170915_044107_00012_4vd7x :: Transaction:[97aecad4-9f8d-45a1-8cae-f097081417c0]
:: elapsed 85ms :: planning 40ms :: scheduling 45ms :: running 0ms :: finishing 45ms :: begin
2017-09-15T04:41:07.552Z :: end 2017-09-15T04:41:07.637Z
2017-09-15 04:41:07 INFO  PrestoServer$:101 - ***** executing the query ***** 
 SELECT MAX(BONUS) AS RESULT FROM TESTDB.TESTTABLE 
Sep 15, 2017 4:41:07 AM io.airlift.log.Logger info
INFO: TIMELINE: Query 20170915_044107_00013_4vd7x :: Transaction:[ac86bba0-46f3-41ca-871a-f533dc7dabd3]
:: elapsed 73ms :: planning 34ms :: scheduling 39ms :: running 0ms :: finishing 39ms :: begin
2017-09-15T04:41:07.648Z :: end 2017-09-15T04:41:07.721Z
- test the result for max() with distinct operator in decimalType of presto
2017-09-15 04:41:07 INFO  PrestoServer$:101 - ***** executing the query ***** 
 SELECT DISTINCT BONUS FROM TESTDB.TESTTABLE ORDER BY BONUS limit 3 
2017-09-15 04:41:07 INFO  PrestoServer$:101 - ***** executing the query ***** 
 SELECT NAME FROM TESTDB.TESTTABLE ORDER BY NAME
- select decimal data type with ORDER BY  clause *** FAILED ***
  actualResult.equals(expectedResult) was false (PrestoAllDataTypeTest.scala:147)
Sep 15, 2017 4:41:07 AM io.airlift.log.Logger info
INFO: TIMELINE: Query 20170915_044107_00014_4vd7x :: Transaction:[e4bde44d-d97d-461a-b959-356191c9d4c0]
:: elapsed 116ms :: planning 30ms :: scheduling 86ms :: running 0ms :: finishing 86ms :: begin
2017-09-15T04:41:07.747Z :: end 2017-09-15T04:41:07.863Z
2017-09-15 04:41:07 INFO  PrestoServer$:101 - ***** executing the query ***** 
 SELECT DATE FROM TESTDB.TESTTABLE ORDER BY DATE
- select string type with order by clause *** FAILED ***
  actualResult.equals(expectedResult) was false (PrestoAllDataTypeTest.scala:162)
Sep 15, 2017 4:41:07 AM io.airlift.log.Logger info
INFO: TIMELINE: Query 20170915_044107_00015_4vd7x :: Transaction:[076462c5-41d6-44a4-9c71-0ae6b27bdeb1]
:: elapsed 87ms :: planning 38ms :: scheduling 49ms :: running 0ms :: finishing 49ms :: begin
2017-09-15T04:41:07.879Z :: end 2017-09-15T04:41:07.966Z
2017-09-15 04:41:08 INFO  PrestoServer$:101 - ***** executing the query ***** 
 SELECT DISTINCT ID FROM TESTDB.TESTTABLE ORDER BY ID
Sep 15, 2017 4:41:08 AM io.airlift.log.Logger info
INFO: TIMELINE: Query 20170915_044107_00016_4vd7x :: Transaction:[47f1c877-ba46-4971-b39b-3557053de3c5]
:: elapsed 39ms :: planning 23ms :: scheduling 16ms :: running 0ms :: finishing 16ms :: begin
2017-09-15T04:41:07.983Z :: end 2017-09-15T04:41:08.022Z
- select DATE type with order by clause *** FAILED ***
  java.util.NoSuchElementException: head of empty list
  at scala.collection.immutable.Nil$.head(List.scala:420)
  at scala.collection.immutable.Nil$.head(List.scala:417)
  at org.apache.carbondata.presto.integrationtest.PrestoAllDataTypeTest$$anonfun$17.apply$mcV$sp(PrestoAllDataTypeTest.scala:182)
  at org.apache.carbondata.presto.integrationtest.PrestoAllDataTypeTest$$anonfun$17.apply(PrestoAllDataTypeTest.scala:164)
  at org.apache.carbondata.presto.integrationtest.PrestoAllDataTypeTest$$anonfun$17.apply(PrestoAllDataTypeTest.scala:164)
  at org.scalatest.Transformer$$anonfun$apply$1.apply$mcV$sp(Transformer.scala:22)
  at org.scalatest.OutcomeOf$class.outcomeOf(OutcomeOf.scala:85)
  at org.scalatest.OutcomeOf$.outcomeOf(OutcomeOf.scala:104)
  at org.scalatest.Transformer.apply(Transformer.scala:22)
  at org.scalatest.Transformer.apply(Transformer.scala:20)
  ...
2017-09-15 04:41:08 INFO  PrestoServer$:101 - ***** executing the query ***** 
 SELECT ID,DATE,COUNTRY,NAME,PHONETYPE,SERIALNAME,SALARY,BONUS FROM TESTDB.TESTTABLE WHERE
BONUS>1234 AND ID>2 GROUP BY ID,DATE,COUNTRY,NAME,PHONETYPE,SERIALNAME,SALARY,BONUS
ORDER BY ID
- select int type with order by clause *** FAILED ***
  actualResult.equals(expectedResult) was false (PrestoAllDataTypeTest.scala:197)
Sep 15, 2017 4:41:08 AM io.airlift.log.Logger info
INFO: TIMELINE: Query 20170915_044108_00017_4vd7x :: Transaction:[ec7585f3-7446-4ba2-8117-4ec4d32ccfe0]
:: elapsed 67ms :: planning 25ms :: scheduling 42ms :: running 0ms :: finishing 42ms :: begin
2017-09-15T04:41:08.040Z :: end 2017-09-15T04:41:08.107Z
2017-09-15 04:41:08 INFO  PrestoServer$:101 - ***** executing the query ***** 
 SELECT ID,DATE,COUNTRY,NAME,PHONETYPE,SERIALNAME,SALARY,BONUS FROM TESTDB.TESTTABLE WHERE
BONUS>=1234.444 GROUP BY ID,DATE,COUNTRY,NAME,PHONETYPE,SERIALNAME,SALARY,BONUS ORDER BY
ID
- test and filter clause with greater than expression *** FAILED ***
  actualResult.toString().equals(expectedResult.toString()) was false (PrestoAllDataTypeTest.scala:223)
Sep 15, 2017 4:41:08 AM io.airlift.log.Logger info
INFO: TIMELINE: Query 20170915_044108_00018_4vd7x :: Transaction:[63320172-b80f-43ca-8822-18da0ce8c393]
:: elapsed 175ms :: planning 111ms :: scheduling 64ms :: running 0ms :: finishing 64ms ::
begin 2017-09-15T04:41:08.147Z :: end 2017-09-15T04:41:08.322Z
- test and filter clause with greater than equal to expression *** FAILED ***
  actualResult.toString().equals(expectedResult.toString()) was false (PrestoAllDataTypeTest.scala:267)
2017-09-15 04:41:08 INFO  PrestoServer$:101 - ***** executing the query ***** 
 SELECT ID,DATE,COUNTRY,NAME,PHONETYPE,SERIALNAME,SALARY,BONUS FROM TESTDB.TESTTABLE WHERE
BONUS<=1234.444 GROUP BY ID,DATE,COUNTRY,NAME,PHONETYPE,SERIALNAME,SALARY,BONUS ORDER BY
ID LIMIT 2
Sep 15, 2017 4:41:08 AM io.airlift.log.Logger info
INFO: TIMELINE: Query 20170915_044108_00019_4vd7x :: Transaction:[5089f224-3c92-4030-a7ab-c8f95e63eb3f]
:: elapsed 115ms :: planning 57ms :: scheduling 58ms :: running 0ms :: finishing 58ms :: begin
2017-09-15T04:41:08.349Z :: end 2017-09-15T04:41:08.464Z
- test and filter clause with less than equal to expression *** FAILED ***
  actualResult.toString().equals(expectedResult.toString()) was false (PrestoAllDataTypeTest.scala:292)
2017-09-15 04:41:08 INFO  PrestoServer$:101 - ***** executing the query ***** 
 SELECT ID FROM TESTDB.TESTTABLE WHERE BONUS=1234.444
Sep 15, 2017 4:41:08 AM io.airlift.log.Logger info
INFO: TIMELINE: Query 20170915_044108_00020_4vd7x :: Transaction:[2e795869-98b3-42bc-9ea4-a3503d2e0d32]
:: elapsed 124ms :: planning 43ms :: scheduling 81ms :: running 0ms :: finishing 81ms :: begin
2017-09-15T04:41:08.487Z :: end 2017-09-15T04:41:08.611Z
Sep 15, 2017 4:41:08 AM io.airlift.log.Logger info
INFO: TIMELINE: Query 20170915_044108_00021_4vd7x :: Transaction:[1570afc0-89ec-4b4e-b172-67112bf9dc97]
:: elapsed 61ms :: planning 37ms :: scheduling 24ms :: running 0ms :: finishing 24ms :: begin
2017-09-15T04:41:08.627Z :: end 2017-09-15T04:41:08.688Z
- test equal to expression on decimal value *** FAILED ***
  actualResult.equals(expectedResult) was false (PrestoAllDataTypeTest.scala:301)
2017-09-15 04:41:08 INFO  PrestoServer$:101 - ***** executing the query ***** 
 SELECT ID,DATE,COUNTRY,NAME,PHONETYPE,SERIALNAME,SALARY,BONUS FROM TESTDB.TESTTABLE WHERE
BONUS>1234 AND ID<2 GROUP BY ID,DATE,COUNTRY,NAME,PHONETYPE,SERIALNAME,SALARY,BONUS
ORDER BY ID
2017-09-15 04:41:08 INFO  PrestoServer$:101 - ***** executing the query ***** 
 SELECT NAME from testdb.testtable WHERE PHONETYPE IN('phone1848','phone706')
- test less than expression with and operator *** FAILED ***
  actualResult.toString().equals(expectedResult.toString()) was false (PrestoAllDataTypeTest.scala:317)
Sep 15, 2017 4:41:08 AM io.airlift.log.Logger info
INFO: TIMELINE: Query 20170915_044108_00022_4vd7x :: Transaction:[ad5261dd-b0a2-4544-933e-d03940f375f8]
:: elapsed 152ms :: planning 73ms :: scheduling 79ms :: running 0ms :: finishing 79ms :: begin
2017-09-15T04:41:08.707Z :: end 2017-09-15T04:41:08.859Z
- test the result for in clause *** FAILED ***
  actualResult.equals(expectedResult) was false (PrestoAllDataTypeTest.scala:327)
2017-09-15 04:41:09 INFO  PrestoServer$:101 - ***** executing the query ***** 
 SELECT NAME from testdb.testtable WHERE PHONETYPE NOT IN('phone1848','phone706')
Sep 15, 2017 4:41:09 AM io.airlift.log.Logger info
INFO: TIMELINE: Query 20170915_044108_00023_4vd7x :: Transaction:[d5a6ed47-c5c5-4918-9e97-8c51917d6c2b]
:: elapsed 380ms :: planning 358ms :: scheduling 22ms :: running 0ms :: finishing 22ms ::
begin 2017-09-15T04:41:08.879Z :: end 2017-09-15T04:41:09.259Z
- test the result for not in clause *** FAILED ***
  actualResult.equals(expectedResult) was false (PrestoAllDataTypeTest.scala:341)
2017-09-15 04:41:09 INFO  PrestoServer$:101 - ***** executing the query ***** 
 SELECT ID FROM TESTDB.TESTTABLE WHERE DATE IS NULL
Sep 15, 2017 4:41:09 AM io.airlift.log.Logger info
INFO: TIMELINE: Query 20170915_044109_00024_4vd7x :: Transaction:[caea12d5-348a-45b0-a7cf-122eea40fc1e]
:: elapsed 73ms :: planning 54ms :: scheduling 19ms :: running 0ms :: finishing 19ms :: begin
2017-09-15T04:41:09.274Z :: end 2017-09-15T04:41:09.347Z
Sep 15, 2017 4:41:09 AM io.airlift.log.Logger info
INFO: TIMELINE: Query 20170915_044109_00025_4vd7x :: Transaction:[44e13a33-699e-4b60-8c9e-22a171746922]
:: elapsed 53ms :: planning 27ms :: scheduling 26ms :: running 0ms :: finishing 26ms :: begin
2017-09-15T04:41:09.367Z :: end 2017-09-15T04:41:09.420Z
2017-09-15 04:41:09 INFO  PrestoServer$:101 - ***** executing the query ***** 
 SELECT NAME FROM TESTDB.TESTTABLE WHERE DATE IS NOT NULL AND ID=9
- test for null operator on date data type *** FAILED ***
  actualResult.equals(expectedResult) was false (PrestoAllDataTypeTest.scala:347)
Sep 15, 2017 4:41:09 AM io.airlift.log.Logger info
INFO: TIMELINE: Query 20170915_044109_00026_4vd7x :: Transaction:[ff396614-1d19-4a46-bf7a-ffd099ee2d9d]
:: elapsed 72ms :: planning 58ms :: scheduling 14ms :: running 0ms :: finishing 14ms :: begin
2017-09-15T04:41:09.432Z :: end 2017-09-15T04:41:09.504Z
- test for not null operator on date data type *** FAILED ***
  actualResult.equals(expectedResult) was false (PrestoAllDataTypeTest.scala:354)
2017-09-15 04:41:09 INFO  PrestoServer$:101 - ***** executing the query ***** 
 SELECT NAME FROM TESTDB.TESTTABLE WHERE DOB IS NOT NULL AND ID=9
- test for not null operator on timestamp type *** FAILED ***
  actualResult.equals(expectedResult) was false (PrestoAllDataTypeTest.scala:362)
2017-09-15 04:41:09 INFO  PrestoServer$:101 - ***** executing the query ***** 
 SELECT NAME FROM TESTDB.TESTTABLE WHERE DOB IS NULL AND ID=1
Sep 15, 2017 4:41:09 AM io.airlift.log.Logger info
INFO: TIMELINE: Query 20170915_044109_00027_4vd7x :: Transaction:[9688c0bb-9143-4a43-9915-868dc0e702ae]
:: elapsed 47ms :: planning 34ms :: scheduling 13ms :: running 0ms :: finishing 13ms :: begin
2017-09-15T04:41:09.518Z :: end 2017-09-15T04:41:09.565Z
Sep 15, 2017 4:41:09 AM io.airlift.log.Logger info
INFO: TIMELINE: Query 20170915_044109_00028_4vd7x :: Transaction:[b8904b01-663a-4409-b573-a9f6b5adccdf]
:: elapsed 46ms :: planning 29ms :: scheduling 17ms :: running 0ms :: finishing 17ms :: begin
2017-09-15T04:41:09.578Z :: end 2017-09-15T04:41:09.624Z
- test for null operator on timestamp type *** FAILED ***
  actualResult.equals(expectedResult) was false (PrestoAllDataTypeTest.scala:369)
2017-09-15 04:41:09 INFO  PrestoServer$:101 - ***** executing the query ***** 
 SELECT DISTINCT SHORTFIELD from testdb.testtable ORDER BY SHORTFIELD 
- test the result for short datatype with order by clause *** FAILED ***
  actualResult.equals(expectedResult) was false (PrestoAllDataTypeTest.scala:385)
2017-09-15 04:41:09 INFO  PrestoServer$:101 - ***** executing the query ***** 
 SELECT ID from testdb.testtable WHERE SHORTFIELD IS NULL ORDER BY SHORTFIELD 
Sep 15, 2017 4:41:09 AM io.airlift.log.Logger info
INFO: TIMELINE: Query 20170915_044109_00029_4vd7x :: Transaction:[c059bf41-2fff-4e24-a3d5-978b1a5cd2f0]
:: elapsed 132ms :: planning 25ms :: scheduling 107ms :: running 0ms :: finishing 107ms ::
begin 2017-09-15T04:41:09.640Z :: end 2017-09-15T04:41:09.772Z
- test the result for short datatype in clause where field is null *** FAILED ***
  actualResult.equals(expectedResult) was false (PrestoAllDataTypeTest.scala:393)
Sep 15, 2017 4:41:09 AM io.airlift.log.Logger info
INFO: TIMELINE: Query 20170915_044109_00030_4vd7x :: Transaction:[cfe360eb-8b04-4209-b9e0-af313efeb92b]
:: elapsed 44ms :: planning 30ms :: scheduling 14ms :: running 0ms :: finishing 14ms :: begin
2017-09-15T04:41:09.784Z :: end 2017-09-15T04:41:09.828Z
2017-09-15 04:41:09 INFO  PrestoServer$:101 - ***** executing the query ***** 
 SELECT ID from testdb.testtable WHERE SHORTFIELD>11 
Sep 15, 2017 4:41:09 AM io.airlift.log.Logger info
INFO: TIMELINE: Query 20170915_044109_00031_4vd7x :: Transaction:[22c1ac41-3fd9-4887-9fe3-a07f79626501]
:: elapsed 46ms :: planning 32ms :: scheduling 14ms :: running 0ms :: finishing 14ms :: begin
2017-09-15T04:41:09.840Z :: end 2017-09-15T04:41:09.886Z
- test the result for short datatype with greater than operator *** FAILED ***
  actualResult.equals(expectedResult) was false (PrestoAllDataTypeTest.scala:401)
Sep 15, 2017 4:41:09 AM io.airlift.log.Logger info
INFO: Life cycle stopping...
Sep 15, 2017 4:41:09 AM org.eclipse.jetty.server.AbstractConnector doStop
INFO: Stopped http@4ef277ef{HTTP/1.1,[http/1.1, h2c, h2c-17, h2c-16, h2c-15, h2c-14]}{127.0.0.1:8086}
Sep 15, 2017 4:41:09 AM org.eclipse.jetty.server.handler.ContextHandler doStop
INFO: Stopped o.e.j.s.ServletContextHandler@2c51c756{/,null,UNAVAILABLE,@http}
Sep 15, 2017 4:41:09 AM org.eclipse.jetty.util.thread.QueuedThreadPool doStop
WARNING: http-worker{STOPPING,2<=16<=200,i=11,q=11} Couldn't stop Thread[http-worker-354,5,main]
Sep 15, 2017 4:41:09 AM org.eclipse.jetty.util.thread.QueuedThreadPool doStop
WARNING: http-worker{STOPPING,2<=16<=200,i=8,q=11} Couldn't stop Thread[http-worker-211,5,]
Sep 15, 2017 4:41:09 AM org.eclipse.jetty.util.thread.QueuedThreadPool doStop
WARNING: http-worker{STOPPING,2<=16<=200,i=4,q=10} Couldn't stop Thread[http-worker-378,5,]
Sep 15, 2017 4:41:09 AM org.eclipse.jetty.util.thread.QueuedThreadPool doStop
WARNING: http-worker{STOPPING,2<=16<=200,i=0,q=10} Couldn't stop Thread[http-worker-379,5,]
Sep 15, 2017 4:41:09 AM io.airlift.log.Logger info
INFO: Life cycle stopped.
Sep 15, 2017 4:41:09 AM io.airlift.log.Logger info
INFO: Life cycle stopping...
Sep 15, 2017 4:41:09 AM org.eclipse.jetty.server.AbstractConnector doStop
INFO: Stopped http@31c0c7e5{HTTP/1.1,[http/1.1, h2c, h2c-17, h2c-16, h2c-15, h2c-14]}{127.0.0.1:44323}
Sep 15, 2017 4:41:09 AM org.eclipse.jetty.server.handler.ContextHandler doStop
INFO: Stopped o.e.j.s.ServletContextHandler@67f266bd{/,null,UNAVAILABLE,@http}
Sep 15, 2017 4:41:09 AM org.eclipse.jetty.util.thread.QueuedThreadPool doStop
WARNING: http-worker{STOPPING,2<=12<=200,i=10,q=9} Couldn't stop Thread[http-worker-400,5,]
Sep 15, 2017 4:41:09 AM org.eclipse.jetty.util.thread.QueuedThreadPool doStop
WARNING: http-worker{STOPPING,2<=12<=200,i=2,q=9} Couldn't stop Thread[http-worker-153,5,]
Sep 15, 2017 4:41:09 AM org.eclipse.jetty.util.thread.QueuedThreadPool doStop
WARNING: http-worker{STOPPING,2<=12<=200,i=0,q=8} Couldn't stop Thread[http-worker-408,5,]
Sep 15, 2017 4:41:09 AM io.airlift.log.Logger info
INFO: Life cycle stopped.
Sep 15, 2017 4:41:09 AM io.airlift.log.Logger info
INFO: Life cycle stopping...
Sep 15, 2017 4:41:09 AM org.eclipse.jetty.server.AbstractConnector doStop
INFO: Stopped http@4adcc981{HTTP/1.1,[http/1.1, h2c, h2c-17, h2c-16, h2c-15, h2c-14]}{127.0.0.1:42032}
Sep 15, 2017 4:41:09 AM org.eclipse.jetty.server.handler.ContextHandler doStop
INFO: Stopped o.e.j.s.ServletContextHandler@729d6ee2{/,null,UNAVAILABLE,@http}
Sep 15, 2017 4:41:09 AM org.eclipse.jetty.util.thread.QueuedThreadPool doStop
WARNING: http-worker{STOPPING,2<=13<=200,i=11,q=10} Couldn't stop Thread[http-worker-412,5,main]
Sep 15, 2017 4:41:09 AM org.eclipse.jetty.util.thread.QueuedThreadPool doStop
WARNING: http-worker{STOPPING,2<=13<=200,i=6,q=10} Couldn't stop Thread[http-worker-304,5,]
Sep 15, 2017 4:41:09 AM org.eclipse.jetty.util.thread.QueuedThreadPool doStop
WARNING: http-worker{STOPPING,2<=13<=200,i=0,q=7} Couldn't stop Thread[http-worker-411,5,]
Sep 15, 2017 4:41:09 AM io.airlift.log.Logger info
INFO: Life cycle stopped.
Sep 15, 2017 4:41:09 AM io.airlift.log.Logger info
INFO: Life cycle stopping...
Sep 15, 2017 4:41:09 AM org.eclipse.jetty.server.AbstractConnector doStop
INFO: Stopped http@38929da{HTTP/1.1,[http/1.1, h2c, h2c-17, h2c-16, h2c-15, h2c-14]}{127.0.0.1:44569}
2017-09-15 04:41:12 INFO  AbstractDataLoadProcessorStep:150 - Thread-4 Rows processed in step
Input Processor : 10
2017-09-15 04:41:12 INFO  AbstractDataLoadProcessorStep:150 - Thread-2 Rows processed in step
Data Writer : 10
2017-09-15 04:41:12 INFO  AbstractDataLoadProcessorStep:150 - Thread-3 Rows processed in step
Data Converter : 10
Sep 15, 2017 4:41:14 AM org.eclipse.jetty.server.handler.ContextHandler doStop
INFO: Stopped o.e.j.s.ServletContextHandler@1e6d30c0{/,null,UNAVAILABLE,@http}
Sep 15, 2017 4:41:14 AM org.eclipse.jetty.util.thread.QueuedThreadPool doStop
WARNING: http-worker{STOPPING,2<=13<=200,i=10,q=11} Couldn't stop Thread[http-worker-415,5,main]
Sep 15, 2017 4:41:14 AM org.eclipse.jetty.util.thread.QueuedThreadPool doStop
WARNING: http-worker{STOPPING,2<=13<=200,i=3,q=10} Couldn't stop Thread[http-worker-353,5,]
Sep 15, 2017 4:41:14 AM org.eclipse.jetty.util.thread.QueuedThreadPool doStop
WARNING: http-worker{STOPPING,2<=13<=200,i=2,q=9} Couldn't stop Thread[http-worker-403,5,]
Sep 15, 2017 4:41:14 AM org.eclipse.jetty.util.thread.QueuedThreadPool doStop
WARNING: http-worker{STOPPING,2<=13<=200,i=2,q=9} Couldn't stop Thread[http-worker-414,5,main]
Sep 15, 2017 4:41:14 AM io.airlift.log.Logger info
INFO: Life cycle stopped.
Sep 15, 2017 4:41:14 AM io.airlift.log.Logger info
INFO: Life cycle stopping...
Sep 15, 2017 4:41:14 AM org.eclipse.jetty.server.AbstractConnector doStop
INFO: Stopped http@7da635c0{HTTP/1.1,[http/1.1, h2c, h2c-17, h2c-16, h2c-15, h2c-14]}{127.0.0.1:34502}
Sep 15, 2017 4:41:14 AM org.eclipse.jetty.server.handler.ContextHandler doStop
INFO: Stopped o.e.j.s.ServletContextHandler@3d615b2e{/,null,UNAVAILABLE,@http}
Sep 15, 2017 4:41:14 AM org.eclipse.jetty.util.thread.QueuedThreadPool doStop
WARNING: http-worker{STOPPING,2<=10<=200,i=8,q=8} Couldn't stop Thread[http-worker-416,5,main]
Sep 15, 2017 4:41:14 AM org.eclipse.jetty.util.thread.QueuedThreadPool doStop
WARNING: http-worker{STOPPING,2<=10<=200,i=6,q=7} Couldn't stop Thread[http-worker-45,5,main]
Sep 15, 2017 4:41:14 AM org.eclipse.jetty.util.thread.QueuedThreadPool doStop
WARNING: http-worker{STOPPING,2<=10<=200,i=5,q=7} Couldn't stop Thread[http-worker-43,5,main]
Sep 15, 2017 4:41:14 AM org.eclipse.jetty.util.thread.QueuedThreadPool doStop
WARNING: http-worker{STOPPING,2<=10<=200,i=2,q=7} Couldn't stop Thread[http-worker-417,5,main]
Sep 15, 2017 4:41:14 AM org.eclipse.jetty.util.thread.QueuedThreadPool doStop
WARNING: http-worker{STOPPING,2<=10<=200,i=2,q=7} Couldn't stop Thread[http-worker-418,5,main]
Sep 15, 2017 4:41:14 AM io.airlift.log.Logger info
INFO: Life cycle stopped.
2017-09-15 04:41:14 INFO  PrestoServer$:88 - ***** Stopping The Server *****
Run completed in 22 seconds, 950 milliseconds.
Total number of tests run: 32
Suites: completed 2, aborted 0
Tests: succeeded 6, failed 26, canceled 0, ignored 0, pending 0
*** 26 TESTS FAILED ***
[JENKINS] Recording test results

Mime
View raw message