carbondata-commits mailing list archives

Site index · List index
Message view « Date » · « Thread »
Top « Date » · « Thread »
From Apache Jenkins Server <jenk...@builds.apache.org>
Subject Build failed in Jenkins: carbondata-master-spark-2.1 » Apache CarbonData :: presto #1383
Date Fri, 15 Sep 2017 08:51:36 GMT
See <https://builds.apache.org/job/carbondata-master-spark-2.1/org.apache.carbondata$carbondata-presto/1383/display/redirect>

------------------------------------------
[...truncated 174.40 KB...]
2017-09-15 08:50:53 INFO  PrestoServer$:101 - ***** executing the query ***** 
 SELECT SUM(DISTINCT BONUS) AS RESULT FROM TESTDB.TESTTABLE 
Sep 15, 2017 8:50:53 AM io.airlift.log.Logger info
INFO: TIMELINE: Query 20170915_085053_00009_6c8cn :: Transaction:[23dc290c-79cd-46ba-83ac-0019d11ba04a]
:: elapsed 175ms :: planning 35ms :: scheduling 140ms :: running 0ms :: finishing 140ms ::
begin 2017-09-15T08:50:53.395Z :: end 2017-09-15T08:50:53.570Z
2017-09-15 08:50:53 INFO  PrestoServer$:101 - ***** executing the query ***** 
 SELECT AVG(DISTINCT BONUS) AS RESULT FROM TESTDB.TESTTABLE 
Sep 15, 2017 8:50:53 AM io.airlift.log.Logger info
INFO: TIMELINE: Query 20170915_085053_00010_6c8cn :: Transaction:[e064d1de-05f4-4f49-aead-fd7456ac0a09]
:: elapsed 104ms :: planning 26ms :: scheduling 78ms :: running 0ms :: finishing 78ms :: begin
2017-09-15T08:50:53.585Z :: end 2017-09-15T08:50:53.689Z
- test the result for sum() with distinct operator for decimal column in presto *** FAILED
***
  java.lang.NullPointerException:
  at org.apache.carbondata.presto.integrationtest.PrestoAllDataTypeTest$$anonfun$11.apply$mcV$sp(PrestoAllDataTypeTest.scala:115)
  at org.apache.carbondata.presto.integrationtest.PrestoAllDataTypeTest$$anonfun$11.apply(PrestoAllDataTypeTest.scala:110)
  at org.apache.carbondata.presto.integrationtest.PrestoAllDataTypeTest$$anonfun$11.apply(PrestoAllDataTypeTest.scala:110)
  at org.scalatest.Transformer$$anonfun$apply$1.apply$mcV$sp(Transformer.scala:22)
  at org.scalatest.OutcomeOf$class.outcomeOf(OutcomeOf.scala:85)
  at org.scalatest.OutcomeOf$.outcomeOf(OutcomeOf.scala:104)
  at org.scalatest.Transformer.apply(Transformer.scala:22)
  at org.scalatest.Transformer.apply(Transformer.scala:20)
  at org.scalatest.FunSuiteLike$$anon$1.apply(FunSuiteLike.scala:166)
  at org.scalatest.Suite$class.withFixture(Suite.scala:1122)
  ...
- test the result for avg() with distinct operator on decimal coin presto
2017-09-15 08:50:53 INFO  PrestoServer$:101 - ***** executing the query ***** 
 SELECT MIN(BONUS) AS RESULT FROM TESTDB.TESTTABLE 
Sep 15, 2017 8:50:53 AM io.airlift.log.Logger info
INFO: TIMELINE: Query 20170915_085053_00011_6c8cn :: Transaction:[c291ffc2-8b9a-453a-bf38-fdf4ba654ac4]
:: elapsed 92ms :: planning 34ms :: scheduling 58ms :: running 0ms :: finishing 58ms :: begin
2017-09-15T08:50:53.704Z :: end 2017-09-15T08:50:53.796Z
Sep 15, 2017 8:50:53 AM io.airlift.log.Logger info
INFO: TIMELINE: Query 20170915_085053_00012_6c8cn :: Transaction:[17e9a3c5-9edf-4237-a6d9-89088cd3e6e3]
:: elapsed 66ms :: planning 36ms :: scheduling 30ms :: running 0ms :: finishing 30ms :: begin
2017-09-15T08:50:53.808Z :: end 2017-09-15T08:50:53.874Z
- test the result for min() with distinct operator in decimalType of presto
2017-09-15 08:50:53 INFO  PrestoServer$:101 - ***** executing the query ***** 
 SELECT MAX(BONUS) AS RESULT FROM TESTDB.TESTTABLE 
- test the result for max() with distinct operator in decimalType of presto
Sep 15, 2017 8:50:53 AM io.airlift.log.Logger info
INFO: TIMELINE: Query 20170915_085053_00013_6c8cn :: Transaction:[0b144227-7d62-43f6-ad3d-99cefd7dec1f]
:: elapsed 61ms :: planning 29ms :: scheduling 32ms :: running 0ms :: finishing 32ms :: begin
2017-09-15T08:50:53.885Z :: end 2017-09-15T08:50:53.946Z
2017-09-15 08:50:53 INFO  PrestoServer$:101 - ***** executing the query ***** 
 SELECT DISTINCT BONUS FROM TESTDB.TESTTABLE ORDER BY BONUS limit 3 
- select decimal data type with ORDER BY  clause *** FAILED ***
  actualResult.equals(expectedResult) was false (PrestoAllDataTypeTest.scala:147)
2017-09-15 08:50:54 INFO  PrestoServer$:101 - ***** executing the query ***** 
 SELECT NAME FROM TESTDB.TESTTABLE ORDER BY NAME
Sep 15, 2017 8:50:54 AM io.airlift.log.Logger info
INFO: TIMELINE: Query 20170915_085053_00014_6c8cn :: Transaction:[d1afee35-e056-4d83-9db4-e321e2b230c0]
:: elapsed 116ms :: planning 28ms :: scheduling 88ms :: running 0ms :: finishing 88ms :: begin
2017-09-15T08:50:53.965Z :: end 2017-09-15T08:50:54.081Z
2017-09-15 08:50:54 INFO  PrestoServer$:101 - ***** executing the query ***** 
 SELECT DATE FROM TESTDB.TESTTABLE ORDER BY DATE
- select string type with order by clause *** FAILED ***
  actualResult.equals(expectedResult) was false (PrestoAllDataTypeTest.scala:162)
Sep 15, 2017 8:50:54 AM io.airlift.log.Logger info
INFO: TIMELINE: Query 20170915_085054_00015_6c8cn :: Transaction:[86e001dd-eb2f-4787-92ba-4b94437c3e08]
:: elapsed 81ms :: planning 35ms :: scheduling 46ms :: running 0ms :: finishing 46ms :: begin
2017-09-15T08:50:54.100Z :: end 2017-09-15T08:50:54.181Z
2017-09-15 08:50:54 INFO  PrestoServer$:101 - ***** executing the query ***** 
 SELECT DISTINCT ID FROM TESTDB.TESTTABLE ORDER BY ID
Sep 15, 2017 8:50:54 AM io.airlift.log.Logger info
INFO: TIMELINE: Query 20170915_085054_00016_6c8cn :: Transaction:[f9a27026-bee3-47d3-a543-6a02d035f687]
:: elapsed 48ms :: planning 24ms :: scheduling 24ms :: running 0ms :: finishing 24ms :: begin
2017-09-15T08:50:54.202Z :: end 2017-09-15T08:50:54.250Z
- select DATE type with order by clause *** FAILED ***
  java.util.NoSuchElementException: head of empty list
  at scala.collection.immutable.Nil$.head(List.scala:420)
  at scala.collection.immutable.Nil$.head(List.scala:417)
  at org.apache.carbondata.presto.integrationtest.PrestoAllDataTypeTest$$anonfun$17.apply$mcV$sp(PrestoAllDataTypeTest.scala:182)
  at org.apache.carbondata.presto.integrationtest.PrestoAllDataTypeTest$$anonfun$17.apply(PrestoAllDataTypeTest.scala:164)
  at org.apache.carbondata.presto.integrationtest.PrestoAllDataTypeTest$$anonfun$17.apply(PrestoAllDataTypeTest.scala:164)
  at org.scalatest.Transformer$$anonfun$apply$1.apply$mcV$sp(Transformer.scala:22)
  at org.scalatest.OutcomeOf$class.outcomeOf(OutcomeOf.scala:85)
  at org.scalatest.OutcomeOf$.outcomeOf(OutcomeOf.scala:104)
  at org.scalatest.Transformer.apply(Transformer.scala:22)
  at org.scalatest.Transformer.apply(Transformer.scala:20)
  ...
2017-09-15 08:50:54 INFO  PrestoServer$:101 - ***** executing the query ***** 
 SELECT ID,DATE,COUNTRY,NAME,PHONETYPE,SERIALNAME,SALARY,BONUS FROM TESTDB.TESTTABLE WHERE
BONUS>1234 AND ID>2 GROUP BY ID,DATE,COUNTRY,NAME,PHONETYPE,SERIALNAME,SALARY,BONUS
ORDER BY ID
- select int type with order by clause *** FAILED ***
  actualResult.equals(expectedResult) was false (PrestoAllDataTypeTest.scala:197)
Sep 15, 2017 8:50:54 AM io.airlift.log.Logger info
INFO: TIMELINE: Query 20170915_085054_00017_6c8cn :: Transaction:[93efd492-b1ad-4faf-a72a-3628e8425423]
:: elapsed 60ms :: planning 24ms :: scheduling 36ms :: running 0ms :: finishing 36ms :: begin
2017-09-15T08:50:54.262Z :: end 2017-09-15T08:50:54.322Z
2017-09-15 08:50:54 INFO  PrestoServer$:101 - ***** executing the query ***** 
 SELECT ID,DATE,COUNTRY,NAME,PHONETYPE,SERIALNAME,SALARY,BONUS FROM TESTDB.TESTTABLE WHERE
BONUS>=1234.444 GROUP BY ID,DATE,COUNTRY,NAME,PHONETYPE,SERIALNAME,SALARY,BONUS ORDER BY
ID
- test and filter clause with greater than expression *** FAILED ***
  actualResult.toString().equals(expectedResult.toString()) was false (PrestoAllDataTypeTest.scala:223)
Sep 15, 2017 8:50:54 AM io.airlift.log.Logger info
INFO: TIMELINE: Query 20170915_085054_00018_6c8cn :: Transaction:[e9365ce5-e618-4035-bdd7-b61463896a44]
:: elapsed 171ms :: planning 116ms :: scheduling 55ms :: running 0ms :: finishing 55ms ::
begin 2017-09-15T08:50:54.356Z :: end 2017-09-15T08:50:54.527Z
- test and filter clause with greater than equal to expression *** FAILED ***
  actualResult.toString().equals(expectedResult.toString()) was false (PrestoAllDataTypeTest.scala:267)
2017-09-15 08:50:54 INFO  PrestoServer$:101 - ***** executing the query ***** 
 SELECT ID,DATE,COUNTRY,NAME,PHONETYPE,SERIALNAME,SALARY,BONUS FROM TESTDB.TESTTABLE WHERE
BONUS<=1234.444 GROUP BY ID,DATE,COUNTRY,NAME,PHONETYPE,SERIALNAME,SALARY,BONUS ORDER BY
ID LIMIT 2
Sep 15, 2017 8:50:54 AM io.airlift.log.Logger info
INFO: TIMELINE: Query 20170915_085054_00019_6c8cn :: Transaction:[c1aed66e-005c-44d7-a8c8-4ecb4b45057b]
:: elapsed 104ms :: planning 69ms :: scheduling 35ms :: running 0ms :: finishing 35ms :: begin
2017-09-15T08:50:54.550Z :: end 2017-09-15T08:50:54.654Z
- test and filter clause with less than equal to expression *** FAILED ***
  actualResult.toString().equals(expectedResult.toString()) was false (PrestoAllDataTypeTest.scala:292)
2017-09-15 08:50:54 INFO  PrestoServer$:101 - ***** executing the query ***** 
 SELECT ID FROM TESTDB.TESTTABLE WHERE BONUS=1234.444
Sep 15, 2017 8:50:54 AM io.airlift.log.Logger info
INFO: TIMELINE: Query 20170915_085054_00020_6c8cn :: Transaction:[626a9578-fd7d-4cf4-bf88-0de517c7cbfc]
:: elapsed 69ms :: planning 37ms :: scheduling 32ms :: running 0ms :: finishing 32ms :: begin
2017-09-15T08:50:54.674Z :: end 2017-09-15T08:50:54.743Z
Sep 15, 2017 8:50:54 AM io.airlift.log.Logger info
INFO: TIMELINE: Query 20170915_085054_00021_6c8cn :: Transaction:[0b9805ef-cd37-4ffc-a885-e5f25d1b8cf9]
:: elapsed 47ms :: planning 27ms :: scheduling 20ms :: running 0ms :: finishing 20ms :: begin
2017-09-15T08:50:54.760Z :: end 2017-09-15T08:50:54.807Z
2017-09-15 08:50:54 INFO  PrestoServer$:101 - ***** executing the query ***** 
 SELECT ID,DATE,COUNTRY,NAME,PHONETYPE,SERIALNAME,SALARY,BONUS FROM TESTDB.TESTTABLE WHERE
BONUS>1234 AND ID<2 GROUP BY ID,DATE,COUNTRY,NAME,PHONETYPE,SERIALNAME,SALARY,BONUS
ORDER BY ID
- test equal to expression on decimal value *** FAILED ***
  actualResult.equals(expectedResult) was false (PrestoAllDataTypeTest.scala:301)
2017-09-15 08:50:54 INFO  PrestoServer$:101 - ***** executing the query ***** 
 SELECT NAME from testdb.testtable WHERE PHONETYPE IN('phone1848','phone706')
- test less than expression with and operator *** FAILED ***
  actualResult.toString().equals(expectedResult.toString()) was false (PrestoAllDataTypeTest.scala:317)
Sep 15, 2017 8:50:54 AM io.airlift.log.Logger info
INFO: TIMELINE: Query 20170915_085054_00022_6c8cn :: Transaction:[23df2e60-f4a3-486c-a293-aa3f56acad23]
:: elapsed 104ms :: planning 54ms :: scheduling 50ms :: running 0ms :: finishing 50ms :: begin
2017-09-15T08:50:54.824Z :: end 2017-09-15T08:50:54.928Z
Sep 15, 2017 8:50:55 AM io.airlift.log.Logger info
INFO: TIMELINE: Query 20170915_085054_00023_6c8cn :: Transaction:[1002650a-5472-490f-9f88-a764114e3534]
:: elapsed 330ms :: planning 311ms :: scheduling 19ms :: running 0ms :: finishing 19ms ::
begin 2017-09-15T08:50:54.951Z :: end 2017-09-15T08:50:55.281Z
2017-09-15 08:50:55 INFO  PrestoServer$:101 - ***** executing the query ***** 
 SELECT NAME from testdb.testtable WHERE PHONETYPE NOT IN('phone1848','phone706')
- test the result for in clause *** FAILED ***
  actualResult.equals(expectedResult) was false (PrestoAllDataTypeTest.scala:327)
Sep 15, 2017 8:50:55 AM io.airlift.log.Logger info
INFO: TIMELINE: Query 20170915_085055_00024_6c8cn :: Transaction:[b26d5038-1af9-4ba0-85ed-c58bfbe89c42]
:: elapsed 54ms :: planning 37ms :: scheduling 17ms :: running 0ms :: finishing 17ms :: begin
2017-09-15T08:50:55.296Z :: end 2017-09-15T08:50:55.350Z
2017-09-15 08:50:55 INFO  PrestoServer$:101 - ***** executing the query ***** 
 SELECT ID FROM TESTDB.TESTTABLE WHERE DATE IS NULL
- test the result for not in clause *** FAILED ***
  actualResult.equals(expectedResult) was false (PrestoAllDataTypeTest.scala:341)
Sep 15, 2017 8:50:55 AM io.airlift.log.Logger info
INFO: TIMELINE: Query 20170915_085055_00025_6c8cn :: Transaction:[f3ca6fe3-926d-4196-8d40-b1a73279d492]
:: elapsed 41ms :: planning 22ms :: scheduling 19ms :: running 0ms :: finishing 19ms :: begin
2017-09-15T08:50:55.363Z :: end 2017-09-15T08:50:55.404Z
2017-09-15 08:50:55 INFO  PrestoServer$:101 - ***** executing the query ***** 
 SELECT NAME FROM TESTDB.TESTTABLE WHERE DATE IS NOT NULL AND ID=9
- test for null operator on date data type *** FAILED ***
  actualResult.equals(expectedResult) was false (PrestoAllDataTypeTest.scala:347)
Sep 15, 2017 8:50:55 AM io.airlift.log.Logger info
INFO: TIMELINE: Query 20170915_085055_00026_6c8cn :: Transaction:[0f5bb643-fa74-485e-abad-ae921ee5bf88]
:: elapsed 49ms :: planning 33ms :: scheduling 16ms :: running 0ms :: finishing 16ms :: begin
2017-09-15T08:50:55.423Z :: end 2017-09-15T08:50:55.472Z
2017-09-15 08:50:55 INFO  PrestoServer$:101 - ***** executing the query ***** 
 SELECT NAME FROM TESTDB.TESTTABLE WHERE DOB IS NOT NULL AND ID=9
- test for not null operator on date data type *** FAILED ***
  actualResult.equals(expectedResult) was false (PrestoAllDataTypeTest.scala:354)
- test for not null operator on timestamp type *** FAILED ***
  actualResult.equals(expectedResult) was false (PrestoAllDataTypeTest.scala:362)
2017-09-15 08:50:55 INFO  PrestoServer$:101 - ***** executing the query ***** 
 SELECT NAME FROM TESTDB.TESTTABLE WHERE DOB IS NULL AND ID=1
Sep 15, 2017 8:50:55 AM io.airlift.log.Logger info
INFO: TIMELINE: Query 20170915_085055_00027_6c8cn :: Transaction:[032c2561-789f-43b6-a0bf-52764714a802]
:: elapsed 57ms :: planning 41ms :: scheduling 16ms :: running 0ms :: finishing 16ms :: begin
2017-09-15T08:50:55.485Z :: end 2017-09-15T08:50:55.542Z
Sep 15, 2017 8:50:55 AM io.airlift.log.Logger info
INFO: TIMELINE: Query 20170915_085055_00028_6c8cn :: Transaction:[02462fe1-20f5-4160-89fb-5c19cba5a75e]
:: elapsed 45ms :: planning 30ms :: scheduling 15ms :: running 0ms :: finishing 15ms :: begin
2017-09-15T08:50:55.556Z :: end 2017-09-15T08:50:55.601Z
2017-09-15 08:50:55 INFO  PrestoServer$:101 - ***** executing the query ***** 
 SELECT DISTINCT SHORTFIELD from testdb.testtable ORDER BY SHORTFIELD 
- test for null operator on timestamp type *** FAILED ***
  actualResult.equals(expectedResult) was false (PrestoAllDataTypeTest.scala:369)
2017-09-15 08:50:55 INFO  PrestoServer$:101 - ***** executing the query ***** 
 SELECT ID from testdb.testtable WHERE SHORTFIELD IS NULL ORDER BY SHORTFIELD 
- test the result for short datatype with order by clause *** FAILED ***
  actualResult.equals(expectedResult) was false (PrestoAllDataTypeTest.scala:385)
Sep 15, 2017 8:50:55 AM io.airlift.log.Logger info
INFO: TIMELINE: Query 20170915_085055_00029_6c8cn :: Transaction:[6ef1eeea-0447-4477-bc5b-b9fd2867f4ba]
:: elapsed 72ms :: planning 24ms :: scheduling 48ms :: running 0ms :: finishing 48ms :: begin
2017-09-15T08:50:55.612Z :: end 2017-09-15T08:50:55.684Z
- test the result for short datatype in clause where field is null *** FAILED ***
  actualResult.equals(expectedResult) was false (PrestoAllDataTypeTest.scala:393)
2017-09-15 08:50:55 INFO  PrestoServer$:101 - ***** executing the query ***** 
 SELECT ID from testdb.testtable WHERE SHORTFIELD>11 
Sep 15, 2017 8:50:55 AM io.airlift.log.Logger info
INFO: TIMELINE: Query 20170915_085055_00030_6c8cn :: Transaction:[5752afcc-27e9-4ee0-92e4-0849c089b891]
:: elapsed 48ms :: planning 31ms :: scheduling 17ms :: running 0ms :: finishing 17ms :: begin
2017-09-15T08:50:55.699Z :: end 2017-09-15T08:50:55.747Z
Sep 15, 2017 8:50:55 AM io.airlift.log.Logger info
INFO: TIMELINE: Query 20170915_085055_00031_6c8cn :: Transaction:[6d604deb-01bc-483a-9766-7ba375462fcc]
:: elapsed 40ms :: planning 26ms :: scheduling 14ms :: running 0ms :: finishing 14ms :: begin
2017-09-15T08:50:55.759Z :: end 2017-09-15T08:50:55.799Z
- test the result for short datatype with greater than operator *** FAILED ***
  actualResult.equals(expectedResult) was false (PrestoAllDataTypeTest.scala:401)
Sep 15, 2017 8:50:55 AM io.airlift.log.Logger info
INFO: Life cycle stopping...
Sep 15, 2017 8:50:55 AM org.eclipse.jetty.server.AbstractConnector doStop
INFO: Stopped http@4ef277ef{HTTP/1.1,[http/1.1, h2c, h2c-17, h2c-16, h2c-15, h2c-14]}{127.0.0.1:8086}
Sep 15, 2017 8:50:55 AM io.airlift.log.Logger warn
WARNING: Error fetching memory info from http://127.0.0.1:8086/v1/memory: Server refused connection:
http://127.0.0.1:8086/v1/memory
Sep 15, 2017 8:50:57 AM io.airlift.log.Logger warn
WARNING: Error fetching memory info from http://127.0.0.1:8086/v1/memory: Server refused connection:
http://127.0.0.1:8086/v1/memory
Sep 15, 2017 8:50:59 AM io.airlift.log.Logger warn
WARNING: Error fetching node state from http://127.0.0.1:8086/v1/info/state: Server refused
connection: http://127.0.0.1:8086/v1/info/state
2017-09-15 08:50:59 INFO  AbstractDataLoadProcessorStep:150 - Thread-2 Rows processed in step
Data Writer : 10
2017-09-15 08:50:59 INFO  AbstractDataLoadProcessorStep:150 - Thread-3 Rows processed in step
Data Converter : 10
2017-09-15 08:50:59 INFO  AbstractDataLoadProcessorStep:150 - Thread-4 Rows processed in step
Input Processor : 10
Sep 15, 2017 8:50:59 AM io.airlift.log.Logger warn
WARNING: Error fetching memory info from http://127.0.0.1:8086/v1/memory: Server refused connection:
http://127.0.0.1:8086/v1/memory
Sep 15, 2017 8:51:00 AM org.eclipse.jetty.server.handler.ContextHandler doStop
INFO: Stopped o.e.j.s.ServletContextHandler@2c51c756{/,null,UNAVAILABLE,@http}
Sep 15, 2017 8:51:00 AM org.eclipse.jetty.util.thread.QueuedThreadPool doStop
WARNING: http-worker{STOPPING,2<=16<=200,i=14,q=14} Couldn't stop Thread[http-worker-213,5,main]
Sep 15, 2017 8:51:00 AM org.eclipse.jetty.util.thread.QueuedThreadPool doStop
WARNING: http-worker{STOPPING,2<=16<=200,i=7,q=13} Couldn't stop Thread[http-worker-277,5,]
Sep 15, 2017 8:51:00 AM org.eclipse.jetty.util.thread.QueuedThreadPool doStop
WARNING: http-worker{STOPPING,2<=16<=200,i=4,q=13} Couldn't stop Thread[http-worker-314,5,]
Sep 15, 2017 8:51:00 AM org.eclipse.jetty.util.thread.QueuedThreadPool doStop
WARNING: http-worker{STOPPING,2<=16<=200,i=0,q=13} Couldn't stop Thread[http-worker-255,5,]
Sep 15, 2017 8:51:00 AM io.airlift.log.Logger info
INFO: Life cycle stopped.
Sep 15, 2017 8:51:00 AM io.airlift.log.Logger info
INFO: Life cycle stopping...
Sep 15, 2017 8:51:00 AM org.eclipse.jetty.server.AbstractConnector doStop
INFO: Stopped http@31c0c7e5{HTTP/1.1,[http/1.1, h2c, h2c-17, h2c-16, h2c-15, h2c-14]}{127.0.0.1:38555}
Sep 15, 2017 8:51:00 AM org.eclipse.jetty.server.handler.ContextHandler doStop
INFO: Stopped o.e.j.s.ServletContextHandler@67f266bd{/,null,UNAVAILABLE,@http}
Sep 15, 2017 8:51:00 AM org.eclipse.jetty.util.thread.QueuedThreadPool doStop
WARNING: http-worker{STOPPING,2<=14<=200,i=13,q=13} Couldn't stop Thread[http-worker-397,5,main]
Sep 15, 2017 8:51:00 AM org.eclipse.jetty.util.thread.QueuedThreadPool doStop
WARNING: http-worker{STOPPING,2<=14<=200,i=6,q=11} Couldn't stop Thread[http-worker-304,5,]
Sep 15, 2017 8:51:00 AM org.eclipse.jetty.util.thread.QueuedThreadPool doStop
WARNING: http-worker{STOPPING,2<=14<=200,i=3,q=11} Couldn't stop Thread[http-worker-412,5,main]
Sep 15, 2017 8:51:00 AM org.eclipse.jetty.util.thread.QueuedThreadPool doStop
WARNING: http-worker{STOPPING,2<=14<=200,i=0,q=8} Couldn't stop Thread[http-worker-414,5,]
Sep 15, 2017 8:51:00 AM io.airlift.log.Logger info
INFO: Life cycle stopped.
Sep 15, 2017 8:51:00 AM io.airlift.log.Logger info
INFO: Life cycle stopping...
Sep 15, 2017 8:51:00 AM org.eclipse.jetty.server.AbstractConnector doStop
INFO: Stopped http@4adcc981{HTTP/1.1,[http/1.1, h2c, h2c-17, h2c-16, h2c-15, h2c-14]}{127.0.0.1:42055}
Sep 15, 2017 8:51:00 AM org.eclipse.jetty.server.handler.ContextHandler doStop
INFO: Stopped o.e.j.s.ServletContextHandler@729d6ee2{/,null,UNAVAILABLE,@http}
Sep 15, 2017 8:51:00 AM org.eclipse.jetty.util.thread.QueuedThreadPool doStop
WARNING: http-worker{STOPPING,2<=14<=200,i=11,q=12} Couldn't stop Thread[http-worker-124,5,]
Sep 15, 2017 8:51:00 AM org.eclipse.jetty.util.thread.QueuedThreadPool doStop
WARNING: http-worker{STOPPING,2<=14<=200,i=9,q=11} Couldn't stop Thread[http-worker-415,5,main]
Sep 15, 2017 8:51:00 AM org.eclipse.jetty.util.thread.QueuedThreadPool doStop
WARNING: http-worker{STOPPING,2<=14<=200,i=2,q=10} Couldn't stop Thread[http-worker-306,5,]
Sep 15, 2017 8:51:00 AM org.eclipse.jetty.util.thread.QueuedThreadPool doStop
WARNING: http-worker{STOPPING,2<=14<=200,i=0,q=10} Couldn't stop Thread[http-worker-417,5,]
Sep 15, 2017 8:51:00 AM io.airlift.log.Logger info
INFO: Life cycle stopped.
Sep 15, 2017 8:51:00 AM io.airlift.log.Logger info
INFO: Life cycle stopping...
Sep 15, 2017 8:51:00 AM org.eclipse.jetty.server.AbstractConnector doStop
INFO: Stopped http@38929da{HTTP/1.1,[http/1.1, h2c, h2c-17, h2c-16, h2c-15, h2c-14]}{127.0.0.1:38018}
Sep 15, 2017 8:51:00 AM org.eclipse.jetty.server.handler.ContextHandler doStop
INFO: Stopped o.e.j.s.ServletContextHandler@1e6d30c0{/,null,UNAVAILABLE,@http}
Sep 15, 2017 8:51:00 AM org.eclipse.jetty.util.thread.QueuedThreadPool doStop
WARNING: http-worker{STOPPING,2<=13<=200,i=11,q=11} Couldn't stop Thread[http-worker-298,5,]
Sep 15, 2017 8:51:00 AM org.eclipse.jetty.util.thread.QueuedThreadPool doStop
WARNING: http-worker{STOPPING,2<=13<=200,i=6,q=11} Couldn't stop Thread[http-worker-420,5,]
Sep 15, 2017 8:51:00 AM org.eclipse.jetty.util.thread.QueuedThreadPool doStop
WARNING: http-worker{STOPPING,2<=13<=200,i=2,q=10} Couldn't stop Thread[http-worker-79,5,main]
Sep 15, 2017 8:51:00 AM org.eclipse.jetty.util.thread.QueuedThreadPool doStop
WARNING: http-worker{STOPPING,2<=13<=200,i=0,q=10} Couldn't stop Thread[http-worker-253,5,]
Sep 15, 2017 8:51:00 AM io.airlift.log.Logger info
INFO: Life cycle stopped.
Sep 15, 2017 8:51:00 AM io.airlift.log.Logger info
INFO: Life cycle stopping...
Sep 15, 2017 8:51:00 AM org.eclipse.jetty.server.AbstractConnector doStop
INFO: Stopped http@7da635c0{HTTP/1.1,[http/1.1, h2c, h2c-17, h2c-16, h2c-15, h2c-14]}{127.0.0.1:43221}
Sep 15, 2017 8:51:00 AM org.eclipse.jetty.server.handler.ContextHandler doStop
INFO: Stopped o.e.j.s.ServletContextHandler@3d615b2e{/,null,UNAVAILABLE,@http}
Sep 15, 2017 8:51:00 AM org.eclipse.jetty.util.thread.QueuedThreadPool doStop
WARNING: http-worker{STOPPING,2<=10<=200,i=5,q=8} Couldn't stop Thread[http-worker-422,5,main]
Sep 15, 2017 8:51:00 AM org.eclipse.jetty.util.thread.QueuedThreadPool doStop
WARNING: http-worker{STOPPING,2<=10<=200,i=2,q=8} Couldn't stop Thread[http-worker-421,5,]
Sep 15, 2017 8:51:00 AM org.eclipse.jetty.util.thread.QueuedThreadPool doStop
WARNING: http-worker{STOPPING,2<=10<=200,i=1,q=8} Couldn't stop Thread[http-worker-423,5,main]
Sep 15, 2017 8:51:00 AM io.airlift.log.Logger info
INFO: Life cycle stopped.
2017-09-15 08:51:00 INFO  PrestoServer$:88 - ***** Stopping The Server *****
Run completed in 22 seconds, 56 milliseconds.
Total number of tests run: 32
Suites: completed 2, aborted 0
Tests: succeeded 6, failed 26, canceled 0, ignored 0, pending 0
*** 26 TESTS FAILED ***
[JENKINS] Recording test results

Mime
View raw message