carbondata-commits mailing list archives

Site index · List index
Message view « Date » · « Thread »
Top « Date » · « Thread »
From Apache Jenkins Server <jenk...@builds.apache.org>
Subject Build failed in Jenkins: carbondata-master-spark-2.1 » Apache CarbonData :: presto #1381
Date Fri, 15 Sep 2017 07:51:26 GMT
See <https://builds.apache.org/job/carbondata-master-spark-2.1/org.apache.carbondata$carbondata-presto/1381/display/redirect>

------------------------------------------
[...truncated 175.65 KB...]
  at org.apache.carbondata.presto.integrationtest.PrestoAllDataTypeTest$$anonfun$11.apply(PrestoAllDataTypeTest.scala:110)
  at org.scalatest.Transformer$$anonfun$apply$1.apply$mcV$sp(Transformer.scala:22)
  at org.scalatest.OutcomeOf$class.outcomeOf(OutcomeOf.scala:85)
  at org.scalatest.OutcomeOf$.outcomeOf(OutcomeOf.scala:104)
  at org.scalatest.Transformer.apply(Transformer.scala:22)
  at org.scalatest.Transformer.apply(Transformer.scala:20)
  at org.scalatest.FunSuiteLike$$anon$1.apply(FunSuiteLike.scala:166)
  at org.scalatest.Suite$class.withFixture(Suite.scala:1122)
  ...
Sep 15, 2017 7:50:46 AM io.airlift.log.Logger info
INFO: TIMELINE: Query 20170915_075045_00011_b6j96 :: Transaction:[dabecfa2-5062-4bfb-ad83-652526302fac]
:: elapsed 126ms :: planning 35ms :: scheduling 91ms :: running 0ms :: finishing 91ms :: begin
2017-09-15T07:50:45.932Z :: end 2017-09-15T07:50:46.058Z
- test the result for avg() with distinct operator on decimal coin presto
2017-09-15 07:50:46 INFO  PrestoServer$:101 - ***** executing the query ***** 
 SELECT MIN(BONUS) AS RESULT FROM TESTDB.TESTTABLE 
Sep 15, 2017 7:50:46 AM io.airlift.log.Logger info
INFO: TIMELINE: Query 20170915_075046_00012_b6j96 :: Transaction:[529f977a-2188-4333-91c7-1d08dfffbc1b]
:: elapsed 72ms :: planning 41ms :: scheduling 31ms :: running 0ms :: finishing 31ms :: begin
2017-09-15T07:50:46.076Z :: end 2017-09-15T07:50:46.148Z
- test the result for min() with distinct operator in decimalType of presto
2017-09-15 07:50:46 INFO  PrestoServer$:101 - ***** executing the query ***** 
 SELECT MAX(BONUS) AS RESULT FROM TESTDB.TESTTABLE 
- test the result for max() with distinct operator in decimalType of presto
Sep 15, 2017 7:50:46 AM io.airlift.log.Logger info
INFO: TIMELINE: Query 20170915_075046_00013_b6j96 :: Transaction:[626db998-e00f-47f9-8bd5-77ce792a3ddb]
:: elapsed 65ms :: planning 33ms :: scheduling 32ms :: running 0ms :: finishing 32ms :: begin
2017-09-15T07:50:46.162Z :: end 2017-09-15T07:50:46.227Z
2017-09-15 07:50:46 INFO  PrestoServer$:101 - ***** executing the query ***** 
 SELECT DISTINCT BONUS FROM TESTDB.TESTTABLE ORDER BY BONUS limit 3 
2017-09-15 07:50:46 INFO  PrestoServer$:101 - ***** executing the query ***** 
 SELECT NAME FROM TESTDB.TESTTABLE ORDER BY NAME
- select decimal data type with ORDER BY  clause *** FAILED ***
  actualResult.equals(expectedResult) was false (PrestoAllDataTypeTest.scala:147)
Sep 15, 2017 7:50:46 AM io.airlift.log.Logger info
INFO: TIMELINE: Query 20170915_075046_00014_b6j96 :: Transaction:[f0c7c6ca-3818-4107-8cc8-365e4448fd67]
:: elapsed 126ms :: planning 29ms :: scheduling 97ms :: running 0ms :: finishing 97ms :: begin
2017-09-15T07:50:46.248Z :: end 2017-09-15T07:50:46.374Z
2017-09-15 07:50:46 INFO  PrestoServer$:101 - ***** executing the query ***** 
 SELECT DATE FROM TESTDB.TESTTABLE ORDER BY DATE
- select string type with order by clause *** FAILED ***
  actualResult.equals(expectedResult) was false (PrestoAllDataTypeTest.scala:162)
Sep 15, 2017 7:50:46 AM io.airlift.log.Logger info
INFO: TIMELINE: Query 20170915_075046_00015_b6j96 :: Transaction:[1c943338-eac7-4bca-b118-887527ba8bb4]
:: elapsed 79ms :: planning 26ms :: scheduling 53ms :: running 0ms :: finishing 53ms :: begin
2017-09-15T07:50:46.389Z :: end 2017-09-15T07:50:46.468Z
2017-09-15 07:50:46 INFO  PrestoServer$:101 - ***** executing the query ***** 
 SELECT DISTINCT ID FROM TESTDB.TESTTABLE ORDER BY ID
- select DATE type with order by clause *** FAILED ***
  java.util.NoSuchElementException: head of empty list
  at scala.collection.immutable.Nil$.head(List.scala:420)
  at scala.collection.immutable.Nil$.head(List.scala:417)
  at org.apache.carbondata.presto.integrationtest.PrestoAllDataTypeTest$$anonfun$17.apply$mcV$sp(PrestoAllDataTypeTest.scala:182)
  at org.apache.carbondata.presto.integrationtest.PrestoAllDataTypeTest$$anonfun$17.apply(PrestoAllDataTypeTest.scala:164)
  at org.apache.carbondata.presto.integrationtest.PrestoAllDataTypeTest$$anonfun$17.apply(PrestoAllDataTypeTest.scala:164)
  at org.scalatest.Transformer$$anonfun$apply$1.apply$mcV$sp(Transformer.scala:22)
  at org.scalatest.OutcomeOf$class.outcomeOf(OutcomeOf.scala:85)
  at org.scalatest.OutcomeOf$.outcomeOf(OutcomeOf.scala:104)
  at org.scalatest.Transformer.apply(Transformer.scala:22)
  at org.scalatest.Transformer.apply(Transformer.scala:20)
  ...
Sep 15, 2017 7:50:46 AM io.airlift.log.Logger info
INFO: TIMELINE: Query 20170915_075046_00016_b6j96 :: Transaction:[8bbd729e-4b68-443b-bcab-390183701452]
:: elapsed 46ms :: planning 27ms :: scheduling 19ms :: running 0ms :: finishing 19ms :: begin
2017-09-15T07:50:46.495Z :: end 2017-09-15T07:50:46.541Z
2017-09-15 07:50:46 INFO  PrestoServer$:101 - ***** executing the query ***** 
 SELECT ID,DATE,COUNTRY,NAME,PHONETYPE,SERIALNAME,SALARY,BONUS FROM TESTDB.TESTTABLE WHERE
BONUS>1234 AND ID>2 GROUP BY ID,DATE,COUNTRY,NAME,PHONETYPE,SERIALNAME,SALARY,BONUS
ORDER BY ID
- select int type with order by clause *** FAILED ***
  actualResult.equals(expectedResult) was false (PrestoAllDataTypeTest.scala:197)
Sep 15, 2017 7:50:46 AM io.airlift.log.Logger info
INFO: TIMELINE: Query 20170915_075046_00017_b6j96 :: Transaction:[0b82ce47-3dce-43ed-884f-d07b31f3543a]
:: elapsed 74ms :: planning 28ms :: scheduling 46ms :: running 0ms :: finishing 46ms :: begin
2017-09-15T07:50:46.555Z :: end 2017-09-15T07:50:46.629Z
2017-09-15 07:50:46 INFO  PrestoServer$:101 - ***** executing the query ***** 
 SELECT ID,DATE,COUNTRY,NAME,PHONETYPE,SERIALNAME,SALARY,BONUS FROM TESTDB.TESTTABLE WHERE
BONUS>=1234.444 GROUP BY ID,DATE,COUNTRY,NAME,PHONETYPE,SERIALNAME,SALARY,BONUS ORDER BY
ID
- test and filter clause with greater than expression *** FAILED ***
  actualResult.toString().equals(expectedResult.toString()) was false (PrestoAllDataTypeTest.scala:223)
Sep 15, 2017 7:50:46 AM io.airlift.log.Logger info
INFO: TIMELINE: Query 20170915_075046_00018_b6j96 :: Transaction:[519b29aa-77c7-43af-ae52-69279231003c]
:: elapsed 190ms :: planning 134ms :: scheduling 56ms :: running 0ms :: finishing 56ms ::
begin 2017-09-15T07:50:46.658Z :: end 2017-09-15T07:50:46.848Z
Sep 15, 2017 7:50:46 AM io.airlift.log.Logger info
INFO: TIMELINE: Query 20170915_075046_00019_b6j96 :: Transaction:[83c079d4-ba21-42ef-afdb-052a634cc570]
:: elapsed 88ms :: planning 46ms :: scheduling 42ms :: running 0ms :: finishing 42ms :: begin
2017-09-15T07:50:46.875Z :: end 2017-09-15T07:50:46.963Z
- test and filter clause with greater than equal to expression *** FAILED ***
  actualResult.toString().equals(expectedResult.toString()) was false (PrestoAllDataTypeTest.scala:267)
2017-09-15 07:50:46 INFO  PrestoServer$:101 - ***** executing the query ***** 
 SELECT ID,DATE,COUNTRY,NAME,PHONETYPE,SERIALNAME,SALARY,BONUS FROM TESTDB.TESTTABLE WHERE
BONUS<=1234.444 GROUP BY ID,DATE,COUNTRY,NAME,PHONETYPE,SERIALNAME,SALARY,BONUS ORDER BY
ID LIMIT 2
2017-09-15 07:50:47 INFO  PrestoServer$:101 - ***** executing the query ***** 
 SELECT ID FROM TESTDB.TESTTABLE WHERE BONUS=1234.444
- test and filter clause with less than equal to expression *** FAILED ***
  actualResult.toString().equals(expectedResult.toString()) was false (PrestoAllDataTypeTest.scala:292)
Sep 15, 2017 7:50:47 AM io.airlift.log.Logger info
INFO: TIMELINE: Query 20170915_075046_00020_b6j96 :: Transaction:[278c0c7e-b666-4ecf-83b9-420a9d654fe2]
:: elapsed 82ms :: planning 38ms :: scheduling 44ms :: running 0ms :: finishing 44ms :: begin
2017-09-15T07:50:46.989Z :: end 2017-09-15T07:50:47.071Z
Sep 15, 2017 7:50:47 AM io.airlift.log.Logger info
INFO: TIMELINE: Query 20170915_075047_00021_b6j96 :: Transaction:[599cb68e-1b5a-4b40-a3e9-43f62e0eda51]
:: elapsed 44ms :: planning 28ms :: scheduling 16ms :: running 0ms :: finishing 16ms :: begin
2017-09-15T07:50:47.087Z :: end 2017-09-15T07:50:47.131Z
- test equal to expression on decimal value *** FAILED ***
  actualResult.equals(expectedResult) was false (PrestoAllDataTypeTest.scala:301)
2017-09-15 07:50:47 INFO  PrestoServer$:101 - ***** executing the query ***** 
 SELECT ID,DATE,COUNTRY,NAME,PHONETYPE,SERIALNAME,SALARY,BONUS FROM TESTDB.TESTTABLE WHERE
BONUS>1234 AND ID<2 GROUP BY ID,DATE,COUNTRY,NAME,PHONETYPE,SERIALNAME,SALARY,BONUS
ORDER BY ID
- test less than expression with and operator *** FAILED ***
  actualResult.toString().equals(expectedResult.toString()) was false (PrestoAllDataTypeTest.scala:317)
2017-09-15 07:50:47 INFO  PrestoServer$:101 - ***** executing the query ***** 
 SELECT NAME from testdb.testtable WHERE PHONETYPE IN('phone1848','phone706')
Sep 15, 2017 7:50:47 AM io.airlift.log.Logger info
INFO: TIMELINE: Query 20170915_075047_00022_b6j96 :: Transaction:[cc9dee71-f056-426c-9113-e1eeeed9a4c1]
:: elapsed 95ms :: planning 61ms :: scheduling 34ms :: running 0ms :: finishing 34ms :: begin
2017-09-15T07:50:47.149Z :: end 2017-09-15T07:50:47.244Z
2017-09-15 07:50:47 INFO  PrestoServer$:101 - ***** executing the query ***** 
 SELECT NAME from testdb.testtable WHERE PHONETYPE NOT IN('phone1848','phone706')
- test the result for in clause *** FAILED ***
  actualResult.equals(expectedResult) was false (PrestoAllDataTypeTest.scala:327)
Sep 15, 2017 7:50:47 AM io.airlift.log.Logger info
INFO: TIMELINE: Query 20170915_075047_00023_b6j96 :: Transaction:[65daa3c3-9c94-4b16-8a0f-70a7ee6da9be]
:: elapsed 339ms :: planning 319ms :: scheduling 20ms :: running 0ms :: finishing 20ms ::
begin 2017-09-15T07:50:47.271Z :: end 2017-09-15T07:50:47.610Z
Sep 15, 2017 7:50:47 AM io.airlift.log.Logger info
INFO: TIMELINE: Query 20170915_075047_00024_b6j96 :: Transaction:[151ca5f1-36dc-4b4a-94e5-2323eeaeadc4]
:: elapsed 55ms :: planning 33ms :: scheduling 22ms :: running 0ms :: finishing 22ms :: begin
2017-09-15T07:50:47.623Z :: end 2017-09-15T07:50:47.678Z
2017-09-15 07:50:47 INFO  PrestoServer$:101 - ***** executing the query ***** 
 SELECT ID FROM TESTDB.TESTTABLE WHERE DATE IS NULL
- test the result for not in clause *** FAILED ***
  actualResult.equals(expectedResult) was false (PrestoAllDataTypeTest.scala:341)
Sep 15, 2017 7:50:47 AM io.airlift.log.Logger info
INFO: TIMELINE: Query 20170915_075047_00025_b6j96 :: Transaction:[ace8af2c-1d3c-4c04-b73d-474a03b1ddc5]
:: elapsed 34ms :: planning 21ms :: scheduling 13ms :: running 0ms :: finishing 13ms :: begin
2017-09-15T07:50:47.692Z :: end 2017-09-15T07:50:47.726Z
2017-09-15 07:50:47 INFO  PrestoServer$:101 - ***** executing the query ***** 
 SELECT NAME FROM TESTDB.TESTTABLE WHERE DATE IS NOT NULL AND ID=9
- test for null operator on date data type *** FAILED ***
  actualResult.equals(expectedResult) was false (PrestoAllDataTypeTest.scala:347)
Sep 15, 2017 7:50:47 AM io.airlift.log.Logger info
INFO: TIMELINE: Query 20170915_075047_00026_b6j96 :: Transaction:[b356ae56-2cd7-4cb9-a17f-983c456b98a9]
:: elapsed 46ms :: planning 29ms :: scheduling 17ms :: running 0ms :: finishing 17ms :: begin
2017-09-15T07:50:47.743Z :: end 2017-09-15T07:50:47.789Z
2017-09-15 07:50:47 INFO  PrestoServer$:101 - ***** executing the query ***** 
 SELECT NAME FROM TESTDB.TESTTABLE WHERE DOB IS NOT NULL AND ID=9
- test for not null operator on date data type *** FAILED ***
  actualResult.equals(expectedResult) was false (PrestoAllDataTypeTest.scala:354)
- test for not null operator on timestamp type *** FAILED ***
  actualResult.equals(expectedResult) was false (PrestoAllDataTypeTest.scala:362)
2017-09-15 07:50:47 INFO  PrestoServer$:101 - ***** executing the query ***** 
 SELECT NAME FROM TESTDB.TESTTABLE WHERE DOB IS NULL AND ID=1
Sep 15, 2017 7:50:47 AM io.airlift.log.Logger info
INFO: TIMELINE: Query 20170915_075047_00027_b6j96 :: Transaction:[b3e08fbf-a07a-431d-8c2c-ad7bceb0864c]
:: elapsed 42ms :: planning 30ms :: scheduling 12ms :: running 0ms :: finishing 12ms :: begin
2017-09-15T07:50:47.801Z :: end 2017-09-15T07:50:47.843Z
Sep 15, 2017 7:50:47 AM io.airlift.log.Logger info
- test for null operator on timestamp type *** FAILED ***
  actualResult.equals(expectedResult) was false (PrestoAllDataTypeTest.scala:369)
INFO: TIMELINE: Query 20170915_075047_00028_b6j96 :: Transaction:[6ab9179a-1d9b-4ae0-bf06-4f3b1fb83ca1]
:: elapsed 45ms :: planning 32ms :: scheduling 13ms :: running 0ms :: finishing 13ms :: begin
2017-09-15T07:50:47.858Z :: end 2017-09-15T07:50:47.903Z
2017-09-15 07:50:47 INFO  PrestoServer$:101 - ***** executing the query ***** 
 SELECT DISTINCT SHORTFIELD from testdb.testtable ORDER BY SHORTFIELD 
2017-09-15 07:50:48 INFO  PrestoServer$:101 - ***** executing the query ***** 
 SELECT ID from testdb.testtable WHERE SHORTFIELD IS NULL ORDER BY SHORTFIELD 
- test the result for short datatype with order by clause *** FAILED ***
  actualResult.equals(expectedResult) was false (PrestoAllDataTypeTest.scala:385)
Sep 15, 2017 7:50:48 AM io.airlift.log.Logger info
INFO: TIMELINE: Query 20170915_075047_00029_b6j96 :: Transaction:[210df746-b743-4eaa-83e2-7cd044d3b65c]
:: elapsed 98ms :: planning 61ms :: scheduling 37ms :: running 0ms :: finishing 37ms :: begin
2017-09-15T07:50:47.915Z :: end 2017-09-15T07:50:48.013Z
2017-09-15 07:50:48 INFO  PrestoServer$:101 - ***** executing the query ***** 
 SELECT ID from testdb.testtable WHERE SHORTFIELD>11 
- test the result for short datatype in clause where field is null *** FAILED ***
  actualResult.equals(expectedResult) was false (PrestoAllDataTypeTest.scala:393)
Sep 15, 2017 7:50:48 AM io.airlift.log.Logger info
INFO: TIMELINE: Query 20170915_075048_00030_b6j96 :: Transaction:[b3a3cfad-a84d-4a08-b79d-c33eff079e13]
:: elapsed 45ms :: planning 28ms :: scheduling 17ms :: running 0ms :: finishing 17ms :: begin
2017-09-15T07:50:48.025Z :: end 2017-09-15T07:50:48.070Z
Sep 15, 2017 7:50:48 AM io.airlift.log.Logger info
INFO: TIMELINE: Query 20170915_075048_00031_b6j96 :: Transaction:[fee37ee0-31b5-467c-b07c-8d4b2f86ca00]
:: elapsed 39ms :: planning 23ms :: scheduling 16ms :: running 0ms :: finishing 16ms :: begin
2017-09-15T07:50:48.084Z :: end 2017-09-15T07:50:48.123Z
- test the result for short datatype with greater than operator *** FAILED ***
  actualResult.equals(expectedResult) was false (PrestoAllDataTypeTest.scala:401)
Sep 15, 2017 7:50:48 AM io.airlift.log.Logger info
INFO: Life cycle stopping...
Sep 15, 2017 7:50:48 AM org.eclipse.jetty.server.AbstractConnector doStop
INFO: Stopped http@4ef277ef{HTTP/1.1,[http/1.1, h2c, h2c-17, h2c-16, h2c-15, h2c-14]}{127.0.0.1:8086}
Sep 15, 2017 7:50:49 AM io.airlift.log.Logger warn
WARNING: Error fetching memory info from http://127.0.0.1:8086/v1/memory: Server refused connection:
http://127.0.0.1:8086/v1/memory
Sep 15, 2017 7:50:51 AM io.airlift.log.Logger warn
WARNING: Error fetching node state from http://127.0.0.1:8086/v1/info/state: Server refused
connection: http://127.0.0.1:8086/v1/info/state
2017-09-15 07:50:51 INFO  AbstractDataLoadProcessorStep:150 - Thread-2 Rows processed in step
Data Writer : 10
2017-09-15 07:50:51 INFO  AbstractDataLoadProcessorStep:150 - Thread-3 Rows processed in step
Data Converter : 10
2017-09-15 07:50:51 INFO  AbstractDataLoadProcessorStep:150 - Thread-4 Rows processed in step
Input Processor : 10
Sep 15, 2017 7:50:51 AM io.airlift.log.Logger warn
WARNING: Error fetching memory info from http://127.0.0.1:8086/v1/memory: Server refused connection:
http://127.0.0.1:8086/v1/memory
Sep 15, 2017 7:50:52 AM org.eclipse.jetty.server.handler.ContextHandler doStop
INFO: Stopped o.e.j.s.ServletContextHandler@2c51c756{/,null,UNAVAILABLE,@http}
Sep 15, 2017 7:50:52 AM org.eclipse.jetty.util.thread.QueuedThreadPool doStop
WARNING: http-worker{STOPPING,2<=16<=200,i=11,q=12} Couldn't stop Thread[http-worker-374,5,]
Sep 15, 2017 7:50:52 AM org.eclipse.jetty.util.thread.QueuedThreadPool doStop
WARNING: http-worker{STOPPING,2<=16<=200,i=5,q=11} Couldn't stop Thread[http-worker-209,5,]
Sep 15, 2017 7:50:52 AM org.eclipse.jetty.util.thread.QueuedThreadPool doStop
WARNING: http-worker{STOPPING,2<=16<=200,i=2,q=11} Couldn't stop Thread[http-worker-211,5,]
Sep 15, 2017 7:50:52 AM org.eclipse.jetty.util.thread.QueuedThreadPool doStop
WARNING: http-worker{STOPPING,2<=16<=200,i=0,q=10} Couldn't stop Thread[http-worker-303,5,]
Sep 15, 2017 7:50:52 AM io.airlift.log.Logger info
INFO: Life cycle stopped.
Sep 15, 2017 7:50:52 AM io.airlift.log.Logger info
INFO: Life cycle stopping...
Sep 15, 2017 7:50:52 AM org.eclipse.jetty.server.AbstractConnector doStop
INFO: Stopped http@31c0c7e5{HTTP/1.1,[http/1.1, h2c, h2c-17, h2c-16, h2c-15, h2c-14]}{127.0.0.1:41350}
Sep 15, 2017 7:50:52 AM org.eclipse.jetty.server.handler.ContextHandler doStop
INFO: Stopped o.e.j.s.ServletContextHandler@67f266bd{/,null,UNAVAILABLE,@http}
Sep 15, 2017 7:50:52 AM org.eclipse.jetty.util.thread.QueuedThreadPool doStop
WARNING: http-worker{STOPPING,2<=14<=200,i=14,q=13} Couldn't stop Thread[http-worker-156,5,main]
Sep 15, 2017 7:50:52 AM org.eclipse.jetty.util.thread.QueuedThreadPool doStop
WARNING: http-worker{STOPPING,2<=14<=200,i=9,q=13} Couldn't stop Thread[http-worker-310,5,]
Sep 15, 2017 7:50:52 AM org.eclipse.jetty.util.thread.QueuedThreadPool doStop
WARNING: http-worker{STOPPING,2<=14<=200,i=5,q=12} Couldn't stop Thread[http-worker-417,5,main]
Sep 15, 2017 7:50:52 AM org.eclipse.jetty.util.thread.QueuedThreadPool doStop
WARNING: http-worker{STOPPING,2<=14<=200,i=5,q=12} Couldn't stop Thread[http-worker-153,5,main]
Sep 15, 2017 7:50:52 AM org.eclipse.jetty.util.thread.QueuedThreadPool doStop
WARNING: http-worker{STOPPING,2<=14<=200,i=4,q=12} Couldn't stop Thread[http-worker-155,5,main]
Sep 15, 2017 7:50:52 AM org.eclipse.jetty.util.thread.QueuedThreadPool doStop
WARNING: http-worker{STOPPING,2<=14<=200,i=2,q=12} Couldn't stop Thread[http-worker-309,5,]
Sep 15, 2017 7:50:52 AM io.airlift.log.Logger info
INFO: Life cycle stopped.
Sep 15, 2017 7:50:52 AM io.airlift.log.Logger info
INFO: Life cycle stopping...
Sep 15, 2017 7:50:52 AM org.eclipse.jetty.server.AbstractConnector doStop
INFO: Stopped http@4adcc981{HTTP/1.1,[http/1.1, h2c, h2c-17, h2c-16, h2c-15, h2c-14]}{127.0.0.1:46094}
Sep 15, 2017 7:50:52 AM org.eclipse.jetty.server.handler.ContextHandler doStop
INFO: Stopped o.e.j.s.ServletContextHandler@729d6ee2{/,null,UNAVAILABLE,@http}
Sep 15, 2017 7:50:52 AM org.eclipse.jetty.util.thread.QueuedThreadPool doStop
WARNING: http-worker{STOPPING,2<=14<=200,i=10,q=11} Couldn't stop Thread[http-worker-361,5,main]
Sep 15, 2017 7:50:52 AM org.eclipse.jetty.util.thread.QueuedThreadPool doStop
WARNING: http-worker{STOPPING,2<=14<=200,i=8,q=11} Couldn't stop Thread[http-worker-116,5,main]
Sep 15, 2017 7:50:52 AM org.eclipse.jetty.util.thread.QueuedThreadPool doStop
WARNING: http-worker{STOPPING,2<=14<=200,i=7,q=11} Couldn't stop Thread[http-worker-422,5,main]
Sep 15, 2017 7:50:52 AM org.eclipse.jetty.util.thread.QueuedThreadPool doStop
WARNING: http-worker{STOPPING,2<=14<=200,i=3,q=10} Couldn't stop Thread[http-worker-124,5,]
Sep 15, 2017 7:50:52 AM org.eclipse.jetty.util.thread.QueuedThreadPool doStop
WARNING: http-worker{STOPPING,2<=14<=200,i=1,q=9} Couldn't stop Thread[http-worker-377,5,]
Sep 15, 2017 7:50:52 AM org.eclipse.jetty.util.thread.QueuedThreadPool doStop
WARNING: http-worker{STOPPING,2<=14<=200,i=0,q=8} Couldn't stop Thread[http-worker-421,5,]
Sep 15, 2017 7:50:52 AM io.airlift.log.Logger info
INFO: Life cycle stopped.
Sep 15, 2017 7:50:52 AM io.airlift.log.Logger info
INFO: Life cycle stopping...
Sep 15, 2017 7:50:52 AM org.eclipse.jetty.server.AbstractConnector doStop
INFO: Stopped http@38929da{HTTP/1.1,[http/1.1, h2c, h2c-17, h2c-16, h2c-15, h2c-14]}{127.0.0.1:39222}
Sep 15, 2017 7:50:52 AM org.eclipse.jetty.server.handler.ContextHandler doStop
INFO: Stopped o.e.j.s.ServletContextHandler@1e6d30c0{/,null,UNAVAILABLE,@http}
Sep 15, 2017 7:50:52 AM org.eclipse.jetty.util.thread.QueuedThreadPool doStop
WARNING: http-worker{STOPPING,2<=14<=200,i=9,q=10} Couldn't stop Thread[http-worker-424,5,main]
Sep 15, 2017 7:50:52 AM org.eclipse.jetty.util.thread.QueuedThreadPool doStop
WARNING: http-worker{STOPPING,2<=14<=200,i=8,q=10} Couldn't stop Thread[http-worker-425,5,main]
Sep 15, 2017 7:50:52 AM org.eclipse.jetty.util.thread.QueuedThreadPool doStop
WARNING: http-worker{STOPPING,2<=14<=200,i=7,q=10} Couldn't stop Thread[http-worker-314,5,main]
Sep 15, 2017 7:50:52 AM org.eclipse.jetty.util.thread.QueuedThreadPool doStop
WARNING: http-worker{STOPPING,2<=14<=200,i=1,q=10} Couldn't stop Thread[http-worker-316,5,]
Sep 15, 2017 7:50:52 AM org.eclipse.jetty.util.thread.QueuedThreadPool doStop
WARNING: http-worker{STOPPING,2<=14<=200,i=1,q=10} Couldn't stop Thread[http-worker-423,5,main]
Sep 15, 2017 7:50:52 AM io.airlift.log.Logger info
INFO: Life cycle stopped.
Sep 15, 2017 7:50:52 AM io.airlift.log.Logger info
INFO: Life cycle stopping...
Sep 15, 2017 7:50:52 AM org.eclipse.jetty.server.AbstractConnector doStop
INFO: Stopped http@7da635c0{HTTP/1.1,[http/1.1, h2c, h2c-17, h2c-16, h2c-15, h2c-14]}{127.0.0.1:45671}
Sep 15, 2017 7:50:52 AM org.eclipse.jetty.server.handler.ContextHandler doStop
INFO: Stopped o.e.j.s.ServletContextHandler@3d615b2e{/,null,UNAVAILABLE,@http}
Sep 15, 2017 7:50:52 AM org.eclipse.jetty.util.thread.QueuedThreadPool doStop
WARNING: http-worker{STOPPING,2<=11<=200,i=9,q=9} Couldn't stop Thread[http-worker-416,5,main]
Sep 15, 2017 7:50:52 AM org.eclipse.jetty.util.thread.QueuedThreadPool doStop
WARNING: http-worker{STOPPING,2<=11<=200,i=6,q=9} Couldn't stop Thread[http-worker-45,5,]
Sep 15, 2017 7:50:52 AM org.eclipse.jetty.util.thread.QueuedThreadPool doStop
WARNING: http-worker{STOPPING,2<=11<=200,i=1,q=8} Couldn't stop Thread[http-worker-44,5,]
Sep 15, 2017 7:50:52 AM org.eclipse.jetty.util.thread.QueuedThreadPool doStop
WARNING: http-worker{STOPPING,2<=11<=200,i=1,q=8} Couldn't stop Thread[http-worker-428,5,]
Sep 15, 2017 7:50:52 AM org.eclipse.jetty.util.thread.QueuedThreadPool doStop
WARNING: http-worker{STOPPING,2<=11<=200,i=0,q=8} Couldn't stop Thread[http-worker-427,5,]
Sep 15, 2017 7:50:52 AM io.airlift.log.Logger info
INFO: Life cycle stopped.
2017-09-15 07:50:52 INFO  PrestoServer$:88 - ***** Stopping The Server *****
Run completed in 21 seconds, 826 milliseconds.
Total number of tests run: 32
Suites: completed 2, aborted 0
Tests: succeeded 6, failed 26, canceled 0, ignored 0, pending 0
*** 26 TESTS FAILED ***
[JENKINS] Recording test results

Mime
View raw message