carbondata-commits mailing list archives

Site index · List index
Message view « Date » · « Thread »
Top « Date » · « Thread »
From Apache Jenkins Server <jenk...@builds.apache.org>
Subject Build failed in Jenkins: carbondata-master-spark-1.6 #1516
Date Thu, 10 Aug 2017 13:42:40 GMT
See <https://builds.apache.org/job/carbondata-master-spark-1.6/1516/display/redirect?page=changes>

Changes:

[chenliang613] [CARBONDATA-1008] Use MetastoreListener to sync schema between spark and

------------------------------------------
[...truncated 19.74 KB...]
	at mockit.internal.startup.AgentLoader.loadAgent(AgentLoader.java:50)
	at mockit.internal.startup.AgentInitialization.loadAgentFromLocalJarFile(AgentInitialization.java:27)
	at mockit.internal.startup.Startup.initializeIfPossible(Startup.java:208)
	at org.junit.runner.Runner.<clinit>(Runner.java:22)
	at org.junit.runner.Computer.getSuite(Computer.java:28)
	at org.junit.runner.Request.classes(Request.java:75)
	at org.junit.runner.Request.classes(Request.java:91)
	at sun.reflect.NativeMethodAccessorImpl.invoke0(Native Method)
	at sun.reflect.NativeMethodAccessorImpl.invoke(NativeMethodAccessorImpl.java:62)
	at sun.reflect.DelegatingMethodAccessorImpl.invoke(DelegatingMethodAccessorImpl.java:43)
	at java.lang.reflect.Method.invoke(Method.java:498)
	at org.apache.maven.surefire.common.junit4.JUnit4Reflector.createRequest(JUnit4Reflector.java:63)
	at org.apache.maven.surefire.common.junit4.JUnit4ProviderUtil.createSuiteDescription(JUnit4ProviderUtil.java:113)
	at org.apache.maven.surefire.junit4.JUnit4Provider.createTestsDescription(JUnit4Provider.java:257)
	at org.apache.maven.surefire.junit4.JUnit4Provider.invoke(JUnit4Provider.java:124)
	at org.apache.maven.surefire.booter.ForkedBooter.invokeProviderInSameClassLoader(ForkedBooter.java:203)
	at org.apache.maven.surefire.booter.ForkedBooter.runSuitesInProcess(ForkedBooter.java:155)
	at org.apache.maven.surefire.booter.ForkedBooter.main(ForkedBooter.java:103)
Caused by: com.sun.tools.attach.AttachNotSupportedException: Unable to open socket file: target
process not responding or HotSpot VM not loaded
	at sun.tools.attach.LinuxVirtualMachine.<init>(LinuxVirtualMachine.java:106)
	at sun.tools.attach.LinuxAttachProvider.attachVirtualMachine(LinuxAttachProvider.java:63)
	at com.sun.tools.attach.VirtualMachine.attach(VirtualMachine.java:208)
	at mockit.internal.startup.AgentLoader.attachToThisVM(AgentLoader.java:97)
	... 18 more

Results :

Tests run: 0, Failures: 0, Errors: 0, Skipped: 0

[JENKINS] Recording test results
[INFO] ------------------------------------------------------------------------
[INFO] Reactor Summary:
[INFO] 
[INFO] Apache CarbonData :: Parent ........................ SUCCESS [  8.851 s]
[INFO] Apache CarbonData :: Common ........................ SUCCESS [  7.594 s]
[INFO] Apache CarbonData :: Core .......................... FAILURE [ 18.119 s]
[INFO] Apache CarbonData :: Processing .................... SKIPPED
[INFO] Apache CarbonData :: Hadoop ........................ SKIPPED
[INFO] Apache CarbonData :: Spark Common .................. SKIPPED
[INFO] Apache CarbonData :: Spark ......................... SKIPPED
[INFO] Apache CarbonData :: Spark Common Test ............. SKIPPED
[INFO] Apache CarbonData :: Assembly ...................... SKIPPED
[INFO] Apache CarbonData :: Spark Examples ................ SKIPPED
[INFO] Apache CarbonData :: Flink Examples ................ SKIPPED
[INFO] ------------------------------------------------------------------------
[INFO] BUILD FAILURE
[INFO] ------------------------------------------------------------------------
[INFO] Total time: 49.076 s
[INFO] Finished at: 2017-08-10T13:42:20+00:00
[INFO] Final Memory: 73M/1528M
[INFO] ------------------------------------------------------------------------
[ERROR] Failed to execute goal org.apache.maven.plugins:maven-surefire-plugin:2.18.1:test
(default-test) on project carbondata-core: Execution default-test of goal org.apache.maven.plugins:maven-surefire-plugin:2.18.1:test
failed: There was an error in the forked process
[ERROR] org.apache.maven.surefire.util.SurefireReflectionException: java.lang.ExceptionInInitializerError
[ERROR] at org.apache.maven.surefire.common.junit4.JUnit4Reflector.createRequest(JUnit4Reflector.java:72)
[ERROR] at org.apache.maven.surefire.common.junit4.JUnit4ProviderUtil.createSuiteDescription(JUnit4ProviderUtil.java:113)
[ERROR] at org.apache.maven.surefire.junit4.JUnit4Provider.createTestsDescription(JUnit4Provider.java:257)
[ERROR] at org.apache.maven.surefire.junit4.JUnit4Provider.invoke(JUnit4Provider.java:124)
[ERROR] at org.apache.maven.surefire.booter.ForkedBooter.invokeProviderInSameClassLoader(ForkedBooter.java:203)
[ERROR] at org.apache.maven.surefire.booter.ForkedBooter.runSuitesInProcess(ForkedBooter.java:155)
[ERROR] at org.apache.maven.surefire.booter.ForkedBooter.main(ForkedBooter.java:103)
[ERROR] Caused by: java.lang.ExceptionInInitializerError
[ERROR] at org.junit.runner.Computer.getSuite(Computer.java:28)
[ERROR] at org.junit.runner.Request.classes(Request.java:75)
[ERROR] at org.junit.runner.Request.classes(Request.java:91)
[ERROR] at sun.reflect.NativeMethodAccessorImpl.invoke0(Native Method)
[ERROR] at sun.reflect.NativeMethodAccessorImpl.invoke(NativeMethodAccessorImpl.java:62)
[ERROR] at sun.reflect.DelegatingMethodAccessorImpl.invoke(DelegatingMethodAccessorImpl.java:43)
[ERROR] at java.lang.reflect.Method.invoke(Method.java:498)
[ERROR] at org.apache.maven.surefire.common.junit4.JUnit4Reflector.createRequest(JUnit4Reflector.java:63)
[ERROR] ... 6 more
[ERROR] Caused by: java.lang.RuntimeException: com.sun.tools.attach.AttachNotSupportedException:
Unable to open socket file: target process not responding or HotSpot VM not loaded
[ERROR] at mockit.internal.startup.AgentLoader.attachToThisVM(AgentLoader.java:100)
[ERROR] at mockit.internal.startup.AgentLoader.loadAgent(AgentLoader.java:50)
[ERROR] at mockit.internal.startup.AgentInitialization.loadAgentFromLocalJarFile(AgentInitialization.java:27)
[ERROR] at mockit.internal.startup.Startup.initializeIfPossible(Startup.java:208)
[ERROR] at org.junit.runner.Runner.<clinit>(Runner.java:22)
[ERROR] ... 14 more
[ERROR] Caused by: com.sun.tools.attach.AttachNotSupportedException: Unable to open socket
file: target process not responding or HotSpot VM not loaded
[ERROR] at sun.tools.attach.LinuxVirtualMachine.<init>(LinuxVirtualMachine.java:106)
[ERROR] at sun.tools.attach.LinuxAttachProvider.attachVirtualMachine(LinuxAttachProvider.java:63)
[ERROR] at com.sun.tools.attach.VirtualMachine.attach(VirtualMachine.java:208)
[ERROR] at mockit.internal.startup.AgentLoader.attachToThisVM(AgentLoader.java:97)
[ERROR] ... 18 more
[ERROR] -> [Help 1]
org.apache.maven.lifecycle.LifecycleExecutionException: Failed to execute goal org.apache.maven.plugins:maven-surefire-plugin:2.18.1:test
(default-test) on project carbondata-core: Execution default-test of goal org.apache.maven.plugins:maven-surefire-plugin:2.18.1:test
failed: There was an error in the forked process
org.apache.maven.surefire.util.SurefireReflectionException: java.lang.ExceptionInInitializerError
	at org.apache.maven.surefire.common.junit4.JUnit4Reflector.createRequest(JUnit4Reflector.java:72)
	at org.apache.maven.surefire.common.junit4.JUnit4ProviderUtil.createSuiteDescription(JUnit4ProviderUtil.java:113)
	at org.apache.maven.surefire.junit4.JUnit4Provider.createTestsDescription(JUnit4Provider.java:257)
	at org.apache.maven.surefire.junit4.JUnit4Provider.invoke(JUnit4Provider.java:124)
	at org.apache.maven.surefire.booter.ForkedBooter.invokeProviderInSameClassLoader(ForkedBooter.java:203)
	at org.apache.maven.surefire.booter.ForkedBooter.runSuitesInProcess(ForkedBooter.java:155)
	at org.apache.maven.surefire.booter.ForkedBooter.main(ForkedBooter.java:103)
Caused by: java.lang.ExceptionInInitializerError
	at org.junit.runner.Computer.getSuite(Computer.java:28)
	at org.junit.runner.Request.classes(Request.java:75)
	at org.junit.runner.Request.classes(Request.java:91)
	at sun.reflect.NativeMethodAccessorImpl.invoke0(Native Method)
	at sun.reflect.NativeMethodAccessorImpl.invoke(NativeMethodAccessorImpl.java:62)
	at sun.reflect.DelegatingMethodAccessorImpl.invoke(DelegatingMethodAccessorImpl.java:43)
	at java.lang.reflect.Method.invoke(Method.java:498)
	at org.apache.maven.surefire.common.junit4.JUnit4Reflector.createRequest(JUnit4Reflector.java:63)
	... 6 more
Caused by: java.lang.RuntimeException: com.sun.tools.attach.AttachNotSupportedException: Unable
to open socket file: target process not responding or HotSpot VM not loaded
	at mockit.internal.startup.AgentLoader.attachToThisVM(AgentLoader.java:100)
	at mockit.internal.startup.AgentLoader.loadAgent(AgentLoader.java:50)
	at mockit.internal.startup.AgentInitialization.loadAgentFromLocalJarFile(AgentInitialization.java:27)
	at mockit.internal.startup.Startup.initializeIfPossible(Startup.java:208)
	at org.junit.runner.Runner.<clinit>(Runner.java:22)
	... 14 more
Caused by: com.sun.tools.attach.AttachNotSupportedException: Unable to open socket file: target
process not responding or HotSpot VM not loaded
	at sun.tools.attach.LinuxVirtualMachine.<init>(LinuxVirtualMachine.java:106)
	at sun.tools.attach.LinuxAttachProvider.attachVirtualMachine(LinuxAttachProvider.java:63)
	at com.sun.tools.attach.VirtualMachine.attach(VirtualMachine.java:208)
	at mockit.internal.startup.AgentLoader.attachToThisVM(AgentLoader.java:97)
	... 18 more

	at org.apache.maven.lifecycle.internal.MojoExecutor.execute(MojoExecutor.java:212)
	at org.apache.maven.lifecycle.internal.MojoExecutor.execute(MojoExecutor.java:153)
	at org.apache.maven.lifecycle.internal.MojoExecutor.execute(MojoExecutor.java:145)
	at org.apache.maven.lifecycle.internal.LifecycleModuleBuilder.buildProject(LifecycleModuleBuilder.java:116)
	at org.apache.maven.lifecycle.internal.LifecycleModuleBuilder.buildProject(LifecycleModuleBuilder.java:80)
	at org.apache.maven.lifecycle.internal.builder.singlethreaded.SingleThreadedBuilder.build(SingleThreadedBuilder.java:51)
	at org.apache.maven.lifecycle.internal.LifecycleStarter.execute(LifecycleStarter.java:128)
	at org.apache.maven.DefaultMaven.doExecute(DefaultMaven.java:307)
	at org.apache.maven.DefaultMaven.doExecute(DefaultMaven.java:193)
	at org.apache.maven.DefaultMaven.execute(DefaultMaven.java:106)
	at org.jvnet.hudson.maven3.launcher.Maven33Launcher.main(Maven33Launcher.java:129)
	at sun.reflect.NativeMethodAccessorImpl.invoke0(Native Method)
	at sun.reflect.NativeMethodAccessorImpl.invoke(NativeMethodAccessorImpl.java:62)
	at sun.reflect.DelegatingMethodAccessorImpl.invoke(DelegatingMethodAccessorImpl.java:43)
	at java.lang.reflect.Method.invoke(Method.java:498)
	at org.codehaus.plexus.classworlds.launcher.Launcher.launchStandard(Launcher.java:330)
	at org.codehaus.plexus.classworlds.launcher.Launcher.launch(Launcher.java:238)
	at jenkins.maven3.agent.Maven33Main.launch(Maven33Main.java:176)
	at sun.reflect.NativeMethodAccessorImpl.invoke0(Native Method)
	at sun.reflect.NativeMethodAccessorImpl.invoke(NativeMethodAccessorImpl.java:62)
	at sun.reflect.DelegatingMethodAccessorImpl.invoke(DelegatingMethodAccessorImpl.java:43)
	at java.lang.reflect.Method.invoke(Method.java:498)
	at hudson.maven.Maven3Builder.call(Maven3Builder.java:139)
	at hudson.maven.Maven3Builder.call(Maven3Builder.java:70)
	at hudson.remoting.UserRequest.perform(UserRequest.java:153)
	at hudson.remoting.UserRequest.perform(UserRequest.java:50)
	at hudson.remoting.Request$2.run(Request.java:336)
	at hudson.remoting.InterceptingExecutorService$1.call(InterceptingExecutorService.java:68)
	at java.util.concurrent.FutureTask.run(FutureTask.java:266)
	at java.util.concurrent.ThreadPoolExecutor.runWorker(ThreadPoolExecutor.java:1149)
	at java.util.concurrent.ThreadPoolExecutor$Worker.run(ThreadPoolExecutor.java:624)
	at java.lang.Thread.run(Thread.java:748)
Caused by: org.apache.maven.plugin.PluginExecutionException: Execution default-test of goal
org.apache.maven.plugins:maven-surefire-plugin:2.18.1:test failed: There was an error in the
forked process
org.apache.maven.surefire.util.SurefireReflectionException: java.lang.ExceptionInInitializerError
	at org.apache.maven.surefire.common.junit4.JUnit4Reflector.createRequest(JUnit4Reflector.java:72)
	at org.apache.maven.surefire.common.junit4.JUnit4ProviderUtil.createSuiteDescription(JUnit4ProviderUtil.java:113)
	at org.apache.maven.surefire.junit4.JUnit4Provider.createTestsDescription(JUnit4Provider.java:257)
	at org.apache.maven.surefire.junit4.JUnit4Provider.invoke(JUnit4Provider.java:124)
	at org.apache.maven.surefire.booter.ForkedBooter.invokeProviderInSameClassLoader(ForkedBooter.java:203)
	at org.apache.maven.surefire.booter.ForkedBooter.runSuitesInProcess(ForkedBooter.java:155)
	at org.apache.maven.surefire.booter.ForkedBooter.main(ForkedBooter.java:103)
Caused by: java.lang.ExceptionInInitializerError
	at org.junit.runner.Computer.getSuite(Computer.java:28)
	at org.junit.runner.Request.classes(Request.java:75)
	at org.junit.runner.Request.classes(Request.java:91)
	at sun.reflect.NativeMethodAccessorImpl.invoke0(Native Method)
	at sun.reflect.NativeMethodAccessorImpl.invoke(NativeMethodAccessorImpl.java:62)
	at sun.reflect.DelegatingMethodAccessorImpl.invoke(DelegatingMethodAccessorImpl.java:43)
	at java.lang.reflect.Method.invoke(Method.java:498)
	at org.apache.maven.surefire.common.junit4.JUnit4Reflector.createRequest(JUnit4Reflector.java:63)
	... 6 more
Caused by: java.lang.RuntimeException: com.sun.tools.attach.AttachNotSupportedException: Unable
to open socket file: target process not responding or HotSpot VM not loaded
	at mockit.internal.startup.AgentLoader.attachToThisVM(AgentLoader.java:100)
	at mockit.internal.startup.AgentLoader.loadAgent(AgentLoader.java:50)
	at mockit.internal.startup.AgentInitialization.loadAgentFromLocalJarFile(AgentInitialization.java:27)
	at mockit.internal.startup.Startup.initializeIfPossible(Startup.java:208)
	at org.junit.runner.Runner.<clinit>(Runner.java:22)
	... 14 more
Caused by: com.sun.tools.attach.AttachNotSupportedException: Unable to open socket file: target
process not responding or HotSpot VM not loaded
	at sun.tools.attach.LinuxVirtualMachine.<init>(LinuxVirtualMachine.java:106)
	at sun.tools.attach.LinuxAttachProvider.attachVirtualMachine(LinuxAttachProvider.java:63)
	at com.sun.tools.attach.VirtualMachine.attach(VirtualMachine.java:208)
	at mockit.internal.startup.AgentLoader.attachToThisVM(AgentLoader.java:97)
	... 18 more

	at org.apache.maven.plugin.DefaultBuildPluginManager.executeMojo(DefaultBuildPluginManager.java:145)
	at org.apache.maven.lifecycle.internal.MojoExecutor.execute(MojoExecutor.java:207)
	... 31 more
Caused by: java.lang.RuntimeException: There was an error in the forked process
org.apache.maven.surefire.util.SurefireReflectionException: java.lang.ExceptionInInitializerError
	at org.apache.maven.surefire.common.junit4.JUnit4Reflector.createRequest(JUnit4Reflector.java:72)
	at org.apache.maven.surefire.common.junit4.JUnit4ProviderUtil.createSuiteDescription(JUnit4ProviderUtil.java:113)
	at org.apache.maven.surefire.junit4.JUnit4Provider.createTestsDescription(JUnit4Provider.java:257)
	at org.apache.maven.surefire.junit4.JUnit4Provider.invoke(JUnit4Provider.java:124)
	at org.apache.maven.surefire.booter.ForkedBooter.invokeProviderInSameClassLoader(ForkedBooter.java:203)
	at org.apache.maven.surefire.booter.ForkedBooter.runSuitesInProcess(ForkedBooter.java:155)
	at org.apache.maven.surefire.booter.ForkedBooter.main(ForkedBooter.java:103)
Caused by: java.lang.ExceptionInInitializerError
	at org.junit.runner.Computer.getSuite(Computer.java:28)
	at org.junit.runner.Request.classes(Request.java:75)
	at org.junit.runner.Request.classes(Request.java:91)
	at sun.reflect.NativeMethodAccessorImpl.invoke0(Native Method)
	at sun.reflect.NativeMethodAccessorImpl.invoke(NativeMethodAccessorImpl.java:62)
	at sun.reflect.DelegatingMethodAccessorImpl.invoke(DelegatingMethodAccessorImpl.java:43)
	at java.lang.reflect.Method.invoke(Method.java:498)
	at org.apache.maven.surefire.common.junit4.JUnit4Reflector.createRequest(JUnit4Reflector.java:63)
	... 6 more
Caused by: java.lang.RuntimeException: com.sun.tools.attach.AttachNotSupportedException: Unable
to open socket file: target process not responding or HotSpot VM not loaded
	at mockit.internal.startup.AgentLoader.attachToThisVM(AgentLoader.java:100)
	at mockit.internal.startup.AgentLoader.loadAgent(AgentLoader.java:50)
	at mockit.internal.startup.AgentInitialization.loadAgentFromLocalJarFile(AgentInitialization.java:27)
	at mockit.internal.startup.Startup.initializeIfPossible(Startup.java:208)
	at org.junit.runner.Runner.<clinit>(Runner.java:22)
	... 14 more
Caused by: com.sun.tools.attach.AttachNotSupportedException: Unable to open socket file: target
process not responding or HotSpot VM not loaded
	at sun.tools.attach.LinuxVirtualMachine.<init>(LinuxVirtualMachine.java:106)
	at sun.tools.attach.LinuxAttachProvider.attachVirtualMachine(LinuxAttachProvider.java:63)
	at com.sun.tools.attach.VirtualMachine.attach(VirtualMachine.java:208)
	at mockit.internal.startup.AgentLoader.attachToThisVM(AgentLoader.java:97)
	... 18 more

	at org.apache.maven.plugin.surefire.booterclient.ForkStarter.fork(ForkStarter.java:509)
	at org.apache.maven.plugin.surefire.booterclient.ForkStarter.fork(ForkStarter.java:380)
	at org.apache.maven.plugin.surefire.booterclient.ForkStarter.run(ForkStarter.java:167)
	at org.apache.maven.plugin.surefire.AbstractSurefireMojo.executeProvider(AbstractSurefireMojo.java:990)
	at org.apache.maven.plugin.surefire.AbstractSurefireMojo.executeAfterPreconditionsChecked(AbstractSurefireMojo.java:824)
	at org.apache.maven.plugin.surefire.AbstractSurefireMojo.execute(AbstractSurefireMojo.java:722)
	at org.apache.maven.plugin.DefaultBuildPluginManager.executeMojo(DefaultBuildPluginManager.java:134)
	... 32 more
[ERROR] 
[ERROR] Re-run Maven using the -X switch to enable full debug logging.
[ERROR] 
[ERROR] For more information about the errors and possible solutions, please read the following
articles:
[ERROR] [Help 1] http://cwiki.apache.org/confluence/display/MAVEN/PluginExecutionException
[ERROR] 
[ERROR] After correcting the problems, you can resume the build with the command
[ERROR]   mvn <goals> -rf :carbondata-core
[JENKINS] Archiving <https://builds.apache.org/job/carbondata-master-spark-1.6/ws/processing/pom.xml>
to org.apache.carbondata/carbondata-processing/1.2.0-SNAPSHOT/carbondata-processing-1.2.0-SNAPSHOT.pom
[JENKINS] Archiving <https://builds.apache.org/job/carbondata-master-spark-1.6/ws/assembly/pom.xml>
to org.apache.carbondata/carbondata-assembly/1.2.0-SNAPSHOT/carbondata-assembly-1.2.0-SNAPSHOT.pom
[JENKINS] Archiving <https://builds.apache.org/job/carbondata-master-spark-1.6/ws/integration/spark-common/pom.xml>
to org.apache.carbondata/carbondata-spark-common/1.2.0-SNAPSHOT/carbondata-spark-common-1.2.0-SNAPSHOT.pom
[JENKINS] Archiving <https://builds.apache.org/job/carbondata-master-spark-1.6/ws/pom.xml>
to org.apache.carbondata/carbondata-parent/1.2.0-SNAPSHOT/carbondata-parent-1.2.0-SNAPSHOT.pom
[JENKINS] Archiving <https://builds.apache.org/job/carbondata-master-spark-1.6/ws/examples/flink/pom.xml>
to org.apache.carbondata/carbondata-examples-flink/1.2.0-SNAPSHOT/carbondata-examples-flink-1.2.0-SNAPSHOT.pom
[JENKINS] Archiving <https://builds.apache.org/job/carbondata-master-spark-1.6/ws/core/pom.xml>
to org.apache.carbondata/carbondata-core/1.2.0-SNAPSHOT/carbondata-core-1.2.0-SNAPSHOT.pom
[JENKINS] Archiving <https://builds.apache.org/job/carbondata-master-spark-1.6/ws/hadoop/pom.xml>
to org.apache.carbondata/carbondata-hadoop/1.2.0-SNAPSHOT/carbondata-hadoop-1.2.0-SNAPSHOT.pom
[JENKINS] Archiving <https://builds.apache.org/job/carbondata-master-spark-1.6/ws/examples/spark/pom.xml>
to org.apache.carbondata/carbondata-examples-spark/1.2.0-SNAPSHOT/carbondata-examples-spark-1.2.0-SNAPSHOT.pom
[JENKINS] Archiving <https://builds.apache.org/job/carbondata-master-spark-1.6/ws/common/pom.xml>
to org.apache.carbondata/carbondata-common/1.2.0-SNAPSHOT/carbondata-common-1.2.0-SNAPSHOT.pom
[JENKINS] Archiving <https://builds.apache.org/job/carbondata-master-spark-1.6/ws/common/target/carbondata-common-1.2.0-SNAPSHOT.jar>
to org.apache.carbondata/carbondata-common/1.2.0-SNAPSHOT/carbondata-common-1.2.0-SNAPSHOT.jar
[JENKINS] Archiving <https://builds.apache.org/job/carbondata-master-spark-1.6/ws/integration/spark-common-test/pom.xml>
to org.apache.carbondata/carbondata-spark-common-test/1.2.0-SNAPSHOT/carbondata-spark-common-test-1.2.0-SNAPSHOT.pom
[JENKINS] Archiving <https://builds.apache.org/job/carbondata-master-spark-1.6/ws/integration/spark/pom.xml>
to org.apache.carbondata/carbondata-spark/1.2.0-SNAPSHOT/carbondata-spark-1.2.0-SNAPSHOT.pom
Sending e-mails to: commits@carbondata.apache.org
channel stopped
Not sending mail to unregistered user jacky.likun@huawei.com

Mime
View raw message