carbondata-commits mailing list archives

Site index · List index
Message view « Date » · « Thread »
Top « Date » · « Thread »
From Apache Jenkins Server <jenk...@builds.apache.org>
Subject Build failed in Jenkins: carbondata-master-spark-1.6 #1062
Date Sat, 08 Jul 2017 02:05:29 GMT
See <https://builds.apache.org/job/carbondata-master-spark-1.6/1062/display/redirect>

------------------------------------------
[...truncated 1.27 MB...]
[INFO] Using 'UTF-8' encoding to copy filtered resources.
[INFO] Copying 1 resource
[INFO] Copying 3 resources
[INFO] 
[INFO] --- maven-scala-plugin:2.15.2:compile (default) @ carbondata-examples-spark ---
[INFO] Checking for multiple versions of scala
[INFO] includes = [**/*.java,**/*.scala,]
[INFO] excludes = []
[INFO] <https://builds.apache.org/job/carbondata-master-spark-1.6/ws/examples/spark/src/main/scala>:-1:
info: compiling
[INFO] Compiling 16 source files to <https://builds.apache.org/job/carbondata-master-spark-1.6/ws/examples/spark/target/classes>
at 1499479450069
[WARNING] warning: there were 1 deprecation warning(s); re-run with -deprecation for details
[WARNING] one warning found
[INFO] prepare-compile in 0 s
[INFO] compile in 10 s
[INFO] 
[INFO] --- maven-compiler-plugin:3.2:compile (default-compile) @ carbondata-examples-spark
---
[INFO] Nothing to compile - all classes are up to date
[INFO] 
[INFO] --- maven-scala-plugin:2.15.2:compile (compile) @ carbondata-examples-spark ---
[INFO] Checking for multiple versions of scala
[INFO] includes = [**/*.java,**/*.scala,]
[INFO] excludes = []
[INFO] Nothing to compile - all classes are up to date
[INFO] 
[INFO] --- maven-resources-plugin:2.7:testResources (default-testResources) @ carbondata-examples-spark
---
[INFO] Using 'UTF-8' encoding to copy filtered resources.
[INFO] skip non existing resourceDirectory <https://builds.apache.org/job/carbondata-master-spark-1.6/ws/examples/spark/src/test/resources>
[INFO] Copying 3 resources
[INFO] 
[INFO] --- maven-compiler-plugin:3.2:testCompile (default-testCompile) @ carbondata-examples-spark
---
[INFO] No sources to compile
[INFO] 
[INFO] --- maven-surefire-plugin:2.18.1:test (default-test) @ carbondata-examples-spark ---
[JENKINS] Recording test results
[INFO] 
[INFO] --- maven-jar-plugin:2.5:jar (default-jar) @ carbondata-examples-spark ---
[INFO] Building jar: <https://builds.apache.org/job/carbondata-master-spark-1.6/ws/examples/spark/target/carbondata-examples-spark-1.2.0-SNAPSHOT.jar>
[INFO] 
[INFO] --- maven-site-plugin:3.4:attach-descriptor (attach-descriptor) @ carbondata-examples-spark
---
[INFO] 
[INFO] --- maven-checkstyle-plugin:2.17:check (default) @ carbondata-examples-spark ---
[INFO] Starting audit...
Audit done.
[INFO] 
[INFO] --- scalastyle-maven-plugin:0.8.0:check (default) @ carbondata-examples-spark ---
Saving to outputFile=<https://builds.apache.org/job/carbondata-master-spark-1.6/ws/examples/spark/target/scalastyle-output.xml>
Processed 16 file(s)
Found 0 errors
Found 0 warnings
Found 0 infos
Finished in 238 ms
[INFO] 
[INFO] --- maven-install-plugin:2.5.2:install (default-install) @ carbondata-examples-spark
---
[INFO] Installing <https://builds.apache.org/job/carbondata-master-spark-1.6/ws/examples/spark/target/carbondata-examples-spark-1.2.0-SNAPSHOT.jar>
to /home/jenkins/jenkins-slave/maven-repositories/1/org/apache/carbondata/carbondata-examples-spark/1.2.0-SNAPSHOT/carbondata-examples-spark-1.2.0-SNAPSHOT.jar
[INFO] Installing <https://builds.apache.org/job/carbondata-master-spark-1.6/ws/examples/spark/pom.xml>
to /home/jenkins/jenkins-slave/maven-repositories/1/org/apache/carbondata/carbondata-examples-spark/1.2.0-SNAPSHOT/carbondata-examples-spark-1.2.0-SNAPSHOT.pom
[INFO]                                                                         
[INFO] ------------------------------------------------------------------------
[INFO] Building Apache CarbonData :: Flink Examples 1.2.0-SNAPSHOT
[INFO] ------------------------------------------------------------------------
[INFO] 
[INFO] --- maven-clean-plugin:2.5:clean (default-clean) @ carbondata-examples-flink ---
[INFO] Deleting <https://builds.apache.org/job/carbondata-master-spark-1.6/ws/examples/flink/target>
[INFO] 
[INFO] --- maven-remote-resources-plugin:1.5:process (default) @ carbondata-examples-flink
---
[INFO] 
[INFO] --- maven-resources-plugin:2.7:resources (default-resources) @ carbondata-examples-flink
---
[INFO] Using 'UTF-8' encoding to copy filtered resources.
[INFO] skip non existing resourceDirectory <https://builds.apache.org/job/carbondata-master-spark-1.6/ws/examples/flink/src/main/resources>
[INFO] Copying 3 resources
[INFO] 
[INFO] --- maven-compiler-plugin:3.2:compile (default-compile) @ carbondata-examples-flink
---
[INFO] Nothing to compile - all classes are up to date
[INFO] 
[INFO] --- maven-resources-plugin:2.7:testResources (default-testResources) @ carbondata-examples-flink
---
[INFO] Using 'UTF-8' encoding to copy filtered resources.
[INFO] skip non existing resourceDirectory <https://builds.apache.org/job/carbondata-master-spark-1.6/ws/examples/flink/src/test/resources>
[INFO] Copying 3 resources
[INFO] 
[INFO] --- maven-compiler-plugin:3.2:testCompile (default-testCompile) @ carbondata-examples-flink
---
[INFO] No sources to compile
[INFO] 
[INFO] --- maven-surefire-plugin:2.18.1:test (default-test) @ carbondata-examples-flink ---
[JENKINS] Recording test results
[INFO] 
[INFO] --- maven-jar-plugin:2.5:jar (default-jar) @ carbondata-examples-flink ---
[INFO] Building jar: <https://builds.apache.org/job/carbondata-master-spark-1.6/ws/examples/flink/target/carbondata-examples-flink-1.2.0-SNAPSHOT.jar>
[INFO] 
[INFO] --- maven-site-plugin:3.4:attach-descriptor (attach-descriptor) @ carbondata-examples-flink
---
[INFO] 
[INFO] --- maven-checkstyle-plugin:2.17:check (default) @ carbondata-examples-flink ---
[INFO] Starting audit...
Audit done.
[INFO] 
[INFO] --- scalastyle-maven-plugin:0.8.0:check (default) @ carbondata-examples-flink ---
Saving to outputFile=<https://builds.apache.org/job/carbondata-master-spark-1.6/ws/examples/flink/target/scalastyle-output.xml>
Processed 1 file(s)
Found 0 errors
Found 0 warnings
Found 0 infos
Finished in 9 ms
[INFO] 
[INFO] --- maven-install-plugin:2.5.2:install (default-install) @ carbondata-examples-flink
---
[INFO] Installing <https://builds.apache.org/job/carbondata-master-spark-1.6/ws/examples/flink/target/carbondata-examples-flink-1.2.0-SNAPSHOT.jar>
to /home/jenkins/jenkins-slave/maven-repositories/1/org/apache/carbondata/carbondata-examples-flink/1.2.0-SNAPSHOT/carbondata-examples-flink-1.2.0-SNAPSHOT.jar
[INFO] Installing <https://builds.apache.org/job/carbondata-master-spark-1.6/ws/examples/flink/pom.xml>
to /home/jenkins/jenkins-slave/maven-repositories/1/org/apache/carbondata/carbondata-examples-flink/1.2.0-SNAPSHOT/carbondata-examples-flink-1.2.0-SNAPSHOT.pom
[INFO]                                                                         
[INFO] ------------------------------------------------------------------------
[INFO] Building Apache CarbonData :: Hive 1.2.0-SNAPSHOT
[INFO] ------------------------------------------------------------------------
[INFO] Downloading: http://repo1.maven.org/maven2/org/apache/carbondata/carbondata-spark2/1.2.0-SNAPSHOT/maven-metadata.xml
[INFO] Downloading: http://repository.apache.org/snapshots/org/apache/carbondata/carbondata-spark2/1.2.0-SNAPSHOT/maven-metadata.xml
[INFO] Downloaded: http://repository.apache.org/snapshots/org/apache/carbondata/carbondata-spark2/1.2.0-SNAPSHOT/maven-metadata.xml
(791 B at 2.0 KB/sec)
[INFO] 
[INFO] --- maven-clean-plugin:2.5:clean (default-clean) @ carbondata-hive ---
[INFO] Deleting <https://builds.apache.org/job/carbondata-master-spark-1.6/ws/integration/hive/target>
[INFO] 
[INFO] --- maven-remote-resources-plugin:1.5:process (default) @ carbondata-hive ---
[INFO] Downloading: http://repo1.maven.org/maven2/org/pentaho/pentaho-aggdesigner-algorithm/5.1.5-jhyde/pentaho-aggdesigner-algorithm-5.1.5-jhyde.pom
[INFO] 
[INFO] --- maven-resources-plugin:2.7:resources (default-resources) @ carbondata-hive ---
[INFO] Using 'UTF-8' encoding to copy filtered resources.
[INFO] Copying 3 resources
[INFO] Copying 3 resources
[INFO] 
[INFO] --- maven-scala-plugin:2.15.2:compile (default) @ carbondata-hive ---
[INFO] Checking for multiple versions of scala
[INFO] includes = [**/*.java,**/*.scala,]
[INFO] excludes = []
[INFO] <https://builds.apache.org/job/carbondata-master-spark-1.6/ws/integration/hive/src/main/java>:-1:
info: compiling
[INFO] <https://builds.apache.org/job/carbondata-master-spark-1.6/ws/integration/hive/src/main/scala>:-1:
info: compiling
[INFO] Compiling 10 source files to <https://builds.apache.org/job/carbondata-master-spark-1.6/ws/integration/hive/target/classes>
at 1499479476257
[ERROR] <https://builds.apache.org/job/carbondata-master-spark-1.6/ws/integration/hive/src/main/scala/org/apache/carbondata/hiveexample/HiveExample.scala>:22:
error: object SparkSession is not a member of package org.apache.spark.sql
[INFO] import org.apache.spark.sql.SparkSession
[INFO]        ^
[ERROR] <https://builds.apache.org/job/carbondata-master-spark-1.6/ws/integration/hive/src/main/scala/org/apache/carbondata/hiveexample/HiveExample.scala>:46:
error: not found: value SparkSession
[INFO]     val carbonSession = SparkSession
[INFO]                         ^
[ERROR] error: bad symbolic reference. A signature in CarbonSession.class refers to term SparkSession
[INFO] in package org.apache.spark.sql which is not available.
[INFO] It may be completely missing from the current classpath, or the version on
[INFO] the classpath might be incompatible with the version used when compiling CarbonSession.class.
[ERROR] error: bad symbolic reference. A signature in CarbonSession.class refers to type Builder
[INFO] in value org.apache.spark.sql.SparkSession which is not available.
[INFO] It may be completely missing from the current classpath, or the version on
[INFO] the classpath might be incompatible with the version used when compiling CarbonSession.class.
[ERROR] four errors found
[INFO] ------------------------------------------------------------------------
[INFO] Reactor Summary:
[INFO] 
[INFO] Apache CarbonData :: Parent ........................ SUCCESS [  3.643 s]
[INFO] Apache CarbonData :: Common ........................ SUCCESS [  5.134 s]
[INFO] Apache CarbonData :: Core .......................... SUCCESS [01:13 min]
[INFO] Apache CarbonData :: Processing .................... SUCCESS [ 11.154 s]
[INFO] Apache CarbonData :: Hadoop ........................ SUCCESS [ 12.691 s]
[INFO] Apache CarbonData :: Spark Common .................. SUCCESS [ 30.971 s]
[INFO] Apache CarbonData :: Spark ......................... SUCCESS [01:52 min]
[INFO] Apache CarbonData :: Spark Common Test ............. SUCCESS [10:25 min]
[INFO] Apache CarbonData :: Assembly ...................... SUCCESS [  4.871 s]
[INFO] Apache CarbonData :: Spark Examples ................ SUCCESS [ 14.057 s]
[INFO] Apache CarbonData :: Flink Examples ................ SUCCESS [  5.962 s]
[INFO] Apache CarbonData :: Hive .......................... FAILURE [  9.865 s]
[INFO] Apache CarbonData :: presto ........................ SKIPPED
[INFO] ------------------------------------------------------------------------
[INFO] BUILD FAILURE
[INFO] ------------------------------------------------------------------------
[INFO] Total time: 15:22 min
[INFO] Finished at: 2017-07-08T02:04:43+00:00
[INFO] Final Memory: 107M/2153M
[INFO] ------------------------------------------------------------------------
Waiting for Jenkins to finish collecting data
[ERROR] Failed to execute goal org.scala-tools:maven-scala-plugin:2.15.2:compile (default)
on project carbondata-hive: wrap: org.apache.commons.exec.ExecuteException: Process exited
with an error: 1(Exit value: 1) -> [Help 1]
org.apache.maven.lifecycle.LifecycleExecutionException: Failed to execute goal org.scala-tools:maven-scala-plugin:2.15.2:compile
(default) on project carbondata-hive: wrap: org.apache.commons.exec.ExecuteException: Process
exited with an error: 1(Exit value: 1)
	at org.apache.maven.lifecycle.internal.MojoExecutor.execute(MojoExecutor.java:212)
	at org.apache.maven.lifecycle.internal.MojoExecutor.execute(MojoExecutor.java:153)
	at org.apache.maven.lifecycle.internal.MojoExecutor.execute(MojoExecutor.java:145)
	at org.apache.maven.lifecycle.internal.LifecycleModuleBuilder.buildProject(LifecycleModuleBuilder.java:116)
	at org.apache.maven.lifecycle.internal.LifecycleModuleBuilder.buildProject(LifecycleModuleBuilder.java:80)
	at org.apache.maven.lifecycle.internal.builder.singlethreaded.SingleThreadedBuilder.build(SingleThreadedBuilder.java:51)
	at org.apache.maven.lifecycle.internal.LifecycleStarter.execute(LifecycleStarter.java:128)
	at org.apache.maven.DefaultMaven.doExecute(DefaultMaven.java:307)
	at org.apache.maven.DefaultMaven.doExecute(DefaultMaven.java:193)
	at org.apache.maven.DefaultMaven.execute(DefaultMaven.java:106)
	at org.jvnet.hudson.maven3.launcher.Maven33Launcher.main(Maven33Launcher.java:129)
	at sun.reflect.NativeMethodAccessorImpl.invoke0(Native Method)
	at sun.reflect.NativeMethodAccessorImpl.invoke(NativeMethodAccessorImpl.java:62)
	at sun.reflect.DelegatingMethodAccessorImpl.invoke(DelegatingMethodAccessorImpl.java:43)
	at java.lang.reflect.Method.invoke(Method.java:498)
	at org.codehaus.plexus.classworlds.launcher.Launcher.launchStandard(Launcher.java:330)
	at org.codehaus.plexus.classworlds.launcher.Launcher.launch(Launcher.java:238)
	at jenkins.maven3.agent.Maven33Main.launch(Maven33Main.java:176)
	at sun.reflect.NativeMethodAccessorImpl.invoke0(Native Method)
	at sun.reflect.NativeMethodAccessorImpl.invoke(NativeMethodAccessorImpl.java:62)
	at sun.reflect.DelegatingMethodAccessorImpl.invoke(DelegatingMethodAccessorImpl.java:43)
	at java.lang.reflect.Method.invoke(Method.java:498)
	at hudson.maven.Maven3Builder.call(Maven3Builder.java:139)
	at hudson.maven.Maven3Builder.call(Maven3Builder.java:70)
	at hudson.remoting.UserRequest.perform(UserRequest.java:153)
	at hudson.remoting.UserRequest.perform(UserRequest.java:50)
	at hudson.remoting.Request$2.run(Request.java:336)
	at hudson.remoting.InterceptingExecutorService$1.call(InterceptingExecutorService.java:68)
	at java.util.concurrent.FutureTask.run(FutureTask.java:266)
	at java.util.concurrent.ThreadPoolExecutor.runWorker(ThreadPoolExecutor.java:1142)
	at java.util.concurrent.ThreadPoolExecutor$Worker.run(ThreadPoolExecutor.java:617)
	at java.lang.Thread.run(Thread.java:748)
Caused by: org.apache.maven.plugin.MojoExecutionException: wrap: org.apache.commons.exec.ExecuteException:
Process exited with an error: 1(Exit value: 1)
	at org_scala_tools_maven.ScalaMojoSupport.execute(ScalaMojoSupport.java:350)
	at org.apache.maven.plugin.DefaultBuildPluginManager.executeMojo(DefaultBuildPluginManager.java:134)
	at org.apache.maven.lifecycle.internal.MojoExecutor.execute(MojoExecutor.java:207)
	... 31 more
Caused by: org.apache.commons.exec.ExecuteException: Process exited with an error: 1(Exit
value: 1)
	at org.apache.commons.exec.DefaultExecutor.executeInternal(DefaultExecutor.java:346)
	at org.apache.commons.exec.DefaultExecutor.execute(DefaultExecutor.java:149)
	at org.apache.commons.exec.DefaultExecutor.execute(DefaultExecutor.java:136)
	at org_scala_tools_maven_executions.JavaMainCallerByFork.run(JavaMainCallerByFork.java:80)
	at org_scala_tools_maven.ScalaCompilerSupport.compile(ScalaCompilerSupport.java:124)
	at org_scala_tools_maven.ScalaCompilerSupport.doExecute(ScalaCompilerSupport.java:80)
	at org_scala_tools_maven.ScalaMojoSupport.execute(ScalaMojoSupport.java:342)
	... 33 more
[ERROR] 
[ERROR] Re-run Maven using the -X switch to enable full debug logging.
[ERROR] 
[ERROR] For more information about the errors and possible solutions, please read the following
articles:
[ERROR] [Help 1] http://cwiki.apache.org/confluence/display/MAVEN/MojoExecutionException
[ERROR] 
[ERROR] After correcting the problems, you can resume the build with the command
[ERROR]   mvn <goals> -rf :carbondata-hive
[JENKINS] Archiving <https://builds.apache.org/job/carbondata-master-spark-1.6/ws/processing/pom.xml>
to org.apache.carbondata/carbondata-processing/1.2.0-SNAPSHOT/carbondata-processing-1.2.0-SNAPSHOT.pom
[JENKINS] Archiving <https://builds.apache.org/job/carbondata-master-spark-1.6/ws/processing/target/carbondata-processing-1.2.0-SNAPSHOT.jar>
to org.apache.carbondata/carbondata-processing/1.2.0-SNAPSHOT/carbondata-processing-1.2.0-SNAPSHOT.jar
[JENKINS] Archiving <https://builds.apache.org/job/carbondata-master-spark-1.6/ws/integration/spark-common/pom.xml>
to org.apache.carbondata/carbondata-spark-common/1.2.0-SNAPSHOT/carbondata-spark-common-1.2.0-SNAPSHOT.pom
[JENKINS] Archiving <https://builds.apache.org/job/carbondata-master-spark-1.6/ws/integration/spark-common/target/carbondata-spark-common-1.2.0-SNAPSHOT.jar>
to org.apache.carbondata/carbondata-spark-common/1.2.0-SNAPSHOT/carbondata-spark-common-1.2.0-SNAPSHOT.jar
[JENKINS] Archiving <https://builds.apache.org/job/carbondata-master-spark-1.6/ws/examples/spark/pom.xml>
to org.apache.carbondata/carbondata-examples-spark/1.2.0-SNAPSHOT/carbondata-examples-spark-1.2.0-SNAPSHOT.pom
[JENKINS] Archiving <https://builds.apache.org/job/carbondata-master-spark-1.6/ws/examples/spark/target/carbondata-examples-spark-1.2.0-SNAPSHOT.jar>
to org.apache.carbondata/carbondata-examples-spark/1.2.0-SNAPSHOT/carbondata-examples-spark-1.2.0-SNAPSHOT.jar
[JENKINS] Archiving <https://builds.apache.org/job/carbondata-master-spark-1.6/ws/integration/hive/pom.xml>
to org.apache.carbondata/carbondata-hive/1.2.0-SNAPSHOT/carbondata-hive-1.2.0-SNAPSHOT.pom
[JENKINS] Archiving <https://builds.apache.org/job/carbondata-master-spark-1.6/ws/common/pom.xml>
to org.apache.carbondata/carbondata-common/1.2.0-SNAPSHOT/carbondata-common-1.2.0-SNAPSHOT.pom
[JENKINS] Archiving <https://builds.apache.org/job/carbondata-master-spark-1.6/ws/common/target/carbondata-common-1.2.0-SNAPSHOT.jar>
to org.apache.carbondata/carbondata-common/1.2.0-SNAPSHOT/carbondata-common-1.2.0-SNAPSHOT.jar
[JENKINS] Archiving <https://builds.apache.org/job/carbondata-master-spark-1.6/ws/assembly/pom.xml>
to org.apache.carbondata/carbondata-assembly/1.2.0-SNAPSHOT/carbondata-assembly-1.2.0-SNAPSHOT.pom
[JENKINS] Archiving <https://builds.apache.org/job/carbondata-master-spark-1.6/ws/pom.xml>
to org.apache.carbondata/carbondata-parent/1.2.0-SNAPSHOT/carbondata-parent-1.2.0-SNAPSHOT.pom
[JENKINS] Archiving <https://builds.apache.org/job/carbondata-master-spark-1.6/ws/examples/flink/pom.xml>
to org.apache.carbondata/carbondata-examples-flink/1.2.0-SNAPSHOT/carbondata-examples-flink-1.2.0-SNAPSHOT.pom
[JENKINS] Archiving <https://builds.apache.org/job/carbondata-master-spark-1.6/ws/examples/flink/target/carbondata-examples-flink-1.2.0-SNAPSHOT.jar>
to org.apache.carbondata/carbondata-examples-flink/1.2.0-SNAPSHOT/carbondata-examples-flink-1.2.0-SNAPSHOT.jar
[JENKINS] Archiving <https://builds.apache.org/job/carbondata-master-spark-1.6/ws/core/pom.xml>
to org.apache.carbondata/carbondata-core/1.2.0-SNAPSHOT/carbondata-core-1.2.0-SNAPSHOT.pom
[JENKINS] Archiving <https://builds.apache.org/job/carbondata-master-spark-1.6/ws/core/target/carbondata-core-1.2.0-SNAPSHOT.jar>
to org.apache.carbondata/carbondata-core/1.2.0-SNAPSHOT/carbondata-core-1.2.0-SNAPSHOT.jar
[JENKINS] Archiving <https://builds.apache.org/job/carbondata-master-spark-1.6/ws/hadoop/pom.xml>
to org.apache.carbondata/carbondata-hadoop/1.2.0-SNAPSHOT/carbondata-hadoop-1.2.0-SNAPSHOT.pom
[JENKINS] Archiving <https://builds.apache.org/job/carbondata-master-spark-1.6/ws/hadoop/target/carbondata-hadoop-1.2.0-SNAPSHOT.jar>
to org.apache.carbondata/carbondata-hadoop/1.2.0-SNAPSHOT/carbondata-hadoop-1.2.0-SNAPSHOT.jar
[JENKINS] Archiving <https://builds.apache.org/job/carbondata-master-spark-1.6/ws/integration/presto/pom.xml>
to org.apache.carbondata/carbondata-presto/1.2.0-SNAPSHOT/carbondata-presto-1.2.0-SNAPSHOT.pom
[JENKINS] Archiving <https://builds.apache.org/job/carbondata-master-spark-1.6/ws/integration/spark-common-test/pom.xml>
to org.apache.carbondata/carbondata-spark-common-test/1.2.0-SNAPSHOT/carbondata-spark-common-test-1.2.0-SNAPSHOT.pom
[JENKINS] Archiving <https://builds.apache.org/job/carbondata-master-spark-1.6/ws/integration/spark-common-test/target/carbondata-spark-common-test-1.2.0-SNAPSHOT.jar>
to org.apache.carbondata/carbondata-spark-common-test/1.2.0-SNAPSHOT/carbondata-spark-common-test-1.2.0-SNAPSHOT.jar
[JENKINS] Archiving <https://builds.apache.org/job/carbondata-master-spark-1.6/ws/integration/spark/pom.xml>
to org.apache.carbondata/carbondata-spark/1.2.0-SNAPSHOT/carbondata-spark-1.2.0-SNAPSHOT.pom
[JENKINS] Archiving <https://builds.apache.org/job/carbondata-master-spark-1.6/ws/integration/spark/target/carbondata-spark-1.2.0-SNAPSHOT.jar>
to org.apache.carbondata/carbondata-spark/1.2.0-SNAPSHOT/carbondata-spark-1.2.0-SNAPSHOT.jar
Sending e-mails to: commits@carbondata.apache.org
channel stopped

Mime
View raw message