carbondata-commits mailing list archives

Site index · List index
Message view « Date » · « Thread »
Top « Date » · « Thread »
From Apache Jenkins Server <jenk...@builds.apache.org>
Subject Build failed in Jenkins: carbondata-master-spark-2.1 #395
Date Wed, 14 Jun 2017 10:54:10 GMT
See <https://builds.apache.org/job/carbondata-master-spark-2.1/395/display/redirect>

------------------------------------------
[...truncated 61.35 KB...]
[INFO] Changes detected - recompiling the module!
[INFO] Compiling 32 source files to <https://builds.apache.org/job/carbondata-master-spark-2.1/ws/hadoop/target/classes>
[INFO] <https://builds.apache.org/job/carbondata-master-spark-2.1/ws/hadoop/src/main/java/org/apache/carbondata/hadoop/CarbonInputFormat.java>:
Some input files use unchecked or unsafe operations.
[INFO] <https://builds.apache.org/job/carbondata-master-spark-2.1/ws/hadoop/src/main/java/org/apache/carbondata/hadoop/CarbonInputFormat.java>:
Recompile with -Xlint:unchecked for details.
[INFO] 
[INFO] --- maven-resources-plugin:2.7:testResources (default-testResources) @ carbondata-hadoop
---
[INFO] Using 'UTF-8' encoding to copy filtered resources.
[INFO] Copying 1 resource
[INFO] Copying 3 resources
[INFO] 
[INFO] --- maven-compiler-plugin:3.2:testCompile (default-testCompile) @ carbondata-hadoop
---
[INFO] Changes detected - recompiling the module!
[INFO] Compiling 5 source files to <https://builds.apache.org/job/carbondata-master-spark-2.1/ws/hadoop/target/test-classes>
[INFO] <https://builds.apache.org/job/carbondata-master-spark-2.1/ws/hadoop/src/test/java/org/apache/carbondata/hadoop/test/util/StoreCreator.java>:
<https://builds.apache.org/job/carbondata-master-spark-2.1/ws/hadoop/src/test/java/org/apache/carbondata/hadoop/test/util/StoreCreator.java>
uses unchecked or unsafe operations.
[INFO] <https://builds.apache.org/job/carbondata-master-spark-2.1/ws/hadoop/src/test/java/org/apache/carbondata/hadoop/test/util/StoreCreator.java>:
Recompile with -Xlint:unchecked for details.
[INFO] 
[INFO] --- maven-surefire-plugin:2.18.1:test (default-test) @ carbondata-hadoop ---
[INFO] Surefire report directory: <https://builds.apache.org/job/carbondata-master-spark-2.1/ws/hadoop/target/surefire-reports>

-------------------------------------------------------
 T E S T S
-------------------------------------------------------
log4j:WARN No appenders could be found for logger (org.apache.hadoop.metrics2.lib.MutableMetricsFactory).
log4j:WARN Please initialize the log4j system properly.
log4j:WARN See http://logging.apache.org/log4j/1.2/faq.html#noconfig for more info.
Running org.apache.carbondata.hadoop.test.util.ObjectSerializationUtilTest
Tests run: 2, Failures: 0, Errors: 0, Skipped: 0, Time elapsed: 0.183 sec - in org.apache.carbondata.hadoop.test.util.ObjectSerializationUtilTest
Running org.apache.carbondata.hadoop.ft.CarbonInputMapperTest
Tests run: 3, Failures: 0, Errors: 0, Skipped: 0, Time elapsed: 4.789 sec - in org.apache.carbondata.hadoop.ft.CarbonInputMapperTest
Running org.apache.carbondata.hadoop.ft.InputFilesTest
Tests run: 1, Failures: 0, Errors: 0, Skipped: 0, Time elapsed: 3.282 sec - in org.apache.carbondata.hadoop.ft.InputFilesTest

Results :

Tests run: 6, Failures: 0, Errors: 0, Skipped: 0

[JENKINS] Recording test results
[INFO] 
[INFO] --- maven-jar-plugin:2.5:jar (default-jar) @ carbondata-hadoop ---
[INFO] Building jar: <https://builds.apache.org/job/carbondata-master-spark-2.1/ws/hadoop/target/carbondata-hadoop-1.2.0-SNAPSHOT.jar>
[INFO] 
[INFO] --- maven-site-plugin:3.4:attach-descriptor (attach-descriptor) @ carbondata-hadoop
---
[INFO] 
[INFO] --- maven-checkstyle-plugin:2.17:check (default) @ carbondata-hadoop ---
[INFO] Starting audit...
Audit done.
[INFO] 
[INFO] --- scalastyle-maven-plugin:0.8.0:check (default) @ carbondata-hadoop ---
[WARNING] sourceDirectory is not specified or does not exist value=<https://builds.apache.org/job/carbondata-master-spark-2.1/ws/hadoop/src/main/scala>
Saving to outputFile=<https://builds.apache.org/job/carbondata-master-spark-2.1/ws/hadoop/target/scalastyle-output.xml>
Processed 0 file(s)
Found 0 errors
Found 0 warnings
Found 0 infos
Finished in 3 ms
[INFO] 
[INFO] --- maven-install-plugin:2.5.2:install (default-install) @ carbondata-hadoop ---
[INFO] Installing <https://builds.apache.org/job/carbondata-master-spark-2.1/ws/hadoop/target/carbondata-hadoop-1.2.0-SNAPSHOT.jar>
to /home/jenkins/jenkins-slave/maven-repositories/1/org/apache/carbondata/carbondata-hadoop/1.2.0-SNAPSHOT/carbondata-hadoop-1.2.0-SNAPSHOT.jar
[INFO] Installing <https://builds.apache.org/job/carbondata-master-spark-2.1/ws/hadoop/pom.xml>
to /home/jenkins/jenkins-slave/maven-repositories/1/org/apache/carbondata/carbondata-hadoop/1.2.0-SNAPSHOT/carbondata-hadoop-1.2.0-SNAPSHOT.pom
[INFO]                                                                         
[INFO] ------------------------------------------------------------------------
[INFO] Building Apache CarbonData :: Spark Common 1.2.0-SNAPSHOT
[INFO] ------------------------------------------------------------------------
[INFO] 
[INFO] --- maven-clean-plugin:2.5:clean (default-clean) @ carbondata-spark-common ---
[INFO] Deleting <https://builds.apache.org/job/carbondata-master-spark-2.1/ws/integration/spark-common/target>
[INFO] 
[INFO] --- maven-remote-resources-plugin:1.5:process (default) @ carbondata-spark-common ---
[INFO] 
[INFO] --- maven-resources-plugin:2.7:resources (default-resources) @ carbondata-spark-common
---
[INFO] Using 'UTF-8' encoding to copy filtered resources.
[INFO] skip non existing resourceDirectory <https://builds.apache.org/job/carbondata-master-spark-2.1/ws/integration/spark-common/src/resources>
[INFO] Copying 0 resource
[INFO] Copying 3 resources
[INFO] 
[INFO] --- maven-scala-plugin:2.15.2:compile (default) @ carbondata-spark-common ---
[INFO] Checking for multiple versions of scala
[INFO] includes = [**/*.java,**/*.scala,]
[INFO] excludes = []
[INFO] <https://builds.apache.org/job/carbondata-master-spark-2.1/ws/integration/spark-common/src/main/java>:-1:
info: compiling
[INFO] <https://builds.apache.org/job/carbondata-master-spark-2.1/ws/integration/spark-common/src/main/scala>:-1:
info: compiling
[INFO] Compiling 61 source files to <https://builds.apache.org/job/carbondata-master-spark-2.1/ws/integration/spark-common/target/classes>
at 1497437578380
[WARNING] <https://builds.apache.org/job/carbondata-master-spark-2.1/ws/integration/spark-common/src/main/scala/org/apache/carbondata/spark/rdd/AlterTableAddColumnRDD.scala>:51:
warning: no valid targets for annotation on value newColumns - it is discarded unused. You
may specify targets with meta-annotations, e.g. @(transient @param)
[INFO]     @transient newColumns: Seq[ColumnSchema],
[INFO]      ^
[WARNING] <https://builds.apache.org/job/carbondata-master-spark-2.1/ws/integration/spark-common/src/main/scala/org/apache/carbondata/spark/rdd/AlterTableDropColumnRDD.scala>:49:
warning: no valid targets for annotation on value newColumns - it is discarded unused. You
may specify targets with meta-annotations, e.g. @(transient @param)
[INFO]     @transient newColumns: Seq[ColumnSchema],
[INFO]      ^
[WARNING] <https://builds.apache.org/job/carbondata-master-spark-2.1/ws/integration/spark-common/src/main/scala/org/apache/carbondata/spark/rdd/CarbonScanRDD.scala>:52:
warning: no valid targets for annotation on value sc - it is discarded unused. You may specify
targets with meta-annotations, e.g. @(transient @param)
[INFO]     @transient sc: SparkContext,
[INFO]      ^
[WARNING] <https://builds.apache.org/job/carbondata-master-spark-2.1/ws/integration/spark-common/src/main/scala/org/apache/carbondata/spark/rdd/CarbonScanRDD.scala>:56:
warning: no valid targets for annotation on value carbonTable - it is discarded unused. You
may specify targets with meta-annotations, e.g. @(transient @param)
[INFO]     @transient carbonTable: CarbonTable)
[INFO]      ^
[WARNING] <https://builds.apache.org/job/carbondata-master-spark-2.1/ws/integration/spark-common/src/main/scala/org/apache/carbondata/spark/rdd/UpdateCoalescedRDD.scala>:23:
warning: imported `CoalescedRDDPartition' is permanently hidden by definition of object CoalescedRDDPartition
in package rdd
[INFO] import org.apache.spark.rdd.{CoalescedRDDPartition, DataLoadPartitionCoalescer, RDD}
[INFO]                              ^
[WARNING] <https://builds.apache.org/job/carbondata-master-spark-2.1/ws/integration/spark-common/src/main/scala/org/apache/carbondata/spark/rdd/UpdateCoalescedRDD.scala>:23:
warning: imported `CoalescedRDDPartition' is permanently hidden by definition of class CoalescedRDDPartition
in package rdd
[INFO] import org.apache.spark.rdd.{CoalescedRDDPartition, DataLoadPartitionCoalescer, RDD}
[INFO]                              ^
[WARNING] <https://builds.apache.org/job/carbondata-master-spark-2.1/ws/integration/spark-common/src/main/scala/org/apache/carbondata/spark/rdd/UpdateCoalescedRDD.scala>:23:
warning: imported `DataLoadPartitionCoalescer' is permanently hidden by definition of object
DataLoadPartitionCoalescer in package rdd
[INFO] import org.apache.spark.rdd.{CoalescedRDDPartition, DataLoadPartitionCoalescer, RDD}
[INFO]                                                     ^
[WARNING] <https://builds.apache.org/job/carbondata-master-spark-2.1/ws/integration/spark-common/src/main/scala/org/apache/carbondata/spark/rdd/UpdateCoalescedRDD.scala>:23:
warning: imported `DataLoadPartitionCoalescer' is permanently hidden by definition of class
DataLoadPartitionCoalescer in package rdd
[INFO] import org.apache.spark.rdd.{CoalescedRDDPartition, DataLoadPartitionCoalescer, RDD}
[INFO]                                                     ^
[WARNING] <https://builds.apache.org/job/carbondata-master-spark-2.1/ws/integration/spark-common/src/main/scala/org/apache/carbondata/spark/rdd/UpdateCoalescedRDD.scala>:23:
warning: imported `RDD' is permanently hidden by definition of object RDD in package rdd
[INFO] import org.apache.spark.rdd.{CoalescedRDDPartition, DataLoadPartitionCoalescer, RDD}
[INFO]                                                                                 ^
[WARNING] <https://builds.apache.org/job/carbondata-master-spark-2.1/ws/integration/spark-common/src/main/scala/org/apache/carbondata/spark/rdd/UpdateCoalescedRDD.scala>:23:
warning: imported `RDD' is permanently hidden by definition of class RDD in package rdd
[INFO] import org.apache.spark.rdd.{CoalescedRDDPartition, DataLoadPartitionCoalescer, RDD}
[INFO]                                                                                 ^
[WARNING] <https://builds.apache.org/job/carbondata-master-spark-2.1/ws/integration/spark-common/src/main/scala/org/apache/carbondata/spark/util/CarbonScalaUtil.scala>:125:
warning: non-variable type argument Any in type pattern scala.collection.Map[Any,Any] is unchecked
since it is eliminated by erasure
[INFO]         case m: scala.collection.Map[Any, Any] =>
[INFO]                                  ^
[WARNING] <https://builds.apache.org/job/carbondata-master-spark-2.1/ws/integration/spark-common/src/main/scala/org/apache/carbondata/spark/rdd/DataLoadPartitionCoalescer.scala>:193:
warning: match may not be exhaustive.
[INFO] It would fail on the following input: None
[INFO]                 hostMapPartitionIds.get(loc) match {
[INFO]                                        ^
[WARNING] <https://builds.apache.org/job/carbondata-master-spark-2.1/ws/integration/spark-common/src/main/scala/org/apache/carbondata/spark/rdd/DataLoadPartitionCoalescer.scala>:190:
warning: match may not be exhaustive.
[INFO] It would fail on the following input: None
[INFO]           partitionIdMapHosts.get(partitionId) match {
[INFO]                                  ^
[WARNING] <https://builds.apache.org/job/carbondata-master-spark-2.1/ws/integration/spark-common/src/main/scala/org/apache/carbondata/spark/util/CarbonScalaUtil.scala>:68:
warning: match may not be exhaustive.
[INFO] It would fail on the following inputs: ARRAY, BYTE, BYTE_ARRAY, FLOAT, MAP, NULL, STRUCT
[INFO]     dataType match {
[INFO]     ^
[WARNING] <https://builds.apache.org/job/carbondata-master-spark-2.1/ws/integration/spark-common/src/main/scala/org/apache/carbondata/spark/util/DataTypeConverterUtil.scala>:76:
warning: match may not be exhaustive.
[INFO] It would fail on the following inputs: BOOLEAN, BYTE, BYTE_ARRAY, MAP, NULL
[INFO]     dataType match {
[INFO]     ^
[INFO] #
[ERROR] # A fatal error has been detected by the Java Runtime Environment:
[INFO] #
[ERROR] #  Internal Error (output.cpp:1593), pid=8776, tid=0x00007f474955f700
[INFO] #  guarantee((int)(blk_starts[i+1] - blk_starts[i]) >= (current_offset - blk_offset))
failed: shouldn't increase block size
[INFO] #
[INFO] # JRE version: Java(TM) SE Runtime Environment (8.0_131-b11) (build 1.8.0_131-b11)
[INFO] # Java VM: Java HotSpot(TM) 64-Bit Server VM (25.131-b11 mixed mode linux-amd64 compressed
oops)
[INFO] # Failed to write core dump. Core dumps have been disabled. To enable core dumping,
try "ulimit -c unlimited" before starting Java again
[INFO] #
[ERROR] # An error report file with more information is saved as:
[INFO] # <https://builds.apache.org/job/carbondata-master-spark-2.1/ws/hs_err_pid8776.log>
[INFO] 
[ERROR] [error occurred during error reporting , id 0xb]
[INFO] 
[INFO] #
[INFO] # If you would like to submit a bug report, please visit:
[INFO] #   http://bugreport.java.com/bugreport/crash.jsp
[INFO] #
[INFO] ------------------------------------------------------------------------
[INFO] Reactor Summary:
[INFO] 
[INFO] Apache CarbonData :: Parent ........................ SUCCESS [ 11.007 s]
[INFO] Apache CarbonData :: Common ........................ SUCCESS [ 10.748 s]
[INFO] Apache CarbonData :: Core .......................... SUCCESS [02:49 min]
[INFO] Apache CarbonData :: Processing .................... SUCCESS [ 23.357 s]
[INFO] Apache CarbonData :: Hadoop ........................ SUCCESS [ 23.658 s]
[INFO] Apache CarbonData :: Spark Common .................. FAILURE [ 41.645 s]
[INFO] Apache CarbonData :: Spark2 ........................ SKIPPED
[INFO] Apache CarbonData :: Spark Common Test ............. SKIPPED
[INFO] Apache CarbonData :: Assembly ...................... SKIPPED
[INFO] Apache CarbonData :: Flink Examples ................ SKIPPED
[INFO] Apache CarbonData :: Hive .......................... SKIPPED
[INFO] Apache CarbonData :: presto ........................ SKIPPED
[INFO] Apache CarbonData :: Spark2 Examples ............... SKIPPED
[INFO] ------------------------------------------------------------------------
[INFO] BUILD FAILURE
[INFO] ------------------------------------------------------------------------
[INFO] Total time: 05:09 min
[INFO] Finished at: 2017-06-14T10:53:43+00:00
[INFO] Final Memory: 90M/1216M
[INFO] ------------------------------------------------------------------------
Waiting for Jenkins to finish collecting data
[ERROR] Failed to execute goal org.scala-tools:maven-scala-plugin:2.15.2:compile (default)
on project carbondata-spark-common: wrap: org.apache.commons.exec.ExecuteException: Process
exited with an error: 134(Exit value: 134) -> [Help 1]
org.apache.maven.lifecycle.LifecycleExecutionException: Failed to execute goal org.scala-tools:maven-scala-plugin:2.15.2:compile
(default) on project carbondata-spark-common: wrap: org.apache.commons.exec.ExecuteException:
Process exited with an error: 134(Exit value: 134)
	at org.apache.maven.lifecycle.internal.MojoExecutor.execute(MojoExecutor.java:212)
	at org.apache.maven.lifecycle.internal.MojoExecutor.execute(MojoExecutor.java:153)
	at org.apache.maven.lifecycle.internal.MojoExecutor.execute(MojoExecutor.java:145)
	at org.apache.maven.lifecycle.internal.LifecycleModuleBuilder.buildProject(LifecycleModuleBuilder.java:116)
	at org.apache.maven.lifecycle.internal.LifecycleModuleBuilder.buildProject(LifecycleModuleBuilder.java:80)
	at org.apache.maven.lifecycle.internal.builder.singlethreaded.SingleThreadedBuilder.build(SingleThreadedBuilder.java:51)
	at org.apache.maven.lifecycle.internal.LifecycleStarter.execute(LifecycleStarter.java:128)
	at org.apache.maven.DefaultMaven.doExecute(DefaultMaven.java:307)
	at org.apache.maven.DefaultMaven.doExecute(DefaultMaven.java:193)
	at org.apache.maven.DefaultMaven.execute(DefaultMaven.java:106)
	at org.jvnet.hudson.maven3.launcher.Maven33Launcher.main(Maven33Launcher.java:129)
	at sun.reflect.NativeMethodAccessorImpl.invoke0(Native Method)
	at sun.reflect.NativeMethodAccessorImpl.invoke(NativeMethodAccessorImpl.java:62)
	at sun.reflect.DelegatingMethodAccessorImpl.invoke(DelegatingMethodAccessorImpl.java:43)
	at java.lang.reflect.Method.invoke(Method.java:498)
	at org.codehaus.plexus.classworlds.launcher.Launcher.launchStandard(Launcher.java:330)
	at org.codehaus.plexus.classworlds.launcher.Launcher.launch(Launcher.java:238)
	at jenkins.maven3.agent.Maven33Main.launch(Maven33Main.java:176)
	at sun.reflect.NativeMethodAccessorImpl.invoke0(Native Method)
	at sun.reflect.NativeMethodAccessorImpl.invoke(NativeMethodAccessorImpl.java:62)
	at sun.reflect.DelegatingMethodAccessorImpl.invoke(DelegatingMethodAccessorImpl.java:43)
	at java.lang.reflect.Method.invoke(Method.java:498)
	at hudson.maven.Maven3Builder.call(Maven3Builder.java:139)
	at hudson.maven.Maven3Builder.call(Maven3Builder.java:70)
	at hudson.remoting.UserRequest.perform(UserRequest.java:153)
	at hudson.remoting.UserRequest.perform(UserRequest.java:50)
	at hudson.remoting.Request$2.run(Request.java:336)
	at hudson.remoting.InterceptingExecutorService$1.call(InterceptingExecutorService.java:68)
	at java.util.concurrent.FutureTask.run(FutureTask.java:266)
	at java.util.concurrent.ThreadPoolExecutor.runWorker(ThreadPoolExecutor.java:1142)
	at java.util.concurrent.ThreadPoolExecutor$Worker.run(ThreadPoolExecutor.java:617)
	at java.lang.Thread.run(Thread.java:748)
Caused by: org.apache.maven.plugin.MojoExecutionException: wrap: org.apache.commons.exec.ExecuteException:
Process exited with an error: 134(Exit value: 134)
	at org_scala_tools_maven.ScalaMojoSupport.execute(ScalaMojoSupport.java:350)
	at org.apache.maven.plugin.DefaultBuildPluginManager.executeMojo(DefaultBuildPluginManager.java:134)
	at org.apache.maven.lifecycle.internal.MojoExecutor.execute(MojoExecutor.java:207)
	... 31 more
Caused by: org.apache.commons.exec.ExecuteException: Process exited with an error: 134(Exit
value: 134)
	at org.apache.commons.exec.DefaultExecutor.executeInternal(DefaultExecutor.java:346)
	at org.apache.commons.exec.DefaultExecutor.execute(DefaultExecutor.java:149)
	at org.apache.commons.exec.DefaultExecutor.execute(DefaultExecutor.java:136)
	at org_scala_tools_maven_executions.JavaMainCallerByFork.run(JavaMainCallerByFork.java:80)
	at org_scala_tools_maven.ScalaCompilerSupport.compile(ScalaCompilerSupport.java:124)
	at org_scala_tools_maven.ScalaCompilerSupport.doExecute(ScalaCompilerSupport.java:80)
	at org_scala_tools_maven.ScalaMojoSupport.execute(ScalaMojoSupport.java:342)
	... 33 more
[ERROR] 
[ERROR] Re-run Maven using the -X switch to enable full debug logging.
[ERROR] 
[ERROR] For more information about the errors and possible solutions, please read the following
articles:
[ERROR] [Help 1] http://cwiki.apache.org/confluence/display/MAVEN/MojoExecutionException
[ERROR] 
[ERROR] After correcting the problems, you can resume the build with the command
[ERROR]   mvn <goals> -rf :carbondata-spark-common
[JENKINS] Archiving <https://builds.apache.org/job/carbondata-master-spark-2.1/ws/processing/pom.xml>
to org.apache.carbondata/carbondata-processing/1.2.0-SNAPSHOT/carbondata-processing-1.2.0-SNAPSHOT.pom
[JENKINS] Archiving <https://builds.apache.org/job/carbondata-master-spark-2.1/ws/processing/target/carbondata-processing-1.2.0-SNAPSHOT.jar>
to org.apache.carbondata/carbondata-processing/1.2.0-SNAPSHOT/carbondata-processing-1.2.0-SNAPSHOT.jar
[JENKINS] Archiving <https://builds.apache.org/job/carbondata-master-spark-2.1/ws/integration/spark-common/pom.xml>
to org.apache.carbondata/carbondata-spark-common/1.2.0-SNAPSHOT/carbondata-spark-common-1.2.0-SNAPSHOT.pom
[JENKINS] Archiving <https://builds.apache.org/job/carbondata-master-spark-2.1/ws/integration/hive/pom.xml>
to org.apache.carbondata/carbondata-hive/1.2.0-SNAPSHOT/carbondata-hive-1.2.0-SNAPSHOT.pom
[JENKINS] Archiving <https://builds.apache.org/job/carbondata-master-spark-2.1/ws/common/pom.xml>
to org.apache.carbondata/carbondata-common/1.2.0-SNAPSHOT/carbondata-common-1.2.0-SNAPSHOT.pom
[JENKINS] Archiving <https://builds.apache.org/job/carbondata-master-spark-2.1/ws/common/target/carbondata-common-1.2.0-SNAPSHOT.jar>
to org.apache.carbondata/carbondata-common/1.2.0-SNAPSHOT/carbondata-common-1.2.0-SNAPSHOT.jar
[JENKINS] Archiving <https://builds.apache.org/job/carbondata-master-spark-2.1/ws/examples/spark2/pom.xml>
to org.apache.carbondata/carbondata-examples-spark2/1.2.0-SNAPSHOT/carbondata-examples-spark2-1.2.0-SNAPSHOT.pom
[JENKINS] Archiving <https://builds.apache.org/job/carbondata-master-spark-2.1/ws/integration/spark2/pom.xml>
to org.apache.carbondata/carbondata-spark2/1.2.0-SNAPSHOT/carbondata-spark2-1.2.0-SNAPSHOT.pom
[JENKINS] Archiving <https://builds.apache.org/job/carbondata-master-spark-2.1/ws/assembly/pom.xml>
to org.apache.carbondata/carbondata-assembly/1.2.0-SNAPSHOT/carbondata-assembly-1.2.0-SNAPSHOT.pom
[JENKINS] Archiving <https://builds.apache.org/job/carbondata-master-spark-2.1/ws/pom.xml>
to org.apache.carbondata/carbondata-parent/1.2.0-SNAPSHOT/carbondata-parent-1.2.0-SNAPSHOT.pom
[JENKINS] Archiving <https://builds.apache.org/job/carbondata-master-spark-2.1/ws/examples/flink/pom.xml>
to org.apache.carbondata/carbondata-examples-flink/1.2.0-SNAPSHOT/carbondata-examples-flink-1.2.0-SNAPSHOT.pom
[JENKINS] Archiving <https://builds.apache.org/job/carbondata-master-spark-2.1/ws/core/pom.xml>
to org.apache.carbondata/carbondata-core/1.2.0-SNAPSHOT/carbondata-core-1.2.0-SNAPSHOT.pom
[JENKINS] Archiving <https://builds.apache.org/job/carbondata-master-spark-2.1/ws/core/target/carbondata-core-1.2.0-SNAPSHOT.jar>
to org.apache.carbondata/carbondata-core/1.2.0-SNAPSHOT/carbondata-core-1.2.0-SNAPSHOT.jar
[JENKINS] Archiving <https://builds.apache.org/job/carbondata-master-spark-2.1/ws/hadoop/pom.xml>
to org.apache.carbondata/carbondata-hadoop/1.2.0-SNAPSHOT/carbondata-hadoop-1.2.0-SNAPSHOT.pom
[JENKINS] Archiving <https://builds.apache.org/job/carbondata-master-spark-2.1/ws/hadoop/target/carbondata-hadoop-1.2.0-SNAPSHOT.jar>
to org.apache.carbondata/carbondata-hadoop/1.2.0-SNAPSHOT/carbondata-hadoop-1.2.0-SNAPSHOT.jar
[JENKINS] Archiving <https://builds.apache.org/job/carbondata-master-spark-2.1/ws/integration/presto/pom.xml>
to org.apache.carbondata/carbondata-presto/1.2.0-SNAPSHOT/carbondata-presto-1.2.0-SNAPSHOT.pom
[JENKINS] Archiving <https://builds.apache.org/job/carbondata-master-spark-2.1/ws/integration/spark-common-test/pom.xml>
to org.apache.carbondata/carbondata-spark-common-test/1.2.0-SNAPSHOT/carbondata-spark-common-test-1.2.0-SNAPSHOT.pom
Sending e-mails to: commits@carbondata.apache.org
channel stopped

Mime
View raw message