carbondata-commits mailing list archives

Site index · List index
Message view « Date » · « Thread »
Top « Date » · « Thread »
From Apache Jenkins Server <jenk...@builds.apache.org>
Subject Build failed in Jenkins: carbondata-master-spark-2.1 #130
Date Wed, 26 Apr 2017 14:51:37 GMT
See <https://builds.apache.org/job/carbondata-master-spark-2.1/130/display/redirect?page=changes>

Changes:

[ranmx] [CARBONDATA-990] fix instruction error

------------------------------------------
[...truncated 144.72 KB...]
[INFO] Installing <https://builds.apache.org/job/carbondata-master-spark-2.1/ws/hadoop/pom.xml>
to /home/jenkins/jenkins-slave/maven-repositories/0/org/apache/carbondata/carbondata-hadoop/1.1.0-incubating-SNAPSHOT/carbondata-hadoop-1.1.0-incubating-SNAPSHOT.pom
[INFO] 
[INFO] --- maven-deploy-plugin:2.8.2:deploy (default-deploy) @ carbondata-hadoop ---
[INFO] Downloading: https://repository.apache.org/content/repositories/snapshots/org/apache/carbondata/carbondata-hadoop/1.1.0-incubating-SNAPSHOT/maven-metadata.xml
[INFO] Downloaded: https://repository.apache.org/content/repositories/snapshots/org/apache/carbondata/carbondata-hadoop/1.1.0-incubating-SNAPSHOT/maven-metadata.xml
(827 B at 1.4 KB/sec)
[INFO] Uploading: https://repository.apache.org/content/repositories/snapshots/org/apache/carbondata/carbondata-hadoop/1.1.0-incubating-SNAPSHOT/carbondata-hadoop-1.1.0-incubating-20170426.145018-404.jar
[INFO] Uploaded: https://repository.apache.org/content/repositories/snapshots/org/apache/carbondata/carbondata-hadoop/1.1.0-incubating-SNAPSHOT/carbondata-hadoop-1.1.0-incubating-20170426.145018-404.jar
(71 KB at 60.9 KB/sec)
[INFO] Uploading: https://repository.apache.org/content/repositories/snapshots/org/apache/carbondata/carbondata-hadoop/1.1.0-incubating-SNAPSHOT/carbondata-hadoop-1.1.0-incubating-20170426.145018-404.pom
[INFO] Uploaded: https://repository.apache.org/content/repositories/snapshots/org/apache/carbondata/carbondata-hadoop/1.1.0-incubating-SNAPSHOT/carbondata-hadoop-1.1.0-incubating-20170426.145018-404.pom
(3 KB at 2.5 KB/sec)
[INFO] Downloading: https://repository.apache.org/content/repositories/snapshots/org/apache/carbondata/carbondata-hadoop/maven-metadata.xml
[INFO] Downloaded: https://repository.apache.org/content/repositories/snapshots/org/apache/carbondata/carbondata-hadoop/maven-metadata.xml
(482 B at 0.8 KB/sec)
[INFO] Uploading: https://repository.apache.org/content/repositories/snapshots/org/apache/carbondata/carbondata-hadoop/1.1.0-incubating-SNAPSHOT/maven-metadata.xml
[INFO] Uploaded: https://repository.apache.org/content/repositories/snapshots/org/apache/carbondata/carbondata-hadoop/1.1.0-incubating-SNAPSHOT/maven-metadata.xml
(827 B at 0.9 KB/sec)
[INFO] Uploading: https://repository.apache.org/content/repositories/snapshots/org/apache/carbondata/carbondata-hadoop/maven-metadata.xml
[INFO] Uploaded: https://repository.apache.org/content/repositories/snapshots/org/apache/carbondata/carbondata-hadoop/maven-metadata.xml
(482 B at 0.5 KB/sec)
[INFO]                                                                         
[INFO] ------------------------------------------------------------------------
[INFO] Building Apache CarbonData :: Spark Common 1.1.0-incubating-SNAPSHOT
[INFO] ------------------------------------------------------------------------
[INFO] Downloading: http://repo1.maven.org/maven2/org/apache/spark/spark-hive-thriftserver_2.11/2.1.0/spark-hive-thriftserver_2.11-2.1.0.pom
[INFO] Downloaded: http://repo1.maven.org/maven2/org/apache/spark/spark-hive-thriftserver_2.11/2.1.0/spark-hive-thriftserver_2.11-2.1.0.pom
(14 KB at 1126.6 KB/sec)
[INFO] Downloading: http://repo1.maven.org/maven2/org/apache/spark/spark-hive_2.11/2.1.0/spark-hive_2.11-2.1.0.pom
[INFO] Downloaded: http://repo1.maven.org/maven2/org/apache/spark/spark-hive_2.11/2.1.0/spark-hive_2.11-2.1.0.pom
(19 KB at 1667.1 KB/sec)
[INFO] Downloading: http://repo1.maven.org/maven2/org/spark-project/hive/hive-exec/1.2.1.spark2/hive-exec-1.2.1.spark2.pom
[INFO] Downloaded: http://repo1.maven.org/maven2/org/spark-project/hive/hive-exec/1.2.1.spark2/hive-exec-1.2.1.spark2.pom
(28 KB at 2494.7 KB/sec)
[INFO] Downloading: http://repo1.maven.org/maven2/org/spark-project/hive/hive/1.2.1.spark2/hive-1.2.1.spark2.pom
[INFO] Downloaded: http://repo1.maven.org/maven2/org/spark-project/hive/hive/1.2.1.spark2/hive-1.2.1.spark2.pom
(48 KB at 3928.4 KB/sec)
[INFO] Downloading: http://repo1.maven.org/maven2/org/spark-project/hive/hive-metastore/1.2.1.spark2/hive-metastore-1.2.1.spark2.pom
[INFO] Downloaded: http://repo1.maven.org/maven2/org/spark-project/hive/hive-metastore/1.2.1.spark2/hive-metastore-1.2.1.spark2.pom
(9 KB at 884.8 KB/sec)
[INFO] Downloading: http://repo1.maven.org/maven2/joda-time/joda-time/2.9.3/joda-time-2.9.3.pom
[INFO] Downloaded: http://repo1.maven.org/maven2/joda-time/joda-time/2.9.3/joda-time-2.9.3.pom
(30 KB at 2932.2 KB/sec)
[INFO] Downloading: http://repo1.maven.org/maven2/org/spark-project/hive/hive-cli/1.2.1.spark2/hive-cli-1.2.1.spark2.pom
[INFO] Downloaded: http://repo1.maven.org/maven2/org/spark-project/hive/hive-cli/1.2.1.spark2/hive-cli-1.2.1.spark2.pom
(6 KB at 470.1 KB/sec)
[INFO] Downloading: http://repo1.maven.org/maven2/org/spark-project/hive/hive-jdbc/1.2.1.spark2/hive-jdbc-1.2.1.spark2.pom
[INFO] Downloaded: http://repo1.maven.org/maven2/org/spark-project/hive/hive-jdbc/1.2.1.spark2/hive-jdbc-1.2.1.spark2.pom
(8 KB at 746.0 KB/sec)
[INFO] Downloading: http://repo1.maven.org/maven2/org/apache/httpcomponents/httpclient/4.4/httpclient-4.4.pom
[INFO] Downloaded: http://repo1.maven.org/maven2/org/apache/httpcomponents/httpclient/4.4/httpclient-4.4.pom
(7 KB at 694.3 KB/sec)
[INFO] Downloading: http://repo1.maven.org/maven2/org/apache/httpcomponents/httpcomponents-client/4.4/httpcomponents-client-4.4.pom
[INFO] Downloaded: http://repo1.maven.org/maven2/org/apache/httpcomponents/httpcomponents-client/4.4/httpcomponents-client-4.4.pom
(16 KB at 1529.0 KB/sec)
[INFO] Downloading: http://repo1.maven.org/maven2/org/apache/httpcomponents/httpcore/4.4/httpcore-4.4.pom
[INFO] Downloaded: http://repo1.maven.org/maven2/org/apache/httpcomponents/httpcore/4.4/httpcore-4.4.pom
(5 KB at 408.6 KB/sec)
[INFO] Downloading: http://repo1.maven.org/maven2/org/apache/httpcomponents/httpcomponents-core/4.4/httpcomponents-core-4.4.pom
[INFO] Downloaded: http://repo1.maven.org/maven2/org/apache/httpcomponents/httpcomponents-core/4.4/httpcomponents-core-4.4.pom
(13 KB at 1255.8 KB/sec)
[INFO] Downloading: http://repo1.maven.org/maven2/org/spark-project/hive/hive-beeline/1.2.1.spark2/hive-beeline-1.2.1.spark2.pom
[INFO] Downloaded: http://repo1.maven.org/maven2/org/spark-project/hive/hive-beeline/1.2.1.spark2/hive-beeline-1.2.1.spark2.pom
(6 KB at 485.2 KB/sec)
[INFO] Downloading: http://repo1.maven.org/maven2/org/scalatest/scalatest_2.11/2.2.1/scalatest_2.11-2.2.1.pom
[INFO] Downloaded: http://repo1.maven.org/maven2/org/scalatest/scalatest_2.11/2.2.1/scalatest_2.11-2.2.1.pom
(6 KB at 495.8 KB/sec)
[INFO] Downloading: http://repo1.maven.org/maven2/org/apache/spark/spark-hive-thriftserver_2.11/2.1.0/spark-hive-thriftserver_2.11-2.1.0.jar
[INFO] Downloading: http://repo1.maven.org/maven2/org/spark-project/hive/hive-exec/1.2.1.spark2/hive-exec-1.2.1.spark2.jar
[INFO] Downloading: http://repo1.maven.org/maven2/org/apache/spark/spark-hive_2.11/2.1.0/spark-hive_2.11-2.1.0.jar
[INFO] Downloading: http://repo1.maven.org/maven2/org/spark-project/hive/hive-metastore/1.2.1.spark2/hive-metastore-1.2.1.spark2.jar
[INFO] Downloading: http://repo1.maven.org/maven2/joda-time/joda-time/2.9.3/joda-time-2.9.3.jar
[INFO] Downloaded: http://repo1.maven.org/maven2/org/apache/spark/spark-hive_2.11/2.1.0/spark-hive_2.11-2.1.0.jar
(1160 KB at 22291.5 KB/sec)
[INFO] Downloading: http://repo1.maven.org/maven2/org/spark-project/hive/hive-cli/1.2.1.spark2/hive-cli-1.2.1.spark2.jar
[INFO] Downloaded: http://repo1.maven.org/maven2/org/spark-project/hive/hive-cli/1.2.1.spark2/hive-cli-1.2.1.spark2.jar
(40 KB at 642.9 KB/sec)
[INFO] Downloading: http://repo1.maven.org/maven2/org/spark-project/hive/hive-jdbc/1.2.1.spark2/hive-jdbc-1.2.1.spark2.jar
[INFO] Downloaded: http://repo1.maven.org/maven2/joda-time/joda-time/2.9.3/joda-time-2.9.3.jar
(614 KB at 8285.1 KB/sec)
[INFO] Downloading: http://repo1.maven.org/maven2/org/apache/httpcomponents/httpcore/4.4/httpcore-4.4.jar
[INFO] Downloaded: http://repo1.maven.org/maven2/org/spark-project/hive/hive-jdbc/1.2.1.spark2/hive-jdbc-1.2.1.spark2.jar
(99 KB at 1293.7 KB/sec)
[INFO] Downloading: http://repo1.maven.org/maven2/org/spark-project/hive/hive-beeline/1.2.1.spark2/hive-beeline-1.2.1.spark2.jar
[INFO] Downloaded: http://repo1.maven.org/maven2/org/apache/httpcomponents/httpcore/4.4/httpcore-4.4.jar
(315 KB at 3490.0 KB/sec)
[INFO] Downloading: http://repo1.maven.org/maven2/org/scalatest/scalatest_2.11/2.2.1/scalatest_2.11-2.2.1.jar
[INFO] Downloaded: http://repo1.maven.org/maven2/org/spark-project/hive/hive-beeline/1.2.1.spark2/hive-beeline-1.2.1.spark2.jar
(136 KB at 1352.2 KB/sec)
[INFO] Downloaded: http://repo1.maven.org/maven2/org/spark-project/hive/hive-metastore/1.2.1.spark2/hive-metastore-1.2.1.spark2.jar
(5377 KB at 31811.7 KB/sec)
[INFO] Downloaded: http://repo1.maven.org/maven2/org/apache/spark/spark-hive-thriftserver_2.11/2.1.0/spark-hive-thriftserver_2.11-2.1.0.jar
(1773 KB at 8996.8 KB/sec)
[INFO] Downloaded: http://repo1.maven.org/maven2/org/scalatest/scalatest_2.11/2.2.1/scalatest_2.11-2.2.1.jar
(6977 KB at 26833.8 KB/sec)
[INFO] Downloaded: http://repo1.maven.org/maven2/org/spark-project/hive/hive-exec/1.2.1.spark2/hive-exec-1.2.1.spark2.jar
(11230 KB at 38325.4 KB/sec)
[INFO] 
[INFO] --- maven-clean-plugin:2.5:clean (default-clean) @ carbondata-spark-common ---
[INFO] 
[INFO] --- maven-remote-resources-plugin:1.5:process (default) @ carbondata-spark-common ---
[INFO] Downloading: http://repo1.maven.org/maven2/com/fasterxml/jackson/core/jackson-annotations/2.6.5/jackson-annotations-2.6.5.jar
[INFO] Downloaded: http://repo1.maven.org/maven2/com/fasterxml/jackson/core/jackson-annotations/2.6.5/jackson-annotations-2.6.5.jar
(46 KB at 4588.2 KB/sec)
[INFO] 
[INFO] --- maven-resources-plugin:2.7:resources (default-resources) @ carbondata-spark-common
---
[INFO] Using 'UTF-8' encoding to copy filtered resources.
[INFO] skip non existing resourceDirectory <https://builds.apache.org/job/carbondata-master-spark-2.1/ws/integration/spark-common/src/resources>
[INFO] Copying 0 resource
[INFO] Copying 3 resources
[INFO] 
[INFO] --- maven-scala-plugin:2.15.2:compile (default) @ carbondata-spark-common ---
[INFO] Checking for multiple versions of scala
[INFO] includes = [**/*.java,**/*.scala,]
[INFO] excludes = []
[INFO] <https://builds.apache.org/job/carbondata-master-spark-2.1/ws/integration/spark-common/src/main/java>:-1:
info: compiling
[INFO] <https://builds.apache.org/job/carbondata-master-spark-2.1/ws/integration/spark-common/src/main/scala>:-1:
info: compiling
[INFO] Compiling 57 source files to <https://builds.apache.org/job/carbondata-master-spark-2.1/ws/integration/spark-common/target/classes>
at 1493218235720
[WARNING] <https://builds.apache.org/job/carbondata-master-spark-2.1/ws/integration/spark-common/src/main/scala/org/apache/carbondata/spark/rdd/AlterTableAddColumnRDD.scala>:51:
warning: no valid targets for annotation on value newColumns - it is discarded unused. You
may specify targets with meta-annotations, e.g. @(transient @param)
[INFO]     @transient newColumns: Seq[ColumnSchema],
[INFO]      ^
[WARNING] <https://builds.apache.org/job/carbondata-master-spark-2.1/ws/integration/spark-common/src/main/scala/org/apache/carbondata/spark/rdd/AlterTableDropColumnRDD.scala>:49:
warning: no valid targets for annotation on value newColumns - it is discarded unused. You
may specify targets with meta-annotations, e.g. @(transient @param)
[INFO]     @transient newColumns: Seq[ColumnSchema],
[INFO]      ^
[WARNING] <https://builds.apache.org/job/carbondata-master-spark-2.1/ws/integration/spark-common/src/main/scala/org/apache/carbondata/spark/rdd/CarbonScanRDD.scala>:52:
warning: no valid targets for annotation on value sc - it is discarded unused. You may specify
targets with meta-annotations, e.g. @(transient @param)
[INFO]     @transient sc: SparkContext,
[INFO]      ^
[WARNING] <https://builds.apache.org/job/carbondata-master-spark-2.1/ws/integration/spark-common/src/main/scala/org/apache/carbondata/spark/rdd/CarbonScanRDD.scala>:56:
warning: no valid targets for annotation on value carbonTable - it is discarded unused. You
may specify targets with meta-annotations, e.g. @(transient @param)
[INFO]     @transient carbonTable: CarbonTable)
[INFO]      ^
[WARNING] <https://builds.apache.org/job/carbondata-master-spark-2.1/ws/integration/spark-common/src/main/scala/org/apache/carbondata/spark/rdd/UpdateCoalescedRDD.scala>:23:
warning: imported `CoalescedRDDPartition' is permanently hidden by definition of object CoalescedRDDPartition
in package rdd
[INFO] import org.apache.spark.rdd.{CoalescedRDDPartition, DataLoadPartitionCoalescer, RDD}
[INFO]                              ^
[WARNING] <https://builds.apache.org/job/carbondata-master-spark-2.1/ws/integration/spark-common/src/main/scala/org/apache/carbondata/spark/rdd/UpdateCoalescedRDD.scala>:23:
warning: imported `CoalescedRDDPartition' is permanently hidden by definition of class CoalescedRDDPartition
in package rdd
[INFO] import org.apache.spark.rdd.{CoalescedRDDPartition, DataLoadPartitionCoalescer, RDD}
[INFO]                              ^
[WARNING] <https://builds.apache.org/job/carbondata-master-spark-2.1/ws/integration/spark-common/src/main/scala/org/apache/carbondata/spark/rdd/UpdateCoalescedRDD.scala>:23:
warning: imported `DataLoadPartitionCoalescer' is permanently hidden by definition of object
DataLoadPartitionCoalescer in package rdd
[INFO] import org.apache.spark.rdd.{CoalescedRDDPartition, DataLoadPartitionCoalescer, RDD}
[INFO]                                                     ^
[WARNING] <https://builds.apache.org/job/carbondata-master-spark-2.1/ws/integration/spark-common/src/main/scala/org/apache/carbondata/spark/rdd/UpdateCoalescedRDD.scala>:23:
warning: imported `DataLoadPartitionCoalescer' is permanently hidden by definition of class
DataLoadPartitionCoalescer in package rdd
[INFO] import org.apache.spark.rdd.{CoalescedRDDPartition, DataLoadPartitionCoalescer, RDD}
[INFO]                                                     ^
[WARNING] <https://builds.apache.org/job/carbondata-master-spark-2.1/ws/integration/spark-common/src/main/scala/org/apache/carbondata/spark/rdd/UpdateCoalescedRDD.scala>:23:
warning: imported `RDD' is permanently hidden by definition of object RDD in package rdd
[INFO] import org.apache.spark.rdd.{CoalescedRDDPartition, DataLoadPartitionCoalescer, RDD}
[INFO]                                                                                 ^
[WARNING] <https://builds.apache.org/job/carbondata-master-spark-2.1/ws/integration/spark-common/src/main/scala/org/apache/carbondata/spark/rdd/UpdateCoalescedRDD.scala>:23:
warning: imported `RDD' is permanently hidden by definition of class RDD in package rdd
[INFO] import org.apache.spark.rdd.{CoalescedRDDPartition, DataLoadPartitionCoalescer, RDD}
[INFO]                                                                                 ^
[WARNING] <https://builds.apache.org/job/carbondata-master-spark-2.1/ws/integration/spark-common/src/main/scala/org/apache/carbondata/spark/util/CarbonScalaUtil.scala>:129:
warning: non-variable type argument Any in type pattern scala.collection.Map[Any,Any] is unchecked
since it is eliminated by erasure
[INFO]         case m: scala.collection.Map[Any, Any] =>
[INFO]                                  ^
[WARNING] <https://builds.apache.org/job/carbondata-master-spark-2.1/ws/integration/spark-common/src/main/scala/org/apache/carbondata/spark/rdd/DataLoadPartitionCoalescer.scala>:193:
warning: match may not be exhaustive.
[INFO] It would fail on the following input: None
[INFO]                 hostMapPartitionIds.get(loc) match {
[INFO]                                        ^
[WARNING] <https://builds.apache.org/job/carbondata-master-spark-2.1/ws/integration/spark-common/src/main/scala/org/apache/carbondata/spark/rdd/DataLoadPartitionCoalescer.scala>:190:
warning: match may not be exhaustive.
[INFO] It would fail on the following input: None
[INFO]           partitionIdMapHosts.get(partitionId) match {
[INFO]                                  ^
[WARNING] <https://builds.apache.org/job/carbondata-master-spark-2.1/ws/integration/spark-common/src/main/scala/org/apache/carbondata/spark/util/CarbonScalaUtil.scala>:72:
warning: match may not be exhaustive.
[INFO] It would fail on the following inputs: ARRAY, FLOAT, MAP, NULL, STRUCT
[INFO]     dataType match {
[INFO]     ^
[WARNING] <https://builds.apache.org/job/carbondata-master-spark-2.1/ws/integration/spark-common/src/main/scala/org/apache/carbondata/spark/util/DataTypeConverterUtil.scala>:76:
warning: match may not be exhaustive.
[INFO] It would fail on the following inputs: BOOLEAN, MAP, NULL
[INFO]     dataType match {
[INFO]     ^
[INFO] #
[ERROR] # A fatal error has been detected by the Java Runtime Environment:
[INFO] #
[ERROR] #  Internal Error (output.cpp:1593), pid=25197, tid=0x00007f20f46d5700
[INFO] #  guarantee((int)(blk_starts[i+1] - blk_starts[i]) >= (current_offset - blk_offset))
failed: shouldn't increase block size
[INFO] #
[INFO] # JRE version: Java(TM) SE Runtime Environment (8.0_121-b13) (build 1.8.0_121-b13)
[INFO] # Java VM: Java HotSpot(TM) 64-Bit Server VM (25.121-b13 mixed mode linux-amd64 compressed
oops)
[INFO] # Failed to write core dump. Core dumps have been disabled. To enable core dumping,
try "ulimit -c unlimited" before starting Java again
[INFO] #
[ERROR] # An error report file with more information is saved as:
[INFO] # <https://builds.apache.org/job/carbondata-master-spark-2.1/ws/hs_err_pid25197.log>
[INFO] #
[INFO] # Compiler replay data is saved as:
[INFO] # <https://builds.apache.org/job/carbondata-master-spark-2.1/ws/replay_pid25197.log>
[INFO] #
[INFO] # If you would like to submit a bug report, please visit:
[INFO] #   http://bugreport.java.com/bugreport/crash.jsp
[INFO] #
[INFO] ------------------------------------------------------------------------
[INFO] Reactor Summary:
[INFO] 
[INFO] Apache CarbonData :: Parent ........................ SUCCESS [ 18.411 s]
[INFO] Apache CarbonData :: Common ........................ SUCCESS [ 17.028 s]
[INFO] Apache CarbonData :: Core .......................... SUCCESS [03:15 min]
[INFO] Apache CarbonData :: Processing .................... SUCCESS [ 30.246 s]
[INFO] Apache CarbonData :: Hadoop ........................ SUCCESS [ 25.206 s]
[INFO] Apache CarbonData :: Spark Common .................. FAILURE [ 42.014 s]
[INFO] Apache CarbonData :: Spark2 ........................ SKIPPED
[INFO] Apache CarbonData :: Spark Common Test ............. SKIPPED
[INFO] Apache CarbonData :: Assembly ...................... SKIPPED
[INFO] Apache CarbonData :: Spark2 Examples ............... SKIPPED
[INFO] ------------------------------------------------------------------------
[INFO] BUILD FAILURE
[INFO] ------------------------------------------------------------------------
[INFO] Total time: 05:57 min
[INFO] Finished at: 2017-04-26T14:51:21+00:00
[INFO] Final Memory: 82M/855M
[INFO] ------------------------------------------------------------------------
Waiting for Jenkins to finish collecting data[ERROR] Failed to execute goal org.scala-tools:maven-scala-plugin:2.15.2:compile
(default) on project carbondata-spark-common: wrap: org.apache.commons.exec.ExecuteException:
Process exited with an error: 134(Exit value: 134) -> [Help 1]
org.apache.maven.lifecycle.LifecycleExecutionException: Failed to execute goal org.scala-tools:maven-scala-plugin:2.15.2:compile
(default) on project carbondata-spark-common: wrap: org.apache.commons.exec.ExecuteException:
Process exited with an error: 134(Exit value: 134)
	at org.apache.maven.lifecycle.internal.MojoExecutor.execute(MojoExecutor.java:212)
	at org.apache.maven.lifecycle.internal.MojoExecutor.execute(MojoExecutor.java:153)
	at org.apache.maven.lifecycle.internal.MojoExecutor.execute(MojoExecutor.java:145)
	at org.apache.maven.lifecycle.internal.LifecycleModuleBuilder.buildProject(LifecycleModuleBuilder.java:116)
	at org.apache.maven.lifecycle.internal.LifecycleModuleBuilder.buildProject(LifecycleModuleBuilder.java:80)
	at org.apache.maven.lifecycle.internal.builder.singlethreaded.SingleThreadedBuilder.build(SingleThreadedBuilder.java:51)
	at org.apache.maven.lifecycle.internal.LifecycleStarter.execute(LifecycleStarter.java:128)
	at org.apache.maven.DefaultMaven.doExecute(DefaultMaven.java:307)
	at org.apache.maven.DefaultMaven.doExecute(DefaultMaven.java:193)
	at org.apache.maven.DefaultMaven.execute(DefaultMaven.java:106)
	at org.jvnet.hudson.maven3.launcher.Maven33Launcher.main(Maven33Launcher.java:129)
	at sun.reflect.NativeMethodAccessorImpl.invoke0(Native Method)
	at sun.reflect.NativeMethodAccessorImpl.invoke(NativeMethodAccessorImpl.java:62)
	at sun.reflect.DelegatingMethodAccessorImpl.invoke(DelegatingMethodAccessorImpl.java:43)
	at java.lang.reflect.Method.invoke(Method.java:498)
	at org.codehaus.plexus.classworlds.launcher.Launcher.launchStandard(Launcher.java:330)
	at org.codehaus.plexus.classworlds.launcher.Launcher.launch(Launcher.java:238)
	at jenkins.maven3.agent.Maven33Main.launch(Maven33Main.java:176)
	at sun.reflect.NativeMethodAccessorImpl.invoke0(Native Method)
	at sun.reflect.NativeMethodAccessorImpl.invoke(NativeMethodAccessorImpl.java:62)
	at sun.reflect.DelegatingMethodAccessorImpl.invoke(DelegatingMethodAccessorImpl.java:43)
	at java.lang.reflect.Method.invoke(Method.java:498)
	at hudson.maven.Maven3Builder.call(Maven3Builder.java:139)
	at hudson.maven.Maven3Builder.call(Maven3Builder.java:70)
	at hudson.remoting.UserRequest.perform(UserRequest.java:153)
	at hudson.remoting.UserRequest.perform(UserRequest.java:50)
	at hudson.remoting.Request$2.run(Request.java:336)
	at hudson.remoting.InterceptingExecutorService$1.call(InterceptingExecutorService.java:68)
	at java.util.concurrent.FutureTask.run(FutureTask.java:266)
	at java.util.concurrent.ThreadPoolExecutor.runWorker(ThreadPoolExecutor.java:1142)
	at java.util.concurrent.ThreadPoolExecutor$Worker.run(ThreadPoolExecutor.java:617)
	at java.lang.Thread.run(Thread.java:745)
Caused by: org.apache.maven.plugin.MojoExecutionException: wrap: org.apache.commons.exec.ExecuteException:
Process exited with an error: 134(Exit value: 134)
	at org_scala_tools_maven.ScalaMojoSupport.execute(ScalaMojoSupport.java:350)
	at org.apache.maven.plugin.DefaultBuildPluginManager.executeMojo(DefaultBuildPluginManager.java:134)
	at org.apache.maven.lifecycle.internal.MojoExecutor.execute(MojoExecutor.java:207)
	... 31 more
Caused by: org.apache.commons.exec.ExecuteException: Process exited with an error: 134(Exit
value: 134)
	at org.apache.commons.exec.DefaultExecutor.executeInternal(DefaultExecutor.java:346)
	at org.apache.commons.exec.DefaultExecutor.execute(DefaultExecutor.java:149)
	at org.apache.commons.exec.DefaultExecutor.execute(DefaultExecutor.java:136)
	at org_scala_tools_maven_executions.JavaMainCallerByFork.run(JavaMainCallerByFork.java:80)
	at org_scala_tools_maven.ScalaCompilerSupport.compile(ScalaCompilerSupport.java:124)
	at org_scala_tools_maven.ScalaCompilerSupport.doExecute(ScalaCompilerSupport.java:80)
	at org_scala_tools_maven.ScalaMojoSupport.execute(ScalaMojoSupport.java:342)
	... 33 more
[ERROR] 
[ERROR] Re-run Maven using the -X switch to enable full debug logging.
[ERROR] 
[ERROR] For more information about the errors and possible solutions, please read the following
articles:
[ERROR] [Help 1] http://cwiki.apache.org/confluence/display/MAVEN/MojoExecutionException
[ERROR] 
[ERROR] After correcting the problems, you can resume the build with the command
[ERROR]   mvn <goals> -rf :carbondata-spark-common

[JENKINS] Archiving <https://builds.apache.org/job/carbondata-master-spark-2.1/ws/processing/pom.xml>
to org.apache.carbondata/carbondata-processing/1.1.0-incubating-SNAPSHOT/carbondata-processing-1.1.0-incubating-SNAPSHOT.pom
[JENKINS] Archiving <https://builds.apache.org/job/carbondata-master-spark-2.1/ws/processing/target/carbondata-processing-1.1.0-incubating-SNAPSHOT.jar>
to org.apache.carbondata/carbondata-processing/1.1.0-incubating-20170426.144949-403/carbondata-processing-1.1.0-incubating-20170426.144949-403.jar
[JENKINS] Archiving <https://builds.apache.org/job/carbondata-master-spark-2.1/ws/integration/spark2/pom.xml>
to org.apache.carbondata/carbondata-spark2/1.1.0-incubating-SNAPSHOT/carbondata-spark2-1.1.0-incubating-SNAPSHOT.pom
[JENKINS] Archiving <https://builds.apache.org/job/carbondata-master-spark-2.1/ws/assembly/pom.xml>
to org.apache.carbondata/carbondata-assembly/1.1.0-incubating-SNAPSHOT/carbondata-assembly-1.1.0-incubating-SNAPSHOT.pom
[JENKINS] Archiving <https://builds.apache.org/job/carbondata-master-spark-2.1/ws/integration/spark-common/pom.xml>
to org.apache.carbondata/carbondata-spark-common/1.1.0-incubating-SNAPSHOT/carbondata-spark-common-1.1.0-incubating-SNAPSHOT.pom
[JENKINS] Archiving <https://builds.apache.org/job/carbondata-master-spark-2.1/ws/pom.xml>
to org.apache.carbondata/carbondata-parent/1.1.0-incubating-SNAPSHOT/carbondata-parent-1.1.0-incubating-SNAPSHOT.pom
[JENKINS] Archiving <https://builds.apache.org/job/carbondata-master-spark-2.1/ws/core/pom.xml>
to org.apache.carbondata/carbondata-core/1.1.0-incubating-SNAPSHOT/carbondata-core-1.1.0-incubating-SNAPSHOT.pom
[JENKINS] Archiving <https://builds.apache.org/job/carbondata-master-spark-2.1/ws/core/target/carbondata-core-1.1.0-incubating-SNAPSHOT.jar>
to org.apache.carbondata/carbondata-core/1.1.0-incubating-20170426.144914-403/carbondata-core-1.1.0-incubating-20170426.144914-403.jar
[JENKINS] Archiving <https://builds.apache.org/job/carbondata-master-spark-2.1/ws/hadoop/pom.xml>
to org.apache.carbondata/carbondata-hadoop/1.1.0-incubating-SNAPSHOT/carbondata-hadoop-1.1.0-incubating-SNAPSHOT.pom
[JENKINS] Archiving <https://builds.apache.org/job/carbondata-master-spark-2.1/ws/hadoop/target/carbondata-hadoop-1.1.0-incubating-SNAPSHOT.jar>
to org.apache.carbondata/carbondata-hadoop/1.1.0-incubating-20170426.145018-404/carbondata-hadoop-1.1.0-incubating-20170426.145018-404.jar
[JENKINS] Archiving <https://builds.apache.org/job/carbondata-master-spark-2.1/ws/common/pom.xml>
to org.apache.carbondata/carbondata-common/1.1.0-incubating-SNAPSHOT/carbondata-common-1.1.0-incubating-SNAPSHOT.pom
[JENKINS] Archiving <https://builds.apache.org/job/carbondata-master-spark-2.1/ws/common/target/carbondata-common-1.1.0-incubating-SNAPSHOT.jar>
to org.apache.carbondata/carbondata-common/1.1.0-incubating-20170426.144600-405/carbondata-common-1.1.0-incubating-20170426.144600-405.jar
[JENKINS] Archiving <https://builds.apache.org/job/carbondata-master-spark-2.1/ws/integration/spark-common-test/pom.xml>
to org.apache.carbondata/carbondata-spark-common-test/1.1.0-incubating-SNAPSHOT/carbondata-spark-common-test-1.1.0-incubating-SNAPSHOT.pom
[JENKINS] Archiving <https://builds.apache.org/job/carbondata-master-spark-2.1/ws/examples/spark2/pom.xml>
to org.apache.carbondata/carbondata-examples-spark2/1.1.0-incubating-SNAPSHOT/carbondata-examples-spark2-1.1.0-incubating-SNAPSHOT.pom
Sending e-mails to: commits@carbondata.incubator.apache.org
channel stopped
Not sending mail to unregistered user ranmx@fosun.com

Mime
View raw message