carbondata-commits mailing list archives

Site index · List index
Message view « Date » · « Thread »
Top « Date » · « Thread »
From Apache Jenkins Server <jenk...@builds.apache.org>
Subject Build failed in Jenkins: CarbonData-master #353
Date Mon, 27 Feb 2017 11:18:16 GMT
See <https://builds.apache.org/job/CarbonData-master/353/display/redirect?page=changes>

Changes:

[jackylk] Supporting scalar subquery in carbon

[jackylk] modify the code style to make compile successfully. compile command: mvn

------------------------------------------
[...truncated 216.34 KB...]
		Shuffled Maps =0
		Failed Shuffles=0
		Merged Map outputs=0
		GC time elapsed (ms)=0
		CPU time spent (ms)=0
		Physical memory (bytes) snapshot=0
		Virtual memory (bytes) snapshot=0
		Total committed heap usage (bytes)=1065353216
	File Input Format Counters 
		Bytes Read=0
	File Output Format Counters 
		Bytes Written=8
Tests run: 3, Failures: 0, Errors: 0, Skipped: 0, Time elapsed: 6.55 sec - in org.apache.carbondata.hadoop.ft.CarbonInputMapperTest
Running org.apache.carbondata.hadoop.test.util.ObjectSerializationUtilTest
Tests run: 2, Failures: 0, Errors: 0, Skipped: 0, Time elapsed: 0.004 sec - in org.apache.carbondata.hadoop.test.util.ObjectSerializationUtilTest

Results :

Tests run: 5, Failures: 0, Errors: 0, Skipped: 0

[JENKINS] Recording test results
[INFO] 
[INFO] --- maven-jar-plugin:2.5:jar (default-jar) @ carbondata-hadoop ---
[INFO] Building jar: <https://builds.apache.org/job/CarbonData-master/ws/hadoop/target/carbondata-hadoop-1.1.0-incubating-SNAPSHOT.jar>
[INFO] 
[INFO] --- maven-site-plugin:3.4:attach-descriptor (attach-descriptor) @ carbondata-hadoop
---
[INFO]                                                                         
[INFO] ------------------------------------------------------------------------
[INFO] Building Apache CarbonData :: Spark Common 1.1.0-incubating-SNAPSHOT
[INFO] ------------------------------------------------------------------------
[INFO] 
[INFO] --- maven-clean-plugin:2.5:clean (default-clean) @ carbondata-spark-common ---
[INFO] Deleting <https://builds.apache.org/job/CarbonData-master/ws/integration/spark-common/target>
[INFO] 
[INFO] --- maven-remote-resources-plugin:1.5:process (default) @ carbondata-spark-common ---
[INFO] 
[INFO] --- maven-resources-plugin:2.7:resources (default-resources) @ carbondata-spark-common
---
[INFO] Using 'UTF-8' encoding to copy filtered resources.
[INFO] skip non existing resourceDirectory <https://builds.apache.org/job/CarbonData-master/ws/integration/spark-common/src/resources>
[INFO] Copying 0 resource
[INFO] Copying 3 resources
[INFO] 
[INFO] --- maven-scala-plugin:2.15.2:compile (default) @ carbondata-spark-common ---
[INFO] Checking for multiple versions of scala
[INFO] includes = [**/*.java,**/*.scala,]
[INFO] excludes = []
[INFO] <https://builds.apache.org/job/CarbonData-master/ws/integration/spark-common/src/main/java>:-1:
info: compiling
[INFO] <https://builds.apache.org/job/CarbonData-master/ws/integration/spark-common/src/main/scala>:-1:
info: compiling
[INFO] Compiling 66 source files to <https://builds.apache.org/job/CarbonData-master/ws/integration/spark-common/target/classes>
at 1488194111769
[WARNING] <https://builds.apache.org/job/CarbonData-master/ws/integration/spark-common/src/main/scala/org/apache/carbondata/spark/rdd/UpdateCoalescedRDD.scala>:23:
warning: imported `CoalescedRDDPartition' is permanently hidden by definition of object CoalescedRDDPartition
in package rdd
[INFO] import org.apache.spark.rdd.{CoalescedRDDPartition, DataLoadPartitionCoalescer, RDD}
[INFO]                              ^
[WARNING] <https://builds.apache.org/job/CarbonData-master/ws/integration/spark-common/src/main/scala/org/apache/carbondata/spark/rdd/UpdateCoalescedRDD.scala>:23:
warning: imported `DataLoadPartitionCoalescer' is permanently hidden by definition of object
DataLoadPartitionCoalescer in package rdd
[INFO] import org.apache.spark.rdd.{CoalescedRDDPartition, DataLoadPartitionCoalescer, RDD}
[INFO]                                                     ^
[WARNING] <https://builds.apache.org/job/CarbonData-master/ws/integration/spark-common/src/main/scala/org/apache/carbondata/spark/rdd/UpdateCoalescedRDD.scala>:23:
warning: imported `RDD' is permanently hidden by definition of object RDD in package rdd
[INFO] import org.apache.spark.rdd.{CoalescedRDDPartition, DataLoadPartitionCoalescer, RDD}
[INFO]                                                                                 ^
[WARNING] <https://builds.apache.org/job/CarbonData-master/ws/integration/spark-common/src/main/scala/org/apache/carbondata/spark/util/CarbonScalaUtil.scala>:179:
warning: non-variable type argument Any in type pattern scala.collection.Map[Any,Any] is unchecked
since it is eliminated by erasure
[INFO]         case m: scala.collection.Map[Any, Any] =>
[INFO]                                  ^
[WARNING] <https://builds.apache.org/job/CarbonData-master/ws/integration/spark-common/src/main/scala/org/apache/carbondata/spark/rdd/DataLoadPartitionCoalescer.scala>:193:
warning: match may not be exhaustive.
[INFO] It would fail on the following input: None
[INFO]                 hostMapPartitionIds.get(loc) match {
[INFO]                                        ^
[WARNING] <https://builds.apache.org/job/CarbonData-master/ws/integration/spark-common/src/main/scala/org/apache/carbondata/spark/rdd/DataLoadPartitionCoalescer.scala>:190:
warning: match may not be exhaustive.
[INFO] It would fail on the following input: None
[INFO]           partitionIdMapHosts.get(partitionId) match {
[INFO]                                  ^
[WARNING] <https://builds.apache.org/job/CarbonData-master/ws/integration/spark-common/src/main/scala/org/apache/carbondata/spark/util/CarbonScalaUtil.scala>:70:
warning: match may not be exhaustive.
[INFO] It would fail on the following inputs: ARRAY, FLOAT, MAP, NULL, STRUCT
[INFO]     dataType match {
[INFO]     ^
[WARNING] <https://builds.apache.org/job/CarbonData-master/ws/integration/spark-common/src/main/scala/org/apache/carbondata/spark/util/DataTypeConverterUtil.scala>:66:
warning: match may not be exhaustive.
[INFO] It would fail on the following inputs: BOOLEAN, MAP, NULL
[INFO]     dataType match {
[INFO]     ^
[WARNING] <https://builds.apache.org/job/CarbonData-master/ws/integration/spark-common/src/main/scala/org/apache/spark/sql/optimizer/CarbonDecoderOptimizerHelper.scala>:76:
warning: unreachable code
[INFO]       case u: Union =>
[INFO]                     ^
[WARNING] warning: there were 2 deprecation warning(s); re-run with -deprecation for details
[WARNING] warning: there were 3 feature warning(s); re-run with -feature for details
[WARNING] 11 warnings found
[INFO] prepare-compile in 0 s
[INFO] compile in 37 s
[INFO] 
[INFO] --- maven-compiler-plugin:3.2:compile (default-compile) @ carbondata-spark-common ---
[INFO] Changes detected - recompiling the module!
[INFO] Compiling 24 source files to <https://builds.apache.org/job/CarbonData-master/ws/integration/spark-common/target/classes>
[INFO] <https://builds.apache.org/job/CarbonData-master/ws/integration/spark-common/src/main/java/org/apache/carbondata/spark/merger/CarbonDataMergerUtil.java>:
<https://builds.apache.org/job/CarbonData-master/ws/integration/spark-common/src/main/java/org/apache/carbondata/spark/merger/CarbonDataMergerUtil.java>
uses or overrides a deprecated API.
[INFO] <https://builds.apache.org/job/CarbonData-master/ws/integration/spark-common/src/main/java/org/apache/carbondata/spark/merger/CarbonDataMergerUtil.java>:
Recompile with -Xlint:deprecation for details.
[INFO] <https://builds.apache.org/job/CarbonData-master/ws/integration/spark-common/src/main/java/org/apache/carbondata/spark/merger/CarbonCompactionExecutor.java>:
Some input files use unchecked or unsafe operations.
[INFO] <https://builds.apache.org/job/CarbonData-master/ws/integration/spark-common/src/main/java/org/apache/carbondata/spark/merger/CarbonCompactionExecutor.java>:
Recompile with -Xlint:unchecked for details.
[INFO] 
[INFO] --- maven-scala-plugin:2.15.2:compile (compile) @ carbondata-spark-common ---
[INFO] Checking for multiple versions of scala
[INFO] includes = [**/*.java,**/*.scala,]
[INFO] excludes = []
[INFO] Nothing to compile - all classes are up to date
[INFO] 
[INFO] --- maven-resources-plugin:2.7:testResources (default-testResources) @ carbondata-spark-common
---
[INFO] Using 'UTF-8' encoding to copy filtered resources.
[INFO] skip non existing resourceDirectory <https://builds.apache.org/job/CarbonData-master/ws/integration/spark-common/src/test/resources>
[INFO] Copying 3 resources
[INFO] 
[INFO] --- maven-compiler-plugin:3.2:testCompile (default-testCompile) @ carbondata-spark-common
---
[INFO] No sources to compile
[INFO] 
[INFO] --- maven-surefire-plugin:2.18.1:test (default-test) @ carbondata-spark-common ---
[JENKINS] Recording test results
[INFO] 
[INFO] --- maven-scala-plugin:2.15.2:testCompile (testCompile) @ carbondata-spark-common ---
[INFO] Checking for multiple versions of scala
[INFO] includes = [**/*.java,**/*.scala,]
[INFO] excludes = []
[WARNING] No source files found.
[INFO] 
[INFO] --- maven-jar-plugin:2.5:jar (default-jar) @ carbondata-spark-common ---
[INFO] Building jar: <https://builds.apache.org/job/CarbonData-master/ws/integration/spark-common/target/carbondata-spark-common-1.1.0-incubating-SNAPSHOT.jar>
[INFO] 
[INFO] --- maven-site-plugin:3.4:attach-descriptor (attach-descriptor) @ carbondata-spark-common
---
[INFO]                                                                         
[INFO] ------------------------------------------------------------------------
[INFO] Building Apache CarbonData :: Spark 1.1.0-incubating-SNAPSHOT
[INFO] ------------------------------------------------------------------------
[INFO] 
[INFO] --- maven-clean-plugin:2.5:clean (default-clean) @ carbondata-spark ---
[INFO] Deleting <https://builds.apache.org/job/CarbonData-master/ws/integration/spark/target>
[INFO] 
[INFO] --- maven-remote-resources-plugin:1.5:process (default) @ carbondata-spark ---
[INFO] 
[INFO] --- maven-resources-plugin:2.7:resources (default-resources) @ carbondata-spark ---
[INFO] Using 'UTF-8' encoding to copy filtered resources.
[INFO] Copying 2 resources
[INFO] Copying 1 resource
[INFO] Copying 3 resources
[INFO] 
[INFO] --- maven-scala-plugin:2.15.2:compile (default) @ carbondata-spark ---
[INFO] Checking for multiple versions of scala
[INFO] includes = [**/*.java,**/*.scala,]
[INFO] excludes = []
[INFO] <https://builds.apache.org/job/CarbonData-master/ws/integration/spark/src/main/java>:-1:
info: compiling
[INFO] <https://builds.apache.org/job/CarbonData-master/ws/integration/spark/src/main/scala>:-1:
info: compiling
[INFO] Compiling 34 source files to <https://builds.apache.org/job/CarbonData-master/ws/integration/spark/target/classes>
at 1488194161478
[WARNING] <https://builds.apache.org/job/CarbonData-master/ws/integration/spark/src/main/scala/org/apache/spark/sql/CarbonDictionaryDecoder.scala>:96:
warning: match may not be exhaustive.
[INFO] It would fail on the following inputs: FLOAT, MAP, NULL
[INFO]     carbonDimension.getDataType match {
[INFO]                     ^
[ERROR] Java HotSpot(TM) 64-Bit Server VM warning: INFO: os::commit_memory(0x0000000790380000,
385351680, 0) failed; error='Cannot allocate memory' (errno=12)
[INFO] #
[INFO] # There is insufficient memory for the Java Runtime Environment to continue.
[INFO] # Native memory allocation (mmap) failed to map 385351680 bytes for committing reserved
memory.
[ERROR] # An error report file with more information is saved as:
[INFO] # <https://builds.apache.org/job/CarbonData-master/ws/hs_err_pid5882.log>
[INFO] ------------------------------------------------------------------------
[INFO] Reactor Summary:
[INFO] 
[INFO] Apache CarbonData :: Parent ........................ SUCCESS [  4.966 s]
[INFO] Apache CarbonData :: Common ........................ SUCCESS [  8.652 s]
[INFO] Apache CarbonData :: Core .......................... SUCCESS [01:42 min]
[INFO] Apache CarbonData :: Processing .................... SUCCESS [ 30.129 s]
[INFO] Apache CarbonData :: Hadoop ........................ SUCCESS [ 20.548 s]
[INFO] Apache CarbonData :: Spark Common .................. SUCCESS [ 54.268 s]
[INFO] Apache CarbonData :: Spark ......................... FAILURE [ 34.463 s]
[INFO] Apache CarbonData :: Spark Common Test ............. SKIPPED
[INFO] Apache CarbonData :: Assembly ...................... SKIPPED
[INFO] Apache CarbonData :: Spark Examples ................ SKIPPED
[INFO] ------------------------------------------------------------------------
[INFO] BUILD FAILURE
[INFO] ------------------------------------------------------------------------
[INFO] Total time: 04:32 min
[INFO] Finished at: 2017-02-27T11:16:38+00:00
[INFO] Final Memory: 84M/866M
[INFO] ------------------------------------------------------------------------
Waiting for Jenkins to finish collecting data
[ERROR] Failed to execute goal org.scala-tools:maven-scala-plugin:2.15.2:compile (default)
on project carbondata-spark: wrap: org.apache.commons.exec.ExecuteException: Process exited
with an error: 1(Exit value: 1) -> [Help 1]
org.apache.maven.lifecycle.LifecycleExecutionException: Failed to execute goal org.scala-tools:maven-scala-plugin:2.15.2:compile
(default) on project carbondata-spark: wrap: org.apache.commons.exec.ExecuteException: Process
exited with an error: 1(Exit value: 1)
	at org.apache.maven.lifecycle.internal.MojoExecutor.execute(MojoExecutor.java:216)
	at org.apache.maven.lifecycle.internal.MojoExecutor.execute(MojoExecutor.java:153)
	at org.apache.maven.lifecycle.internal.MojoExecutor.execute(MojoExecutor.java:145)
	at org.apache.maven.lifecycle.internal.LifecycleModuleBuilder.buildProject(LifecycleModuleBuilder.java:116)
	at org.apache.maven.lifecycle.internal.LifecycleModuleBuilder.buildProject(LifecycleModuleBuilder.java:80)
	at org.apache.maven.lifecycle.internal.builder.singlethreaded.SingleThreadedBuilder.build(SingleThreadedBuilder.java:51)
	at org.apache.maven.lifecycle.internal.LifecycleStarter.execute(LifecycleStarter.java:128)
	at org.apache.maven.DefaultMaven.doExecute(DefaultMaven.java:307)
	at org.apache.maven.DefaultMaven.doExecute(DefaultMaven.java:193)
	at org.apache.maven.DefaultMaven.execute(DefaultMaven.java:106)
	at org.jvnet.hudson.maven3.launcher.Maven33Launcher.main(Maven33Launcher.java:129)
	at sun.reflect.NativeMethodAccessorImpl.invoke0(Native Method)
	at sun.reflect.NativeMethodAccessorImpl.invoke(NativeMethodAccessorImpl.java:62)
	at sun.reflect.DelegatingMethodAccessorImpl.invoke(DelegatingMethodAccessorImpl.java:43)
	at java.lang.reflect.Method.invoke(Method.java:498)
	at org.codehaus.plexus.classworlds.launcher.Launcher.launchStandard(Launcher.java:330)
	at org.codehaus.plexus.classworlds.launcher.Launcher.launch(Launcher.java:238)
	at jenkins.maven3.agent.Maven33Main.launch(Maven33Main.java:176)
	at sun.reflect.NativeMethodAccessorImpl.invoke0(Native Method)
	at sun.reflect.NativeMethodAccessorImpl.invoke(NativeMethodAccessorImpl.java:62)
	at sun.reflect.DelegatingMethodAccessorImpl.invoke(DelegatingMethodAccessorImpl.java:43)
	at java.lang.reflect.Method.invoke(Method.java:498)
	at hudson.maven.Maven3Builder.call(Maven3Builder.java:139)
	at hudson.maven.Maven3Builder.call(Maven3Builder.java:70)
	at hudson.remoting.UserRequest.perform(UserRequest.java:153)
	at hudson.remoting.UserRequest.perform(UserRequest.java:50)
	at hudson.remoting.Request$2.run(Request.java:336)
	at hudson.remoting.InterceptingExecutorService$1.call(InterceptingExecutorService.java:68)
	at java.util.concurrent.FutureTask.run(FutureTask.java:266)
	at java.util.concurrent.ThreadPoolExecutor.runWorker(ThreadPoolExecutor.java:1142)
	at java.util.concurrent.ThreadPoolExecutor$Worker.run(ThreadPoolExecutor.java:617)
	at java.lang.Thread.run(Thread.java:745)
Caused by: org.apache.maven.plugin.MojoExecutionException: wrap: org.apache.commons.exec.ExecuteException:
Process exited with an error: 1(Exit value: 1)
	at org_scala_tools_maven.ScalaMojoSupport.execute(ScalaMojoSupport.java:350)
	at org.apache.maven.plugin.DefaultBuildPluginManager.executeMojo(DefaultBuildPluginManager.java:134)
	at org.apache.maven.lifecycle.internal.MojoExecutor.execute(MojoExecutor.java:208)
	... 31 more
Caused by: org.apache.commons.exec.ExecuteException: Process exited with an error: 1(Exit
value: 1)
	at org.apache.commons.exec.DefaultExecutor.executeInternal(DefaultExecutor.java:346)
	at org.apache.commons.exec.DefaultExecutor.execute(DefaultExecutor.java:149)
	at org.apache.commons.exec.DefaultExecutor.execute(DefaultExecutor.java:136)
	at org_scala_tools_maven_executions.JavaMainCallerByFork.run(JavaMainCallerByFork.java:80)
	at org_scala_tools_maven.ScalaCompilerSupport.compile(ScalaCompilerSupport.java:124)
	at org_scala_tools_maven.ScalaCompilerSupport.doExecute(ScalaCompilerSupport.java:80)
	at org_scala_tools_maven.ScalaMojoSupport.execute(ScalaMojoSupport.java:342)
	... 33 more
[ERROR] 
[ERROR] Re-run Maven using the -X switch to enable full debug logging.
[ERROR] 
[ERROR] For more information about the errors and possible solutions, please read the following
articles:
[ERROR] [Help 1] http://cwiki.apache.org/confluence/display/MAVEN/MojoExecutionException
[ERROR] 
[ERROR] After correcting the problems, you can resume the build with the command
[ERROR]   mvn <goals> -rf :carbondata-spark
[JENKINS] Archiving <https://builds.apache.org/job/CarbonData-master/ws/processing/pom.xml>
to org.apache.carbondata/carbondata-processing/1.1.0-incubating-SNAPSHOT/carbondata-processing-1.1.0-incubating-SNAPSHOT.pom
[JENKINS] Archiving <https://builds.apache.org/job/CarbonData-master/ws/processing/target/carbondata-processing-1.1.0-incubating-SNAPSHOT.jar>
to org.apache.carbondata/carbondata-processing/1.1.0-incubating-SNAPSHOT/carbondata-processing-1.1.0-incubating-SNAPSHOT.jar
[JENKINS] Archiving <https://builds.apache.org/job/CarbonData-master/ws/assembly/pom.xml>
to org.apache.carbondata/carbondata-assembly/1.1.0-incubating-SNAPSHOT/carbondata-assembly-1.1.0-incubating-SNAPSHOT.pom
[JENKINS] Archiving <https://builds.apache.org/job/CarbonData-master/ws/integration/spark-common/pom.xml>
to org.apache.carbondata/carbondata-spark-common/1.1.0-incubating-SNAPSHOT/carbondata-spark-common-1.1.0-incubating-SNAPSHOT.pom
[JENKINS] Archiving <https://builds.apache.org/job/CarbonData-master/ws/integration/spark-common/target/carbondata-spark-common-1.1.0-incubating-SNAPSHOT.jar>
to org.apache.carbondata/carbondata-spark-common/1.1.0-incubating-SNAPSHOT/carbondata-spark-common-1.1.0-incubating-SNAPSHOT.jar
[JENKINS] Archiving <https://builds.apache.org/job/CarbonData-master/ws/pom.xml> to
org.apache.carbondata/carbondata-parent/1.1.0-incubating-SNAPSHOT/carbondata-parent-1.1.0-incubating-SNAPSHOT.pom
[JENKINS] Archiving <https://builds.apache.org/job/CarbonData-master/ws/core/pom.xml>
to org.apache.carbondata/carbondata-core/1.1.0-incubating-SNAPSHOT/carbondata-core-1.1.0-incubating-SNAPSHOT.pom
[JENKINS] Archiving <https://builds.apache.org/job/CarbonData-master/ws/core/target/carbondata-core-1.1.0-incubating-SNAPSHOT.jar>
to org.apache.carbondata/carbondata-core/1.1.0-incubating-SNAPSHOT/carbondata-core-1.1.0-incubating-SNAPSHOT.jar
[JENKINS] Archiving <https://builds.apache.org/job/CarbonData-master/ws/hadoop/pom.xml>
to org.apache.carbondata/carbondata-hadoop/1.1.0-incubating-SNAPSHOT/carbondata-hadoop-1.1.0-incubating-SNAPSHOT.pom
[JENKINS] Archiving <https://builds.apache.org/job/CarbonData-master/ws/hadoop/target/carbondata-hadoop-1.1.0-incubating-SNAPSHOT.jar>
to org.apache.carbondata/carbondata-hadoop/1.1.0-incubating-SNAPSHOT/carbondata-hadoop-1.1.0-incubating-SNAPSHOT.jar
[JENKINS] Archiving <https://builds.apache.org/job/CarbonData-master/ws/examples/spark/pom.xml>
to org.apache.carbondata/carbondata-examples-spark/1.1.0-incubating-SNAPSHOT/carbondata-examples-spark-1.1.0-incubating-SNAPSHOT.pom
[JENKINS] Archiving <https://builds.apache.org/job/CarbonData-master/ws/common/pom.xml>
to org.apache.carbondata/carbondata-common/1.1.0-incubating-SNAPSHOT/carbondata-common-1.1.0-incubating-SNAPSHOT.pom
[JENKINS] Archiving <https://builds.apache.org/job/CarbonData-master/ws/common/target/carbondata-common-1.1.0-incubating-SNAPSHOT.jar>
to org.apache.carbondata/carbondata-common/1.1.0-incubating-SNAPSHOT/carbondata-common-1.1.0-incubating-SNAPSHOT.jar
[JENKINS] Archiving <https://builds.apache.org/job/CarbonData-master/ws/integration/spark-common-test/pom.xml>
to org.apache.carbondata/carbondata-spark-common-test/1.1.0-incubating-SNAPSHOT/carbondata-spark-common-test-1.1.0-incubating-SNAPSHOT.pom
[JENKINS] Archiving <https://builds.apache.org/job/CarbonData-master/ws/integration/spark/pom.xml>
to org.apache.carbondata/carbondata-spark/1.1.0-incubating-SNAPSHOT/carbondata-spark-1.1.0-incubating-SNAPSHOT.pom
Sending e-mails to: commits@carbondata.incubator.apache.org
Sending e-mails to: commits@carbondata.incubator.apache.org
channel stopped

Mime
View raw message