carbondata-commits mailing list archives

Site index · List index
Message view « Date » · « Thread »
Top « Date » · « Thread »
From Apache Jenkins Server <jenk...@builds.apache.org>
Subject Build failed in Jenkins: CarbonData-master #200
Date Thu, 01 Dec 2016 10:13:14 GMT
See <https://builds.apache.org/job/CarbonData-master/200/changes>

Changes:

[ravipesala] Improve first time query performance

------------------------------------------
[...truncated 98 lines...]
[INFO] Copying 3 resources
[INFO] 
[INFO] --- maven-compiler-plugin:3.2:compile (default-compile) @ carbondata-core ---
[INFO] Changes detected - recompiling the module!
[INFO] Compiling 365 source files to <https://builds.apache.org/job/CarbonData-master/ws/core/target/classes>
[INFO] <https://builds.apache.org/job/CarbonData-master/ws/core/src/main/java/org/apache/carbondata/core/datastorage/store/compression/type/UnCompressByteArray.java>:
Some input files use unchecked or unsafe operations.
[INFO] <https://builds.apache.org/job/CarbonData-master/ws/core/src/main/java/org/apache/carbondata/core/datastorage/store/compression/type/UnCompressByteArray.java>:
Recompile with -Xlint:unchecked for details.
[INFO] -------------------------------------------------------------
[WARNING] COMPILATION WARNING : 
[INFO] -------------------------------------------------------------
[WARNING] <https://builds.apache.org/job/CarbonData-master/ws/core/src/main/java/org/apache/carbondata/core/util/ByteUtil.java>:[113,26]
sun.misc.Unsafe is internal proprietary API and may be removed in a future release
[WARNING] <https://builds.apache.org/job/CarbonData-master/ws/core/src/main/java/org/apache/carbondata/core/util/ByteUtil.java>:[122,28]
sun.misc.Unsafe is internal proprietary API and may be removed in a future release
[WARNING] <https://builds.apache.org/job/CarbonData-master/ws/core/src/main/java/org/apache/carbondata/core/util/ByteUtil.java>:[125,31]
sun.misc.Unsafe is internal proprietary API and may be removed in a future release
[INFO] 3 warnings 
[INFO] -------------------------------------------------------------
[INFO] -------------------------------------------------------------
[ERROR] COMPILATION ERROR : 
[INFO] -------------------------------------------------------------
[ERROR] <https://builds.apache.org/job/CarbonData-master/ws/core/src/main/java/org/apache/carbondata/core/util/CarbonMetadataUtil.java>:[44,36]
cannot find symbol
  symbol:   class BlockletInfo2
  location: package org.apache.carbondata.format
[ERROR] <https://builds.apache.org/job/CarbonData-master/ws/core/src/main/java/org/apache/carbondata/core/util/CarbonMetadataUtil.java>:[50,36]
cannot find symbol
  symbol:   class DataChunk2
  location: package org.apache.carbondata.format
[ERROR] <https://builds.apache.org/job/CarbonData-master/ws/core/src/main/java/org/apache/carbondata/core/util/CarbonMetadataUtil.java>:[195,18]
cannot find symbol
  symbol:   class BlockletInfo2
  location: class org.apache.carbondata.core.util.CarbonMetadataUtil
[ERROR] <https://builds.apache.org/job/CarbonData-master/ws/core/src/main/java/org/apache/carbondata/core/util/CarbonMetadataUtil.java>:[521,22]
cannot find symbol
  symbol:   class DataChunk2
  location: class org.apache.carbondata.core.util.CarbonMetadataUtil
[ERROR] <https://builds.apache.org/job/CarbonData-master/ws/core/src/main/java/org/apache/carbondata/core/util/CarbonUtil.java>:[74,36]
cannot find symbol
  symbol:   class DataChunk2
  location: package org.apache.carbondata.format
[ERROR] <https://builds.apache.org/job/CarbonData-master/ws/core/src/main/java/org/apache/carbondata/core/util/CarbonUtil.java>:[1499,17]
cannot find symbol
  symbol:   class DataChunk2
  location: class org.apache.carbondata.core.util.CarbonUtil
[ERROR] <https://builds.apache.org/job/CarbonData-master/ws/core/src/main/java/org/apache/carbondata/core/carbon/datastore/chunk/reader/dimension/v2/CompressedDimensionChunkFileBasedReaderV2.java>:[33,36]
cannot find symbol
  symbol:   class DataChunk2
  location: package org.apache.carbondata.format
[ERROR] <https://builds.apache.org/job/CarbonData-master/ws/core/src/main/java/org/apache/carbondata/core/util/DataFileFooterConverter2.java>:[88,35]
cannot find symbol
  symbol:   class BlockletInfo2
  location: package org.apache.carbondata.format
[ERROR] <https://builds.apache.org/job/CarbonData-master/ws/core/src/main/java/org/apache/carbondata/core/carbon/datastore/chunk/reader/measure/v2/CompressedMeasureChunkFileBasedReaderV2.java>:[36,36]
cannot find symbol
  symbol:   class DataChunk2
  location: package org.apache.carbondata.format
[ERROR] <https://builds.apache.org/job/CarbonData-master/ws/core/src/main/java/org/apache/carbondata/core/util/CarbonMetadataUtil.java>:[197,5]
cannot find symbol
  symbol:   class BlockletInfo2
  location: class org.apache.carbondata.core.util.CarbonMetadataUtil
[ERROR] <https://builds.apache.org/job/CarbonData-master/ws/core/src/main/java/org/apache/carbondata/core/util/CarbonMetadataUtil.java>:[197,38]
cannot find symbol
  symbol:   class BlockletInfo2
  location: class org.apache.carbondata.core.util.CarbonMetadataUtil
[ERROR] <https://builds.apache.org/job/CarbonData-master/ws/core/src/main/java/org/apache/carbondata/core/util/CarbonMetadataUtil.java>:[523,10]
cannot find symbol
  symbol:   class DataChunk2
  location: class org.apache.carbondata.core.util.CarbonMetadataUtil
[ERROR] <https://builds.apache.org/job/CarbonData-master/ws/core/src/main/java/org/apache/carbondata/core/util/CarbonMetadataUtil.java>:[523,52]
cannot find symbol
  symbol:   class DataChunk2
  location: class org.apache.carbondata.core.util.CarbonMetadataUtil
[ERROR] <https://builds.apache.org/job/CarbonData-master/ws/core/src/main/java/org/apache/carbondata/core/util/CarbonMetadataUtil.java>:[530,7]
cannot find symbol
  symbol:   class DataChunk2
  location: class org.apache.carbondata.core.util.CarbonMetadataUtil
[ERROR] <https://builds.apache.org/job/CarbonData-master/ws/core/src/main/java/org/apache/carbondata/core/util/CarbonMetadataUtil.java>:[530,34]
cannot find symbol
  symbol:   class DataChunk2
  location: class org.apache.carbondata.core.util.CarbonMetadataUtil
[ERROR] <https://builds.apache.org/job/CarbonData-master/ws/core/src/main/java/org/apache/carbondata/core/util/CarbonMetadataUtil.java>:[563,7]
cannot find symbol
  symbol:   class DataChunk2
  location: class org.apache.carbondata.core.util.CarbonMetadataUtil
[ERROR] <https://builds.apache.org/job/CarbonData-master/ws/core/src/main/java/org/apache/carbondata/core/util/CarbonMetadataUtil.java>:[563,34]
cannot find symbol
  symbol:   class DataChunk2
  location: class org.apache.carbondata.core.util.CarbonMetadataUtil
[ERROR] <https://builds.apache.org/job/CarbonData-master/ws/core/src/main/java/org/apache/carbondata/core/util/CarbonUtil.java>:[1501,15]
cannot find symbol
  symbol:   class DataChunk2
  location: class org.apache.carbondata.core.util.CarbonUtil
[ERROR] <https://builds.apache.org/job/CarbonData-master/ws/core/src/main/java/org/apache/carbondata/core/util/CarbonUtil.java>:[1503,22]
cannot find symbol
  symbol: class DataChunk2
[ERROR] <https://builds.apache.org/job/CarbonData-master/ws/core/src/main/java/org/apache/carbondata/core/carbon/datastore/chunk/reader/dimension/v2/CompressedDimensionChunkFileBasedReaderV2.java>:[129,5]
cannot find symbol
  symbol:   class DataChunk2
  location: class org.apache.carbondata.core.carbon.datastore.chunk.reader.dimension.v2.CompressedDimensionChunkFileBasedReaderV2
[ERROR] <https://builds.apache.org/job/CarbonData-master/ws/core/src/main/java/org/apache/carbondata/core/carbon/datastore/chunk/reader/dimension/v2/CompressedDimensionChunkFileBasedReaderV2.java>:[232,5]
cannot find symbol
  symbol:   class DataChunk2
  location: class org.apache.carbondata.core.carbon.datastore.chunk.reader.dimension.v2.CompressedDimensionChunkFileBasedReaderV2
[ERROR] <https://builds.apache.org/job/CarbonData-master/ws/core/src/main/java/org/apache/carbondata/core/util/DataFileFooterConverter2.java>:[66,38]
cannot find symbol
  symbol:   class BlockletInfo2
  location: package org.apache.carbondata.format
[ERROR] <https://builds.apache.org/job/CarbonData-master/ws/core/src/main/java/org/apache/carbondata/core/util/DataFileFooterConverter2.java>:[67,15]
cannot find symbol
  symbol:   method getBlocklet_info_list2()
  location: variable footer of type org.apache.carbondata.format.FileFooter
[ERROR] <https://builds.apache.org/job/CarbonData-master/ws/core/src/main/java/org/apache/carbondata/core/carbon/datastore/chunk/reader/measure/v2/CompressedMeasureChunkFileBasedReaderV2.java>:[134,5]
cannot find symbol
  symbol:   class DataChunk2
  location: class org.apache.carbondata.core.carbon.datastore.chunk.reader.measure.v2.CompressedMeasureChunkFileBasedReaderV2
[ERROR] <https://builds.apache.org/job/CarbonData-master/ws/core/src/main/java/org/apache/carbondata/core/carbon/datastore/chunk/reader/measure/v2/CompressedMeasureChunkFileBasedReaderV2.java>:[201,5]
cannot find symbol
  symbol:   class DataChunk2
  location: class org.apache.carbondata.core.carbon.datastore.chunk.reader.measure.v2.CompressedMeasureChunkFileBasedReaderV2
[INFO] 25 errors 
[INFO] -------------------------------------------------------------
[INFO] ------------------------------------------------------------------------
[INFO] Reactor Summary:
[INFO] 
[INFO] Apache CarbonData :: Parent ........................ SUCCESS [  1.897 s]
[INFO] Apache CarbonData :: Common ........................ SUCCESS [  4.888 s]
[INFO] Apache CarbonData :: Core .......................... FAILURE [  6.234 s]
[INFO] Apache CarbonData :: Processing .................... SKIPPED
[INFO] Apache CarbonData :: Hadoop ........................ SKIPPED
[INFO] Apache CarbonData :: Spark Common .................. SKIPPED
[INFO] Apache CarbonData :: Spark ......................... SKIPPED
[INFO] Apache CarbonData :: Assembly ...................... SKIPPED
[INFO] Apache CarbonData :: Spark Examples ................ SKIPPED
[INFO] ------------------------------------------------------------------------
[INFO] BUILD FAILURE
[INFO] ------------------------------------------------------------------------
[INFO] Total time: 18.330 s
[INFO] Finished at: 2016-12-01T09:53:43+00:00
[INFO] Final Memory: 53M/679M
[INFO] ------------------------------------------------------------------------
Waiting for Jenkins to finish collecting data
[ERROR] Failed to execute goal org.apache.maven.plugins:maven-compiler-plugin:3.2:compile
(default-compile) on project carbondata-core: Compilation failure: Compilation failure:
[ERROR] <https://builds.apache.org/job/CarbonData-master/ws/core/src/main/java/org/apache/carbondata/core/util/CarbonMetadataUtil.java>:[44,36]
cannot find symbol
[ERROR] symbol:   class BlockletInfo2
[ERROR] location: package org.apache.carbondata.format
[ERROR] <https://builds.apache.org/job/CarbonData-master/ws/core/src/main/java/org/apache/carbondata/core/util/CarbonMetadataUtil.java>:[50,36]
cannot find symbol
[ERROR] symbol:   class DataChunk2
[ERROR] location: package org.apache.carbondata.format
[ERROR] <https://builds.apache.org/job/CarbonData-master/ws/core/src/main/java/org/apache/carbondata/core/util/CarbonMetadataUtil.java>:[195,18]
cannot find symbol
[ERROR] symbol:   class BlockletInfo2
[ERROR] location: class org.apache.carbondata.core.util.CarbonMetadataUtil
[ERROR] <https://builds.apache.org/job/CarbonData-master/ws/core/src/main/java/org/apache/carbondata/core/util/CarbonMetadataUtil.java>:[521,22]
cannot find symbol
[ERROR] symbol:   class DataChunk2
[ERROR] location: class org.apache.carbondata.core.util.CarbonMetadataUtil
[ERROR] <https://builds.apache.org/job/CarbonData-master/ws/core/src/main/java/org/apache/carbondata/core/util/CarbonUtil.java>:[74,36]
cannot find symbol
[ERROR] symbol:   class DataChunk2
[ERROR] location: package org.apache.carbondata.format
[ERROR] <https://builds.apache.org/job/CarbonData-master/ws/core/src/main/java/org/apache/carbondata/core/util/CarbonUtil.java>:[1499,17]
cannot find symbol
[ERROR] symbol:   class DataChunk2
[ERROR] location: class org.apache.carbondata.core.util.CarbonUtil
[ERROR] <https://builds.apache.org/job/CarbonData-master/ws/core/src/main/java/org/apache/carbondata/core/carbon/datastore/chunk/reader/dimension/v2/CompressedDimensionChunkFileBasedReaderV2.java>:[33,36]
cannot find symbol
[ERROR] symbol:   class DataChunk2
[ERROR] location: package org.apache.carbondata.format
[ERROR] <https://builds.apache.org/job/CarbonData-master/ws/core/src/main/java/org/apache/carbondata/core/util/DataFileFooterConverter2.java>:[88,35]
cannot find symbol
[ERROR] symbol:   class BlockletInfo2
[ERROR] location: package org.apache.carbondata.format
[ERROR] <https://builds.apache.org/job/CarbonData-master/ws/core/src/main/java/org/apache/carbondata/core/carbon/datastore/chunk/reader/measure/v2/CompressedMeasureChunkFileBasedReaderV2.java>:[36,36]
cannot find symbol
[ERROR] symbol:   class DataChunk2
[ERROR] location: package org.apache.carbondata.format
[ERROR] <https://builds.apache.org/job/CarbonData-master/ws/core/src/main/java/org/apache/carbondata/core/util/CarbonMetadataUtil.java>:[197,5]
cannot find symbol
[ERROR] symbol:   class BlockletInfo2
[ERROR] location: class org.apache.carbondata.core.util.CarbonMetadataUtil
[ERROR] <https://builds.apache.org/job/CarbonData-master/ws/core/src/main/java/org/apache/carbondata/core/util/CarbonMetadataUtil.java>:[197,38]
cannot find symbol
[ERROR] symbol:   class BlockletInfo2
[ERROR] location: class org.apache.carbondata.core.util.CarbonMetadataUtil
[ERROR] <https://builds.apache.org/job/CarbonData-master/ws/core/src/main/java/org/apache/carbondata/core/util/CarbonMetadataUtil.java>:[523,10]
cannot find symbol
[ERROR] symbol:   class DataChunk2
[ERROR] location: class org.apache.carbondata.core.util.CarbonMetadataUtil
[ERROR] <https://builds.apache.org/job/CarbonData-master/ws/core/src/main/java/org/apache/carbondata/core/util/CarbonMetadataUtil.java>:[523,52]
cannot find symbol
[ERROR] symbol:   class DataChunk2
[ERROR] location: class org.apache.carbondata.core.util.CarbonMetadataUtil
[ERROR] <https://builds.apache.org/job/CarbonData-master/ws/core/src/main/java/org/apache/carbondata/core/util/CarbonMetadataUtil.java>:[530,7]
cannot find symbol
[ERROR] symbol:   class DataChunk2
[ERROR] location: class org.apache.carbondata.core.util.CarbonMetadataUtil
[ERROR] <https://builds.apache.org/job/CarbonData-master/ws/core/src/main/java/org/apache/carbondata/core/util/CarbonMetadataUtil.java>:[530,34]
cannot find symbol
[ERROR] symbol:   class DataChunk2
[ERROR] location: class org.apache.carbondata.core.util.CarbonMetadataUtil
[ERROR] <https://builds.apache.org/job/CarbonData-master/ws/core/src/main/java/org/apache/carbondata/core/util/CarbonMetadataUtil.java>:[563,7]
cannot find symbol
[ERROR] symbol:   class DataChunk2
[ERROR] location: class org.apache.carbondata.core.util.CarbonMetadataUtil
[ERROR] <https://builds.apache.org/job/CarbonData-master/ws/core/src/main/java/org/apache/carbondata/core/util/CarbonMetadataUtil.java>:[563,34]
cannot find symbol
[ERROR] symbol:   class DataChunk2
[ERROR] location: class org.apache.carbondata.core.util.CarbonMetadataUtil
[ERROR] <https://builds.apache.org/job/CarbonData-master/ws/core/src/main/java/org/apache/carbondata/core/util/CarbonUtil.java>:[1501,15]
cannot find symbol
[ERROR] symbol:   class DataChunk2
[ERROR] location: class org.apache.carbondata.core.util.CarbonUtil
[ERROR] <https://builds.apache.org/job/CarbonData-master/ws/core/src/main/java/org/apache/carbondata/core/util/CarbonUtil.java>:[1503,22]
cannot find symbol
[ERROR] symbol: class DataChunk2
[ERROR] <https://builds.apache.org/job/CarbonData-master/ws/core/src/main/java/org/apache/carbondata/core/carbon/datastore/chunk/reader/dimension/v2/CompressedDimensionChunkFileBasedReaderV2.java>:[129,5]
cannot find symbol
[ERROR] symbol:   class DataChunk2
[ERROR] location: class org.apache.carbondata.core.carbon.datastore.chunk.reader.dimension.v2.CompressedDimensionChunkFileBasedReaderV2
[ERROR] <https://builds.apache.org/job/CarbonData-master/ws/core/src/main/java/org/apache/carbondata/core/carbon/datastore/chunk/reader/dimension/v2/CompressedDimensionChunkFileBasedReaderV2.java>:[232,5]
cannot find symbol
[ERROR] symbol:   class DataChunk2
[ERROR] location: class org.apache.carbondata.core.carbon.datastore.chunk.reader.dimension.v2.CompressedDimensionChunkFileBasedReaderV2
[ERROR] <https://builds.apache.org/job/CarbonData-master/ws/core/src/main/java/org/apache/carbondata/core/util/DataFileFooterConverter2.java>:[66,38]
cannot find symbol
[ERROR] symbol:   class BlockletInfo2
[ERROR] location: package org.apache.carbondata.format
[ERROR] <https://builds.apache.org/job/CarbonData-master/ws/core/src/main/java/org/apache/carbondata/core/util/DataFileFooterConverter2.java>:[67,15]
cannot find symbol
[ERROR] symbol:   method getBlocklet_info_list2()
[ERROR] location: variable footer of type org.apache.carbondata.format.FileFooter
[ERROR] <https://builds.apache.org/job/CarbonData-master/ws/core/src/main/java/org/apache/carbondata/core/carbon/datastore/chunk/reader/measure/v2/CompressedMeasureChunkFileBasedReaderV2.java>:[134,5]
cannot find symbol
[ERROR] symbol:   class DataChunk2
[ERROR] location: class org.apache.carbondata.core.carbon.datastore.chunk.reader.measure.v2.CompressedMeasureChunkFileBasedReaderV2
[ERROR] <https://builds.apache.org/job/CarbonData-master/ws/core/src/main/java/org/apache/carbondata/core/carbon/datastore/chunk/reader/measure/v2/CompressedMeasureChunkFileBasedReaderV2.java>:[201,5]
cannot find symbol
[ERROR] symbol:   class DataChunk2
[ERROR] location: class org.apache.carbondata.core.carbon.datastore.chunk.reader.measure.v2.CompressedMeasureChunkFileBasedReaderV2
[ERROR] -> [Help 1]
org.apache.maven.lifecycle.LifecycleExecutionException: Failed to execute goal org.apache.maven.plugins:maven-compiler-plugin:3.2:compile
(default-compile) on project carbondata-core: Compilation failure
	at org.apache.maven.lifecycle.internal.MojoExecutor.execute(MojoExecutor.java:212)
	at org.apache.maven.lifecycle.internal.MojoExecutor.execute(MojoExecutor.java:153)
	at org.apache.maven.lifecycle.internal.MojoExecutor.execute(MojoExecutor.java:145)
	at org.apache.maven.lifecycle.internal.LifecycleModuleBuilder.buildProject(LifecycleModuleBuilder.java:116)
	at org.apache.maven.lifecycle.internal.LifecycleModuleBuilder.buildProject(LifecycleModuleBuilder.java:80)
	at org.apache.maven.lifecycle.internal.builder.singlethreaded.SingleThreadedBuilder.build(SingleThreadedBuilder.java:51)
	at org.apache.maven.lifecycle.internal.LifecycleStarter.execute(LifecycleStarter.java:128)
	at org.apache.maven.DefaultMaven.doExecute(DefaultMaven.java:307)
	at org.apache.maven.DefaultMaven.doExecute(DefaultMaven.java:193)
	at org.apache.maven.DefaultMaven.execute(DefaultMaven.java:106)
	at org.jvnet.hudson.maven3.launcher.Maven32Launcher.main(Maven32Launcher.java:132)
	at sun.reflect.NativeMethodAccessorImpl.invoke0(Native Method)
	at sun.reflect.NativeMethodAccessorImpl.invoke(NativeMethodAccessorImpl.java:62)
	at sun.reflect.DelegatingMethodAccessorImpl.invoke(DelegatingMethodAccessorImpl.java:43)
	at java.lang.reflect.Method.invoke(Method.java:498)
	at org.codehaus.plexus.classworlds.launcher.Launcher.launchStandard(Launcher.java:330)
	at org.codehaus.plexus.classworlds.launcher.Launcher.launch(Launcher.java:238)
	at jenkins.maven3.agent.Maven32Main.launch(Maven32Main.java:186)
	at sun.reflect.NativeMethodAccessorImpl.invoke0(Native Method)
	at sun.reflect.NativeMethodAccessorImpl.invoke(NativeMethodAccessorImpl.java:62)
	at sun.reflect.DelegatingMethodAccessorImpl.invoke(DelegatingMethodAccessorImpl.java:43)
	at java.lang.reflect.Method.invoke(Method.java:498)
	at hudson.maven.Maven3Builder.call(Maven3Builder.java:136)
	at hudson.maven.Maven3Builder.call(Maven3Builder.java:71)
	at hudson.remoting.UserRequest.perform(UserRequest.java:153)
	at hudson.remoting.UserRequest.perform(UserRequest.java:50)
	at hudson.remoting.Request$2.run(Request.java:332)
	at hudson.remoting.InterceptingExecutorService$1.call(InterceptingExecutorService.java:68)
	at java.util.concurrent.FutureTask.run(FutureTask.java:266)
	at java.util.concurrent.ThreadPoolExecutor.runWorker(ThreadPoolExecutor.java:1142)
	at java.util.concurrent.ThreadPoolExecutor$Worker.run(ThreadPoolExecutor.java:617)
	at java.lang.Thread.run(Thread.java:745)
Caused by: org.apache.maven.plugin.compiler.CompilationFailureException: Compilation failure
	at org.apache.maven.plugin.compiler.AbstractCompilerMojo.execute(AbstractCompilerMojo.java:909)
	at org.apache.maven.plugin.compiler.CompilerMojo.execute(CompilerMojo.java:129)
	at org.apache.maven.plugin.DefaultBuildPluginManager.executeMojo(DefaultBuildPluginManager.java:134)
	at org.apache.maven.lifecycle.internal.MojoExecutor.execute(MojoExecutor.java:208)
	... 31 more
[ERROR] 
[ERROR] Re-run Maven using the -X switch to enable full debug logging.
[ERROR] 
[ERROR] For more information about the errors and possible solutions, please read the following
articles:
[ERROR] [Help 1] http://cwiki.apache.org/confluence/display/MAVEN/MojoFailureException
[ERROR] 
[ERROR] After correcting the problems, you can resume the build with the command
[ERROR]   mvn <goals> -rf :carbondata-core
[JENKINS] Archiving <https://builds.apache.org/job/CarbonData-master/ws/processing/pom.xml>
to org.apache.carbondata/carbondata-processing/0.3.0-incubating-SNAPSHOT/carbondata-processing-0.3.0-incubating-SNAPSHOT.pom
[JENKINS] Archiving <https://builds.apache.org/job/CarbonData-master/ws/assembly/pom.xml>
to org.apache.carbondata/carbondata-assembly/0.3.0-incubating-SNAPSHOT/carbondata-assembly-0.3.0-incubating-SNAPSHOT.pom
[JENKINS] Archiving <https://builds.apache.org/job/CarbonData-master/ws/integration/spark-common/pom.xml>
to org.apache.carbondata/carbondata-spark-common/0.3.0-incubating-SNAPSHOT/carbondata-spark-common-0.3.0-incubating-SNAPSHOT.pom
[JENKINS] Archiving <https://builds.apache.org/job/CarbonData-master/ws/pom.xml> to
org.apache.carbondata/carbondata-parent/0.3.0-incubating-SNAPSHOT/carbondata-parent-0.3.0-incubating-SNAPSHOT.pom
[JENKINS] Archiving <https://builds.apache.org/job/CarbonData-master/ws/core/pom.xml>
to org.apache.carbondata/carbondata-core/0.3.0-incubating-SNAPSHOT/carbondata-core-0.3.0-incubating-SNAPSHOT.pom
[JENKINS] Archiving <https://builds.apache.org/job/CarbonData-master/ws/hadoop/pom.xml>
to org.apache.carbondata/carbondata-hadoop/0.3.0-incubating-SNAPSHOT/carbondata-hadoop-0.3.0-incubating-SNAPSHOT.pom
[JENKINS] Archiving <https://builds.apache.org/job/CarbonData-master/ws/examples/spark/pom.xml>
to org.apache.carbondata/carbondata-examples-spark/0.3.0-incubating-SNAPSHOT/carbondata-examples-spark-0.3.0-incubating-SNAPSHOT.pom
[JENKINS] Archiving <https://builds.apache.org/job/CarbonData-master/ws/common/pom.xml>
to org.apache.carbondata/carbondata-common/0.3.0-incubating-SNAPSHOT/carbondata-common-0.3.0-incubating-SNAPSHOT.pom
[JENKINS] Archiving <https://builds.apache.org/job/CarbonData-master/ws/common/target/carbondata-common-0.3.0-incubating-SNAPSHOT.jar>
to org.apache.carbondata/carbondata-common/0.3.0-incubating-SNAPSHOT/carbondata-common-0.3.0-incubating-SNAPSHOT.jar
[JENKINS] Archiving <https://builds.apache.org/job/CarbonData-master/ws/integration/spark/pom.xml>
to org.apache.carbondata/carbondata-spark/0.3.0-incubating-SNAPSHOT/carbondata-spark-0.3.0-incubating-SNAPSHOT.pom
Sending e-mails to: commits@carbondata.incubator.apache.org
channel stopped

Mime
View raw message