carbondata-commits mailing list archives

Site index · List index
Message view « Date » · « Thread »
Top « Date » · « Thread »
From Apache Jenkins Server <jenk...@builds.apache.org>
Subject Build failed in Jenkins: CarbonData-master » Apache CarbonData :: Examples #161
Date Mon, 07 Nov 2016 12:14:18 GMT
See <https://builds.apache.org/job/CarbonData-master/org.apache.carbondata$carbondata-examples/161/>

------------------------------------------
[...truncated 26 lines...]
[INFO] Downloading: http://repository.apache.org/snapshots/org/apache/carbondata/carbondata-parent/0.2.0-incubating-SNAPSHOT/maven-metadata.xml
[INFO] Downloaded: http://repository.apache.org/snapshots/org/apache/carbondata/carbondata-parent/0.2.0-incubating-SNAPSHOT/maven-metadata.xml
(637 B at 1.4 KB/sec)
[WARNING] Could not transfer metadata org.apache.carbondata:carbondata-parent:0.2.0-incubating-SNAPSHOT/maven-metadata.xml
from/to pentaho-releases (http://repository.pentaho.org/artifactory/repo/): Failed to transfer
file: http://repository.pentaho.org/artifactory/repo/org/apache/carbondata/carbondata-parent/0.2.0-incubating-SNAPSHOT/maven-metadata.xml.
Return code is: 503 , ReasonPhrase:Service Temporarily Unavailable.
[INFO] Downloading: http://repository.apache.org/snapshots/org/apache/carbondata/carbondata-parent/0.2.0-incubating-SNAPSHOT/carbondata-parent-0.2.0-incubating-20161024.193049-4.pom
[INFO] Downloaded: http://repository.apache.org/snapshots/org/apache/carbondata/carbondata-parent/0.2.0-incubating-SNAPSHOT/carbondata-parent-0.2.0-incubating-20161024.193049-4.pom
(14 KB at 35.4 KB/sec)
[INFO] Downloading: http://repository.pentaho.org/artifactory/repo/org/apache/carbondata/carbondata-core/0.2.0-incubating-SNAPSHOT/maven-metadata.xml
[INFO] Downloading: http://repository.apache.org/snapshots/org/apache/carbondata/carbondata-core/0.2.0-incubating-SNAPSHOT/maven-metadata.xml
[INFO] Downloaded: http://repository.apache.org/snapshots/org/apache/carbondata/carbondata-core/0.2.0-incubating-SNAPSHOT/maven-metadata.xml
(819 B at 2.2 KB/sec)
[WARNING] Could not transfer metadata org.apache.carbondata:carbondata-core:0.2.0-incubating-SNAPSHOT/maven-metadata.xml
from/to pentaho-releases (http://repository.pentaho.org/artifactory/repo/): Failed to transfer
file: http://repository.pentaho.org/artifactory/repo/org/apache/carbondata/carbondata-core/0.2.0-incubating-SNAPSHOT/maven-metadata.xml.
Return code is: 502 , ReasonPhrase:Proxy Error.
[WARNING] Failure to transfer org.apache.carbondata:carbondata-core:0.2.0-incubating-SNAPSHOT/maven-metadata.xml
from http://repository.pentaho.org/artifactory/repo/ was cached in the local repository, resolution
will not be reattempted until the update interval of pentaho-releases has elapsed or updates
are forced. Original error: Could not transfer metadata org.apache.carbondata:carbondata-core:0.2.0-incubating-SNAPSHOT/maven-metadata.xml
from/to pentaho-releases (http://repository.pentaho.org/artifactory/repo/): Failed to transfer
file: http://repository.pentaho.org/artifactory/repo/org/apache/carbondata/carbondata-core/0.2.0-incubating-SNAPSHOT/maven-metadata.xml.
Return code is: 502 , ReasonPhrase:Proxy Error.
[INFO] Downloading: http://repository.pentaho.org/artifactory/repo/org/apache/carbondata/carbondata-core/0.2.0-incubating-SNAPSHOT/carbondata-core-0.2.0-incubating-20161024.193227-2.pom
[INFO] Downloading: http://repository.apache.org/snapshots/org/apache/carbondata/carbondata-core/0.2.0-incubating-SNAPSHOT/carbondata-core-0.2.0-incubating-20161024.193227-2.pom
[INFO] Downloaded: http://repository.apache.org/snapshots/org/apache/carbondata/carbondata-core/0.2.0-incubating-SNAPSHOT/carbondata-core-0.2.0-incubating-20161024.193227-2.pom
(5 KB at 10.8 KB/sec)
[INFO] Downloading: http://repository.pentaho.org/artifactory/repo/pentaho-kettle/kettle-engine/4.4.0-stable/kettle-engine-4.4.0-stable.pom
[INFO] Downloading: http://repository.pentaho.org/artifactory/repo/pentaho-kettle/kettle-core/4.4.0-stable/kettle-core-4.4.0-stable.pom
[INFO] Downloading: http://repository.pentaho.org/artifactory/repo/pentaho-kettle/kettle-db/4.4.0-stable/kettle-db-4.4.0-stable.pom
[WARNING] The POM for pentaho-kettle:kettle-db:jar:4.4.0-stable is missing, no dependency
information available
[INFO] Downloading: http://repository.pentaho.org/artifactory/repo/org/apache/carbondata/carbondata-processing/0.2.0-incubating-SNAPSHOT/maven-metadata.xml
[INFO] Downloading: http://repository.apache.org/snapshots/org/apache/carbondata/carbondata-processing/0.2.0-incubating-SNAPSHOT/maven-metadata.xml
[INFO] Downloaded: http://repository.apache.org/snapshots/org/apache/carbondata/carbondata-processing/0.2.0-incubating-SNAPSHOT/maven-metadata.xml
(825 B at 2.1 KB/sec)
[WARNING] Could not transfer metadata org.apache.carbondata:carbondata-processing:0.2.0-incubating-SNAPSHOT/maven-metadata.xml
from/to pentaho-releases (http://repository.pentaho.org/artifactory/repo/): Failed to transfer
file: http://repository.pentaho.org/artifactory/repo/org/apache/carbondata/carbondata-processing/0.2.0-incubating-SNAPSHOT/maven-metadata.xml.
Return code is: 503 , ReasonPhrase:Service Temporarily Unavailable.
[WARNING] Failure to transfer org.apache.carbondata:carbondata-processing:0.2.0-incubating-SNAPSHOT/maven-metadata.xml
from http://repository.pentaho.org/artifactory/repo/ was cached in the local repository, resolution
will not be reattempted until the update interval of pentaho-releases has elapsed or updates
are forced. Original error: Could not transfer metadata org.apache.carbondata:carbondata-processing:0.2.0-incubating-SNAPSHOT/maven-metadata.xml
from/to pentaho-releases (http://repository.pentaho.org/artifactory/repo/): Failed to transfer
file: http://repository.pentaho.org/artifactory/repo/org/apache/carbondata/carbondata-processing/0.2.0-incubating-SNAPSHOT/maven-metadata.xml.
Return code is: 503 , ReasonPhrase:Service Temporarily Unavailable.
[INFO] Downloading: http://repository.pentaho.org/artifactory/repo/org/apache/carbondata/carbondata-processing/0.2.0-incubating-SNAPSHOT/carbondata-processing-0.2.0-incubating-20161024.193338-2.pom
[INFO] Downloading: http://repository.apache.org/snapshots/org/apache/carbondata/carbondata-processing/0.2.0-incubating-SNAPSHOT/carbondata-processing-0.2.0-incubating-20161024.193338-2.pom
[INFO] Downloaded: http://repository.apache.org/snapshots/org/apache/carbondata/carbondata-processing/0.2.0-incubating-SNAPSHOT/carbondata-processing-0.2.0-incubating-20161024.193338-2.pom
(5 KB at 12.3 KB/sec)
[INFO] Downloading: http://repository.pentaho.org/artifactory/repo/com/univocity/univocity-parsers/1.5.6/univocity-parsers-1.5.6.pom
[INFO] Downloading: https://repo.maven.apache.org/maven2/com/univocity/univocity-parsers/1.5.6/univocity-parsers-1.5.6.pom
[INFO] Downloaded: https://repo.maven.apache.org/maven2/com/univocity/univocity-parsers/1.5.6/univocity-parsers-1.5.6.pom
(8 KB at 291.6 KB/sec)
[INFO] Downloading: http://repository.pentaho.org/artifactory/repo/org/apache/carbondata/carbondata-spark/0.2.0-incubating-SNAPSHOT/maven-metadata.xml
[INFO] Downloading: http://repository.apache.org/snapshots/org/apache/carbondata/carbondata-spark/0.2.0-incubating-SNAPSHOT/maven-metadata.xml
[INFO] Downloaded: http://repository.apache.org/snapshots/org/apache/carbondata/carbondata-spark/0.2.0-incubating-SNAPSHOT/maven-metadata.xml
(820 B at 2.1 KB/sec)
[WARNING] Could not transfer metadata org.apache.carbondata:carbondata-spark:0.2.0-incubating-SNAPSHOT/maven-metadata.xml
from/to pentaho-releases (http://repository.pentaho.org/artifactory/repo/): Failed to transfer
file: http://repository.pentaho.org/artifactory/repo/org/apache/carbondata/carbondata-spark/0.2.0-incubating-SNAPSHOT/maven-metadata.xml.
Return code is: 503 , ReasonPhrase:Service Temporarily Unavailable.
[WARNING] Failure to transfer org.apache.carbondata:carbondata-spark:0.2.0-incubating-SNAPSHOT/maven-metadata.xml
from http://repository.pentaho.org/artifactory/repo/ was cached in the local repository, resolution
will not be reattempted until the update interval of pentaho-releases has elapsed or updates
are forced. Original error: Could not transfer metadata org.apache.carbondata:carbondata-spark:0.2.0-incubating-SNAPSHOT/maven-metadata.xml
from/to pentaho-releases (http://repository.pentaho.org/artifactory/repo/): Failed to transfer
file: http://repository.pentaho.org/artifactory/repo/org/apache/carbondata/carbondata-spark/0.2.0-incubating-SNAPSHOT/maven-metadata.xml.
Return code is: 503 , ReasonPhrase:Service Temporarily Unavailable.
[INFO] Downloading: http://repository.pentaho.org/artifactory/repo/org/apache/carbondata/carbondata-spark/0.2.0-incubating-SNAPSHOT/carbondata-spark-0.2.0-incubating-20161024.193534-1.pom
[INFO] Downloading: http://repository.apache.org/snapshots/org/apache/carbondata/carbondata-spark/0.2.0-incubating-SNAPSHOT/carbondata-spark-0.2.0-incubating-20161024.193534-1.pom
[INFO] Downloaded: http://repository.apache.org/snapshots/org/apache/carbondata/carbondata-spark/0.2.0-incubating-SNAPSHOT/carbondata-spark-0.2.0-incubating-20161024.193534-1.pom
(7 KB at 13.5 KB/sec)
[INFO] Downloading: http://repository.pentaho.org/artifactory/repo/com/databricks/spark-csv_2.10/1.2.0/spark-csv_2.10-1.2.0.pom
[INFO] Downloading: https://repo.maven.apache.org/maven2/com/databricks/spark-csv_2.10/1.2.0/spark-csv_2.10-1.2.0.pom
[INFO] Downloaded: https://repo.maven.apache.org/maven2/com/databricks/spark-csv_2.10/1.2.0/spark-csv_2.10-1.2.0.pom
(4 KB at 79.1 KB/sec)
[INFO] Downloading: http://repository.pentaho.org/artifactory/repo/com/univocity/univocity-parsers/1.5.1/univocity-parsers-1.5.1.pom
[INFO] Downloading: https://repo.maven.apache.org/maven2/com/univocity/univocity-parsers/1.5.1/univocity-parsers-1.5.1.pom
[INFO] Downloaded: https://repo.maven.apache.org/maven2/com/univocity/univocity-parsers/1.5.1/univocity-parsers-1.5.1.pom
(8 KB at 252.7 KB/sec)
[INFO] Downloading: http://repository.pentaho.org/artifactory/repo/org/apache/carbondata/carbondata-hadoop/0.2.0-incubating-SNAPSHOT/maven-metadata.xml
[INFO] Downloading: http://repository.apache.org/snapshots/org/apache/carbondata/carbondata-hadoop/0.2.0-incubating-SNAPSHOT/maven-metadata.xml
[INFO] Downloaded: http://repository.apache.org/snapshots/org/apache/carbondata/carbondata-hadoop/0.2.0-incubating-SNAPSHOT/maven-metadata.xml
(821 B at 2.1 KB/sec)
[INFO] Downloading: http://repository.pentaho.org/artifactory/repo/org/apache/carbondata/carbondata-hadoop/0.2.0-incubating-SNAPSHOT/carbondata-hadoop-0.2.0-incubating-20161024.193427-2.pom
[INFO] Downloading: http://repository.apache.org/snapshots/org/apache/carbondata/carbondata-hadoop/0.2.0-incubating-SNAPSHOT/carbondata-hadoop-0.2.0-incubating-20161024.193427-2.pom
[INFO] Downloaded: http://repository.apache.org/snapshots/org/apache/carbondata/carbondata-hadoop/0.2.0-incubating-SNAPSHOT/carbondata-hadoop-0.2.0-incubating-20161024.193427-2.pom
(4 KB at 8.6 KB/sec)
[INFO] Downloading: http://repository.pentaho.org/artifactory/repo/org/apache/spark/spark-hive-thriftserver_2.10/1.5.2/spark-hive-thriftserver_2.10-1.5.2.pom
[INFO] Downloading: https://repo.maven.apache.org/maven2/org/apache/spark/spark-hive-thriftserver_2.10/1.5.2/spark-hive-thriftserver_2.10-1.5.2.pom
[INFO] Downloaded: https://repo.maven.apache.org/maven2/org/apache/spark/spark-hive-thriftserver_2.10/1.5.2/spark-hive-thriftserver_2.10-1.5.2.pom
(14 KB at 330.9 KB/sec)
[INFO] Downloading: http://repository.pentaho.org/artifactory/repo/org/apache/spark/spark-hive_2.10/1.5.2/spark-hive_2.10-1.5.2.pom
[INFO] Downloading: https://repo.maven.apache.org/maven2/org/apache/spark/spark-hive_2.10/1.5.2/spark-hive_2.10-1.5.2.pom
[INFO] Downloaded: https://repo.maven.apache.org/maven2/org/apache/spark/spark-hive_2.10/1.5.2/spark-hive_2.10-1.5.2.pom
(18 KB at 207.0 KB/sec)
[INFO] Downloading: http://repository.pentaho.org/artifactory/repo/com/twitter/parquet-hadoop-bundle/1.6.0/parquet-hadoop-bundle-1.6.0.pom
[INFO] Downloading: https://repo.maven.apache.org/maven2/com/twitter/parquet-hadoop-bundle/1.6.0/parquet-hadoop-bundle-1.6.0.pom
[INFO] Downloaded: https://repo.maven.apache.org/maven2/com/twitter/parquet-hadoop-bundle/1.6.0/parquet-hadoop-bundle-1.6.0.pom
(3 KB at 135.2 KB/sec)
[INFO] Downloading: http://repository.pentaho.org/artifactory/repo/com/twitter/parquet/1.6.0/parquet-1.6.0.pom
[INFO] Downloading: https://repo.maven.apache.org/maven2/com/twitter/parquet/1.6.0/parquet-1.6.0.pom
[INFO] Downloaded: https://repo.maven.apache.org/maven2/com/twitter/parquet/1.6.0/parquet-1.6.0.pom
(19 KB at 740.1 KB/sec)
[INFO] Downloading: http://repository.pentaho.org/artifactory/repo/org/spark-project/hive/hive-exec/1.2.1.spark/hive-exec-1.2.1.spark.pom
[INFO] Downloading: https://repo.maven.apache.org/maven2/org/spark-project/hive/hive-exec/1.2.1.spark/hive-exec-1.2.1.spark.pom
[INFO] Downloaded: https://repo.maven.apache.org/maven2/org/spark-project/hive/hive-exec/1.2.1.spark/hive-exec-1.2.1.spark.pom
(28 KB at 536.5 KB/sec)
[INFO] Downloading: http://repository.pentaho.org/artifactory/repo/org/spark-project/hive/hive/1.2.1.spark/hive-1.2.1.spark.pom
[INFO] Downloading: https://repo.maven.apache.org/maven2/org/spark-project/hive/hive/1.2.1.spark/hive-1.2.1.spark.pom
[INFO] Downloaded: https://repo.maven.apache.org/maven2/org/spark-project/hive/hive/1.2.1.spark/hive-1.2.1.spark.pom
(48 KB at 1473.1 KB/sec)
[INFO] Downloading: http://repository.pentaho.org/artifactory/repo/org/apache/avro/avro/1.7.5/avro-1.7.5.pom
[INFO] Downloading: https://repo.maven.apache.org/maven2/org/apache/avro/avro/1.7.5/avro-1.7.5.pom
[INFO] Downloaded: https://repo.maven.apache.org/maven2/org/apache/avro/avro/1.7.5/avro-1.7.5.pom
(0 B at 0.0 KB/sec)
[INFO] Downloading: http://repository.pentaho.org/artifactory/repo/org/codehaus/groovy/groovy-all/2.1.6/groovy-all-2.1.6.pom
[INFO] Downloading: https://repo.maven.apache.org/maven2/org/codehaus/groovy/groovy-all/2.1.6/groovy-all-2.1.6.pom
[INFO] Downloaded: https://repo.maven.apache.org/maven2/org/codehaus/groovy/groovy-all/2.1.6/groovy-all-2.1.6.pom
(18 KB at 338.8 KB/sec)
[INFO] Downloading: http://repository.pentaho.org/artifactory/repo/org/jodd/jodd-core/3.5.2/jodd-core-3.5.2.pom
[INFO] Downloading: https://repo.maven.apache.org/maven2/org/jodd/jodd-core/3.5.2/jodd-core-3.5.2.pom
[INFO] Downloaded: https://repo.maven.apache.org/maven2/org/jodd/jodd-core/3.5.2/jodd-core-3.5.2.pom
(2 KB at 36.5 KB/sec)
[INFO] Downloading: http://repository.pentaho.org/artifactory/repo/org/datanucleus/datanucleus-core/3.2.10/datanucleus-core-3.2.10.pom
[INFO] Downloading: https://repo.maven.apache.org/maven2/org/datanucleus/datanucleus-core/3.2.10/datanucleus-core-3.2.10.pom
[INFO] Downloaded: https://repo.maven.apache.org/maven2/org/datanucleus/datanucleus-core/3.2.10/datanucleus-core-3.2.10.pom
(14 KB at 143.9 KB/sec)
[INFO] Downloading: http://repository.pentaho.org/artifactory/repo/org/apache/calcite/calcite-avatica/1.2.0-incubating/calcite-avatica-1.2.0-incubating.pom
[INFO] Downloading: https://repo.maven.apache.org/maven2/org/apache/calcite/calcite-avatica/1.2.0-incubating/calcite-avatica-1.2.0-incubating.pom
[INFO] Downloaded: https://repo.maven.apache.org/maven2/org/apache/calcite/calcite-avatica/1.2.0-incubating/calcite-avatica-1.2.0-incubating.pom
(4 KB at 38.0 KB/sec)
[INFO] Downloading: http://repository.pentaho.org/artifactory/repo/org/apache/calcite/calcite/1.2.0-incubating/calcite-1.2.0-incubating.pom
[INFO] Downloading: https://repo.maven.apache.org/maven2/org/apache/calcite/calcite/1.2.0-incubating/calcite-1.2.0-incubating.pom
[INFO] Downloaded: https://repo.maven.apache.org/maven2/org/apache/calcite/calcite/1.2.0-incubating/calcite-1.2.0-incubating.pom
(24 KB at 822.8 KB/sec)
[INFO] Downloading: http://repository.pentaho.org/artifactory/repo/org/spark-project/hive/hive-metastore/1.2.1.spark/hive-metastore-1.2.1.spark.pom
[INFO] Downloading: https://repo.maven.apache.org/maven2/org/spark-project/hive/hive-metastore/1.2.1.spark/hive-metastore-1.2.1.spark.pom
[INFO] Downloaded: https://repo.maven.apache.org/maven2/org/spark-project/hive/hive-metastore/1.2.1.spark/hive-metastore-1.2.1.spark.pom
(9 KB at 402.1 KB/sec)
[INFO] Downloading: http://repository.pentaho.org/artifactory/repo/org/datanucleus/datanucleus-api-jdo/3.2.6/datanucleus-api-jdo-3.2.6.pom
[INFO] Downloading: https://repo.maven.apache.org/maven2/org/datanucleus/datanucleus-api-jdo/3.2.6/datanucleus-api-jdo-3.2.6.pom
[INFO] Downloaded: https://repo.maven.apache.org/maven2/org/datanucleus/datanucleus-api-jdo/3.2.6/datanucleus-api-jdo-3.2.6.pom
(10 KB at 148.7 KB/sec)
[INFO] Downloading: http://repository.pentaho.org/artifactory/repo/org/datanucleus/datanucleus-rdbms/3.2.9/datanucleus-rdbms-3.2.9.pom
[INFO] Downloading: https://repo.maven.apache.org/maven2/org/datanucleus/datanucleus-rdbms/3.2.9/datanucleus-rdbms-3.2.9.pom
[INFO] Downloaded: https://repo.maven.apache.org/maven2/org/datanucleus/datanucleus-rdbms/3.2.9/datanucleus-rdbms-3.2.9.pom
(13 KB at 122.6 KB/sec)
[INFO] Downloading: http://repository.pentaho.org/artifactory/repo/org/apache/calcite/calcite-core/1.2.0-incubating/calcite-core-1.2.0-incubating.pom
[INFO] Downloading: https://repo.maven.apache.org/maven2/org/apache/calcite/calcite-core/1.2.0-incubating/calcite-core-1.2.0-incubating.pom
[INFO] Downloaded: https://repo.maven.apache.org/maven2/org/apache/calcite/calcite-core/1.2.0-incubating/calcite-core-1.2.0-incubating.pom
(11 KB at 475.0 KB/sec)
[INFO] Downloading: http://repository.pentaho.org/artifactory/repo/org/apache/calcite/calcite-linq4j/1.2.0-incubating/calcite-linq4j-1.2.0-incubating.pom
[INFO] Downloading: https://repo.maven.apache.org/maven2/org/apache/calcite/calcite-linq4j/1.2.0-incubating/calcite-linq4j-1.2.0-incubating.pom
[INFO] Downloaded: https://repo.maven.apache.org/maven2/org/apache/calcite/calcite-linq4j/1.2.0-incubating/calcite-linq4j-1.2.0-incubating.pom
(3 KB at 52.1 KB/sec)
[INFO] Downloading: http://repository.pentaho.org/artifactory/repo/org/apache/thrift/libfb303/0.9.2/libfb303-0.9.2.pom
[INFO] Downloading: https://repo.maven.apache.org/maven2/org/apache/thrift/libfb303/0.9.2/libfb303-0.9.2.pom
[INFO] Downloaded: https://repo.maven.apache.org/maven2/org/apache/thrift/libfb303/0.9.2/libfb303-0.9.2.pom
(3 KB at 50.7 KB/sec)
[INFO] Downloading: http://repository.pentaho.org/artifactory/repo/org/spark-project/hive/hive-cli/1.2.1.spark/hive-cli-1.2.1.spark.pom
[INFO] Downloading: https://repo.maven.apache.org/maven2/org/spark-project/hive/hive-cli/1.2.1.spark/hive-cli-1.2.1.spark.pom
[INFO] Downloaded: https://repo.maven.apache.org/maven2/org/spark-project/hive/hive-cli/1.2.1.spark/hive-cli-1.2.1.spark.pom
(6 KB at 86.2 KB/sec)
[INFO] Downloading: http://repository.pentaho.org/artifactory/repo/org/spark-project/hive/hive-jdbc/1.2.1.spark/hive-jdbc-1.2.1.spark.pom
[INFO] Downloading: https://repo.maven.apache.org/maven2/org/spark-project/hive/hive-jdbc/1.2.1.spark/hive-jdbc-1.2.1.spark.pom
[INFO] Downloaded: https://repo.maven.apache.org/maven2/org/spark-project/hive/hive-jdbc/1.2.1.spark/hive-jdbc-1.2.1.spark.pom
(8 KB at 111.3 KB/sec)
[INFO] Downloading: http://repository.pentaho.org/artifactory/repo/org/spark-project/hive/hive-service/1.2.1.spark/hive-service-1.2.1.spark.pom
[INFO] Downloading: https://repo.maven.apache.org/maven2/org/spark-project/hive/hive-service/1.2.1.spark/hive-service-1.2.1.spark.pom
[INFO] Downloaded: https://repo.maven.apache.org/maven2/org/spark-project/hive/hive-service/1.2.1.spark/hive-service-1.2.1.spark.pom
(6 KB at 117.0 KB/sec)
[INFO] Downloading: http://repository.pentaho.org/artifactory/repo/org/spark-project/hive/hive-beeline/1.2.1.spark/hive-beeline-1.2.1.spark.pom
[INFO] Downloading: https://repo.maven.apache.org/maven2/org/spark-project/hive/hive-beeline/1.2.1.spark/hive-beeline-1.2.1.spark.pom
[INFO] Downloaded: https://repo.maven.apache.org/maven2/org/spark-project/hive/hive-beeline/1.2.1.spark/hive-beeline-1.2.1.spark.pom
(6 KB at 79.6 KB/sec)
[INFO] Downloading: http://repository.pentaho.org/artifactory/repo/org/apache/spark/spark-repl_2.10/1.5.2/spark-repl_2.10-1.5.2.pom
[INFO] Downloading: https://repo.maven.apache.org/maven2/org/apache/spark/spark-repl_2.10/1.5.2/spark-repl_2.10-1.5.2.pom
[INFO] Downloaded: https://repo.maven.apache.org/maven2/org/apache/spark/spark-repl_2.10/1.5.2/spark-repl_2.10-1.5.2.pom
(0 B at 0.0 KB/sec)
[INFO] Downloading: http://repository.pentaho.org/artifactory/repo/org/apache/spark/spark-bagel_2.10/1.5.2/spark-bagel_2.10-1.5.2.pom
[INFO] Downloading: https://repo.maven.apache.org/maven2/org/apache/spark/spark-bagel_2.10/1.5.2/spark-bagel_2.10-1.5.2.pom
[INFO] Downloaded: https://repo.maven.apache.org/maven2/org/apache/spark/spark-bagel_2.10/1.5.2/spark-bagel_2.10-1.5.2.pom
(0 B at 0.0 KB/sec)
[INFO] Downloading: http://repository.pentaho.org/artifactory/repo/org/apache/spark/spark-mllib_2.10/1.5.2/spark-mllib_2.10-1.5.2.pom
[INFO] Downloading: https://repo.maven.apache.org/maven2/org/apache/spark/spark-mllib_2.10/1.5.2/spark-mllib_2.10-1.5.2.pom
[INFO] Downloaded: https://repo.maven.apache.org/maven2/org/apache/spark/spark-mllib_2.10/1.5.2/spark-mllib_2.10-1.5.2.pom
(0 B at 0.0 KB/sec)
[INFO] Downloading: http://repository.pentaho.org/artifactory/repo/org/apache/spark/spark-streaming_2.10/1.5.2/spark-streaming_2.10-1.5.2.pom
[INFO] Downloading: https://repo.maven.apache.org/maven2/org/apache/spark/spark-streaming_2.10/1.5.2/spark-streaming_2.10-1.5.2.pom
[INFO] Downloaded: https://repo.maven.apache.org/maven2/org/apache/spark/spark-streaming_2.10/1.5.2/spark-streaming_2.10-1.5.2.pom
(0 B at 0.0 KB/sec)
[INFO] Downloading: http://repository.pentaho.org/artifactory/repo/org/apache/spark/spark-graphx_2.10/1.5.2/spark-graphx_2.10-1.5.2.pom
[INFO] Downloading: https://repo.maven.apache.org/maven2/org/apache/spark/spark-graphx_2.10/1.5.2/spark-graphx_2.10-1.5.2.pom
[INFO] Downloaded: https://repo.maven.apache.org/maven2/org/apache/spark/spark-graphx_2.10/1.5.2/spark-graphx_2.10-1.5.2.pom
(0 B at 0.0 KB/sec)
[INFO] Downloading: http://repository.pentaho.org/artifactory/repo/eigenbase/eigenbase-xom/1.3.4/eigenbase-xom-1.3.4.pom
[INFO] Downloading: https://repo.maven.apache.org/maven2/eigenbase/eigenbase-xom/1.3.4/eigenbase-xom-1.3.4.pom
[INFO] ------------------------------------------------------------------------
[INFO] BUILD FAILURE
[INFO] ------------------------------------------------------------------------
[INFO] Total time: 10:20 min
[INFO] Finished at: 2016-11-07T12:12:30+00:00
[INFO] Final Memory: 22M/397M
[INFO] ------------------------------------------------------------------------
Waiting for Jenkins to finish collecting data[ERROR] Failed to execute goal on project carbondata-examples:
Could not resolve dependencies for project org.apache.carbondata:carbondata-examples:jar:0.2.0-incubating-SNAPSHOT:
Failed to collect dependencies at org.apache.carbondata:carbondata-core:jar:0.2.0-incubating-SNAPSHOT
-> pentaho-kettle:kettle-engine:jar:4.4.0-stable: Failed to read artifact descriptor for
pentaho-kettle:kettle-engine:jar:4.4.0-stable: Could not transfer artifact pentaho-kettle:kettle-engine:pom:4.4.0-stable
from/to pentaho-releases (http://repository.pentaho.org/artifactory/repo/): Failed to transfer
file: http://repository.pentaho.org/artifactory/repo/pentaho-kettle/kettle-engine/4.4.0-stable/kettle-engine-4.4.0-stable.pom.
Return code is: 503 , ReasonPhrase:Service Temporarily Unavailable. -> [Help 1]
org.apache.maven.lifecycle.LifecycleExecutionException: Failed to execute goal on project
carbondata-examples: Could not resolve dependencies for project org.apache.carbondata:carbondata-examples:jar:0.2.0-incubating-SNAPSHOT:
Failed to collect dependencies at org.apache.carbondata:carbondata-core:jar:0.2.0-incubating-SNAPSHOT
-> pentaho-kettle:kettle-engine:jar:4.4.0-stable
	at org.apache.maven.lifecycle.internal.LifecycleDependencyResolver.getDependencies(LifecycleDependencyResolver.java:221)
	at org.apache.maven.lifecycle.internal.LifecycleDependencyResolver.resolveProjectDependencies(LifecycleDependencyResolver.java:127)
	at org.apache.maven.lifecycle.internal.MojoExecutor.ensureDependenciesAreResolved(MojoExecutor.java:257)
	at org.apache.maven.lifecycle.internal.MojoExecutor.execute(MojoExecutor.java:200)
	at org.apache.maven.lifecycle.internal.MojoExecutor.execute(MojoExecutor.java:153)
	at org.apache.maven.lifecycle.internal.MojoExecutor.execute(MojoExecutor.java:145)
	at org.apache.maven.lifecycle.internal.LifecycleModuleBuilder.buildProject(LifecycleModuleBuilder.java:116)
	at org.apache.maven.lifecycle.internal.LifecycleModuleBuilder.buildProject(LifecycleModuleBuilder.java:80)
	at org.apache.maven.lifecycle.internal.builder.singlethreaded.SingleThreadedBuilder.build(SingleThreadedBuilder.java:51)
	at org.apache.maven.lifecycle.internal.LifecycleStarter.execute(LifecycleStarter.java:128)
	at org.apache.maven.DefaultMaven.doExecute(DefaultMaven.java:307)
	at org.apache.maven.DefaultMaven.doExecute(DefaultMaven.java:193)
	at org.apache.maven.DefaultMaven.execute(DefaultMaven.java:106)
	at org.jvnet.hudson.maven3.launcher.Maven32Launcher.main(Maven32Launcher.java:132)
	at sun.reflect.NativeMethodAccessorImpl.invoke0(Native Method)
	at sun.reflect.NativeMethodAccessorImpl.invoke(NativeMethodAccessorImpl.java:62)
	at sun.reflect.DelegatingMethodAccessorImpl.invoke(DelegatingMethodAccessorImpl.java:43)
	at java.lang.reflect.Method.invoke(Method.java:498)
	at org.codehaus.plexus.classworlds.launcher.Launcher.launchStandard(Launcher.java:330)
	at org.codehaus.plexus.classworlds.launcher.Launcher.launch(Launcher.java:238)
	at jenkins.maven3.agent.Maven32Main.launch(Maven32Main.java:186)
	at sun.reflect.NativeMethodAccessorImpl.invoke0(Native Method)
	at sun.reflect.NativeMethodAccessorImpl.invoke(NativeMethodAccessorImpl.java:62)
	at sun.reflect.DelegatingMethodAccessorImpl.invoke(DelegatingMethodAccessorImpl.java:43)
	at java.lang.reflect.Method.invoke(Method.java:498)
	at hudson.maven.Maven3Builder.call(Maven3Builder.java:136)
	at hudson.maven.Maven3Builder.call(Maven3Builder.java:71)
	at hudson.remoting.UserRequest.perform(UserRequest.java:153)
	at hudson.remoting.UserRequest.perform(UserRequest.java:50)
	at hudson.remoting.Request$2.run(Request.java:332)
	at hudson.remoting.InterceptingExecutorService$1.call(InterceptingExecutorService.java:68)
	at java.util.concurrent.FutureTask.run(FutureTask.java:266)
	at java.util.concurrent.ThreadPoolExecutor.runWorker(ThreadPoolExecutor.java:1142)
	at java.util.concurrent.ThreadPoolExecutor$Worker.run(ThreadPoolExecutor.java:617)
	at java.lang.Thread.run(Thread.java:745)
Caused by: org.apache.maven.project.DependencyResolutionException: Could not resolve dependencies
for project org.apache.carbondata:carbondata-examples:jar:0.2.0-incubating-SNAPSHOT: Failed
to collect dependencies at org.apache.carbondata:carbondata-core:jar:0.2.0-incubating-SNAPSHOT
-> pentaho-kettle:kettle-engine:jar:4.4.0-stable
	at org.apache.maven.project.DefaultProjectDependenciesResolver.resolve(DefaultProjectDependenciesResolver.java:180)
	at org.apache.maven.lifecycle.internal.LifecycleDependencyResolver.getDependencies(LifecycleDependencyResolver.java:195)
	... 34 more
Caused by: org.eclipse.aether.collection.DependencyCollectionException: Failed to collect
dependencies at org.apache.carbondata:carbondata-core:jar:0.2.0-incubating-SNAPSHOT ->
pentaho-kettle:kettle-engine:jar:4.4.0-stable
	at org.eclipse.aether.internal.impl.DefaultDependencyCollector.collectDependencies(DefaultDependencyCollector.java:291)
	at org.eclipse.aether.internal.impl.DefaultRepositorySystem.collectDependencies(DefaultRepositorySystem.java:316)
	at org.apache.maven.project.DefaultProjectDependenciesResolver.resolve(DefaultProjectDependenciesResolver.java:172)
	... 35 more
Caused by: org.eclipse.aether.resolution.ArtifactDescriptorException: Failed to read artifact
descriptor for pentaho-kettle:kettle-engine:jar:4.4.0-stable
	at org.apache.maven.repository.internal.DefaultArtifactDescriptorReader.loadPom(DefaultArtifactDescriptorReader.java:302)
	at org.apache.maven.repository.internal.DefaultArtifactDescriptorReader.readArtifactDescriptor(DefaultArtifactDescriptorReader.java:218)
	at org.eclipse.aether.internal.impl.DefaultDependencyCollector.resolveCachedArtifactDescriptor(DefaultDependencyCollector.java:535)
	at org.eclipse.aether.internal.impl.DefaultDependencyCollector.getArtifactDescriptorResult(DefaultDependencyCollector.java:519)
	at org.eclipse.aether.internal.impl.DefaultDependencyCollector.processDependency(DefaultDependencyCollector.java:409)
	at org.eclipse.aether.internal.impl.DefaultDependencyCollector.processDependency(DefaultDependencyCollector.java:363)
	at org.eclipse.aether.internal.impl.DefaultDependencyCollector.process(DefaultDependencyCollector.java:351)
	at org.eclipse.aether.internal.impl.DefaultDependencyCollector.doRecurse(DefaultDependencyCollector.java:504)
	at org.eclipse.aether.internal.impl.DefaultDependencyCollector.processDependency(DefaultDependencyCollector.java:458)
	at org.eclipse.aether.internal.impl.DefaultDependencyCollector.processDependency(DefaultDependencyCollector.java:363)
	at org.eclipse.aether.internal.impl.DefaultDependencyCollector.process(DefaultDependencyCollector.java:351)
	at org.eclipse.aether.internal.impl.DefaultDependencyCollector.collectDependencies(DefaultDependencyCollector.java:254)
	... 37 more
Caused by: org.eclipse.aether.resolution.ArtifactResolutionException: Could not transfer artifact
pentaho-kettle:kettle-engine:pom:4.4.0-stable from/to pentaho-releases (http://repository.pentaho.org/artifactory/repo/):
Failed to transfer file: http://repository.pentaho.org/artifactory/repo/pentaho-kettle/kettle-engine/4.4.0-stable/kettle-engine-4.4.0-stable.pom.
Return code is: 503 , ReasonPhrase:Service Temporarily Unavailable.
	at org.eclipse.aether.internal.impl.DefaultArtifactResolver.resolve(DefaultArtifactResolver.java:444)
	at org.eclipse.aether.internal.impl.DefaultArtifactResolver.resolveArtifacts(DefaultArtifactResolver.java:246)

	at org.eclipse.aether.internal.impl.DefaultArtifactResolver.resolveArtifact(DefaultArtifactResolver.java:223)
	at org.apache.maven.repository.internal.DefaultArtifactDescriptorReader.loadPom(DefaultArtifactDescriptorReader.java:287)
	... 48 more
Caused by: org.eclipse.aether.transfer.ArtifactTransferException: Could not transfer artifact
pentaho-kettle:kettle-engine:pom:4.4.0-stable from/to pentaho-releases (http://repository.pentaho.org/artifactory/repo/):
Failed to transfer file: http://repository.pentaho.org/artifactory/repo/pentaho-kettle/kettle-engine/4.4.0-stable/kettle-engine-4.4.0-stable.pom.
Return code is: 503 , ReasonPhrase:Service Temporarily Unavailable.
	at org.eclipse.aether.connector.basic.ArtifactTransportListener.transferFailed(ArtifactTransportListener.java:43)
	at org.eclipse.aether.connector.basic.BasicRepositoryConnector$TaskRunner.run(BasicRepositoryConnector.java:355)
	at org.eclipse.aether.util.concurrency.RunnableErrorForwarder$1.run(RunnableErrorForwarder.java:67)
	at org.eclipse.aether.connector.basic.BasicRepositoryConnector$DirectExecutor.execute(BasicRepositoryConnector.java:581)
	at org.eclipse.aether.connector.basic.BasicRepositoryConnector.get(BasicRepositoryConnector.java:249)
	at org.eclipse.aether.internal.impl.DefaultArtifactResolver.performDownloads(DefaultArtifactResolver.java:520)
	at org.eclipse.aether.internal.impl.DefaultArtifactResolver.resolve(DefaultArtifactResolver.java:421)
	... 51 more
Caused by: org.apache.maven.wagon.TransferFailedException: Failed to transfer file: http://repository.pentaho.org/artifactory/repo/pentaho-kettle/kettle-engine/4.4.0-stable/kettle-engine-4.4.0-stable.pom.
Return code is: 503 , ReasonPhrase:Service Temporarily Unavailable.
	at org.apache.maven.wagon.providers.http.AbstractHttpClientWagon.fillInputData(AbstractHttpClientWagon.java:1021)
	at org.apache.maven.wagon.providers.http.AbstractHttpClientWagon.fillInputData(AbstractHttpClientWagon.java:960)
	at org.apache.maven.wagon.StreamWagon.getInputStream(StreamWagon.java:116)
	at org.apache.maven.wagon.StreamWagon.getIfNewer(StreamWagon.java:88)
	at org.apache.maven.wagon.StreamWagon.get(StreamWagon.java:61)
	at org.eclipse.aether.transport.wagon.WagonTransporter$GetTaskRunner.run(WagonTransporter.java:560)
	at org.eclipse.aether.transport.wagon.WagonTransporter.execute(WagonTransporter.java:427)
	at org.eclipse.aether.transport.wagon.WagonTransporter.get(WagonTransporter.java:404)
	at org.eclipse.aether.connector.basic.BasicRepositoryConnector$GetTaskRunner.runTask(BasicRepositoryConnector.java:447)
	at org.eclipse.aether.connector.basic.BasicRepositoryConnector$TaskRunner.run(BasicRepositoryConnector.java:350)
	... 56 more
[ERROR] 
[ERROR] Re-run Maven using the -X switch to enable full debug logging.
[ERROR] 
[ERROR] For more information about the errors and possible solutions, please read the following
articles:
[ERROR] [Help 1] http://cwiki.apache.org/confluence/display/MAVEN/DependencyResolutionException
Sending e-mails to: commits@carbondata.incubator.apache.org
p.AbstractHttpClientWagon.fillInputData(AbstractHttpClientWagon.java:960)
	at org.apache.maven.wagon.StreamWagon.getInputStream(StreamWagon.java:116)
	at org.apache.maven.wagon.StreamWagon.getIfNewer(StreamWagon.java:88)
	at org.apache.maven.wagon.StreamWagon.get(StreamWagon.java:61)
	at org.eclipse.aether.transport.wagon.WagonTransporter$GetTaskRunner.run(WagonTransporter.java:560)
	at org.eclipse.aether.transport.wagon.WagonTransporter.execute(WagonTransporter.java:427)
	at org.eclipse.aether.transport.wagon.WagonTransporter.get(WagonTransporter.java:404)
	at org.eclipse.aether.connector.basic.BasicRepositoryConnector$GetTaskRunner.runTask(BasicRepositoryConnector.java:447)
	at org.eclipse.aether.connector.basic.BasicRepositoryConnector$TaskRunner.run(BasicRepositoryConnector.java:350)
	... 56 more
[ERROR] 
[ERROR] Re-run Maven using the -X switch to enable full debug logging.
[ERROR] 
[ERROR] For more information about the errors and possible solutions, please read the following
articles:
[ERROR] [Help 1] http://cwiki.apache.org/confluence/display/MAVEN/DependencyResolutionException
[JENKINS] Archiving <https://builds.apache.org/job/CarbonData-master/org.apache.carbondata$carbondata-examples/ws/pom.xml>
to org.apache.carbondata/carbondata-examples/0.2.0-incubating-SNAPSHOT/carbondata-examples-0.2.0-incubating-SNAPSHOT.pom
Sending e-mails to: commits@carbondata.incubator.apache.org

Mime
View raw message