carbondata-commits mailing list archives

Site index · List index
Message view « Date » · « Thread »
Top « Date » · « Thread »
From Apache Jenkins Server <jenk...@builds.apache.org>
Subject Build failed in Jenkins: CarbonData-master #162
Date Mon, 07 Nov 2016 13:59:40 GMT
See <https://builds.apache.org/job/CarbonData-master/162/changes>

Changes:

[chenliang613] Fixed null and not null in sub queries

------------------------------------------
[...truncated 1833 lines...]
[INFO] Downloading: https://repo.maven.apache.org/maven2/com/fasterxml/jackson/core/jackson-databind/2.4.4/jackson-databind-2.4.4.pom
[INFO] Downloaded: https://repo.maven.apache.org/maven2/com/fasterxml/jackson/core/jackson-databind/2.4.4/jackson-databind-2.4.4.pom
(6 KB at 616.8 KB/sec)
[INFO] Downloading: http://repository.pentaho.org/artifactory/repo/com/fasterxml/jackson/core/jackson-core/2.4.4/jackson-core-2.4.4.pom
[INFO] Downloading: https://repo.maven.apache.org/maven2/com/fasterxml/jackson/core/jackson-core/2.4.4/jackson-core-2.4.4.pom
[INFO] Downloaded: https://repo.maven.apache.org/maven2/com/fasterxml/jackson/core/jackson-core/2.4.4/jackson-core-2.4.4.pom
(5 KB at 672.2 KB/sec)
[INFO] Downloading: http://repository.pentaho.org/artifactory/repo/com/fasterxml/jackson/module/jackson-module-scala_2.10/2.4.4/jackson-module-scala_2.10-2.4.4.pom
[INFO] Downloading: https://repo.maven.apache.org/maven2/com/fasterxml/jackson/module/jackson-module-scala_2.10/2.4.4/jackson-module-scala_2.10-2.4.4.pom
[INFO] Downloaded: https://repo.maven.apache.org/maven2/com/fasterxml/jackson/module/jackson-module-scala_2.10/2.4.4/jackson-module-scala_2.10-2.4.4.pom
(5 KB at 539.4 KB/sec)
[INFO] Downloading: http://repository.pentaho.org/artifactory/repo/com/fasterxml/jackson/core/jackson-annotations/2.4.4/jackson-annotations-2.4.4.pom
[INFO] Downloading: https://repo.maven.apache.org/maven2/com/fasterxml/jackson/core/jackson-annotations/2.4.4/jackson-annotations-2.4.4.pom
[INFO] Downloaded: https://repo.maven.apache.org/maven2/com/fasterxml/jackson/core/jackson-annotations/2.4.4/jackson-annotations-2.4.4.pom
(2 KB at 148.6 KB/sec)
[INFO] Downloading: http://repository.pentaho.org/artifactory/repo/org/apache/ivy/ivy/2.4.0/ivy-2.4.0.pom
[INFO] Downloading: https://repo.maven.apache.org/maven2/org/apache/ivy/ivy/2.4.0/ivy-2.4.0.pom
[INFO] Downloaded: https://repo.maven.apache.org/maven2/org/apache/ivy/ivy/2.4.0/ivy-2.4.0.pom
(7 KB at 1022.1 KB/sec)
[INFO] Downloading: http://repository.pentaho.org/artifactory/repo/org/tachyonproject/tachyon-client/0.7.1/tachyon-client-0.7.1.pom
[INFO] Downloading: https://repo.maven.apache.org/maven2/org/tachyonproject/tachyon-client/0.7.1/tachyon-client-0.7.1.pom
[INFO] Downloaded: https://repo.maven.apache.org/maven2/org/tachyonproject/tachyon-client/0.7.1/tachyon-client-0.7.1.pom
(8 KB at 901.7 KB/sec)
[INFO] Downloading: http://repository.pentaho.org/artifactory/repo/org/tachyonproject/tachyon-clients/0.7.1/tachyon-clients-0.7.1.pom
[INFO] Downloading: https://repo.maven.apache.org/maven2/org/tachyonproject/tachyon-clients/0.7.1/tachyon-clients-0.7.1.pom
[INFO] Downloaded: https://repo.maven.apache.org/maven2/org/tachyonproject/tachyon-clients/0.7.1/tachyon-clients-0.7.1.pom
(918 B at 128.1 KB/sec)
[INFO] Downloading: http://repository.pentaho.org/artifactory/repo/org/tachyonproject/tachyon-parent/0.7.1/tachyon-parent-0.7.1.pom
[INFO] Downloading: https://repo.maven.apache.org/maven2/org/tachyonproject/tachyon-parent/0.7.1/tachyon-parent-0.7.1.pom
[INFO] Downloaded: https://repo.maven.apache.org/maven2/org/tachyonproject/tachyon-parent/0.7.1/tachyon-parent-0.7.1.pom
(17 KB at 1845.2 KB/sec)
[INFO] Downloading: http://repository.pentaho.org/artifactory/repo/commons-io/commons-io/2.4/commons-io-2.4.pom
[INFO] Downloading: https://repo.maven.apache.org/maven2/commons-io/commons-io/2.4/commons-io-2.4.pom
[INFO] Downloaded: https://repo.maven.apache.org/maven2/commons-io/commons-io/2.4/commons-io-2.4.pom
(10 KB at 1241.0 KB/sec)
[INFO] Downloading: http://repository.pentaho.org/artifactory/repo/org/apache/commons/commons-parent/25/commons-parent-25.pom
[INFO] Downloading: https://repo.maven.apache.org/maven2/org/apache/commons/commons-parent/25/commons-parent-25.pom
[INFO] Downloaded: https://repo.maven.apache.org/maven2/org/apache/commons/commons-parent/25/commons-parent-25.pom
(48 KB at 4717.2 KB/sec)
[INFO] Downloading: http://repository.pentaho.org/artifactory/repo/org/apache/commons/commons-lang3/3.0/commons-lang3-3.0.pom
[INFO] Downloading: https://repo.maven.apache.org/maven2/org/apache/commons/commons-lang3/3.0/commons-lang3-3.0.pom
[INFO] Downloaded: https://repo.maven.apache.org/maven2/org/apache/commons/commons-lang3/3.0/commons-lang3-3.0.pom
(18 KB at 2155.6 KB/sec)
[INFO] Downloading: http://repository.pentaho.org/artifactory/repo/org/apache/commons/commons-parent/21/commons-parent-21.pom
[INFO] Downloading: https://repo.maven.apache.org/maven2/org/apache/commons/commons-parent/21/commons-parent-21.pom
[INFO] Downloaded: https://repo.maven.apache.org/maven2/org/apache/commons/commons-parent/21/commons-parent-21.pom
(34 KB at 3319.6 KB/sec)
[INFO] Downloading: http://repository.pentaho.org/artifactory/repo/org/apache/curator/curator-framework/2.1.0-incubating/curator-framework-2.1.0-incubating.pom
[INFO] Downloading: https://repo.maven.apache.org/maven2/org/apache/curator/curator-framework/2.1.0-incubating/curator-framework-2.1.0-incubating.pom
[INFO] Downloaded: https://repo.maven.apache.org/maven2/org/apache/curator/curator-framework/2.1.0-incubating/curator-framework-2.1.0-incubating.pom
(3 KB at 348.8 KB/sec)
[INFO] Downloading: http://repository.pentaho.org/artifactory/repo/org/apache/curator/apache-curator/2.1.0-incubating/apache-curator-2.1.0-incubating.pom
[INFO] Downloading: https://repo.maven.apache.org/maven2/org/apache/curator/apache-curator/2.1.0-incubating/apache-curator-2.1.0-incubating.pom
[INFO] Downloaded: https://repo.maven.apache.org/maven2/org/apache/curator/apache-curator/2.1.0-incubating/apache-curator-2.1.0-incubating.pom
(18 KB at 2230.2 KB/sec)
[INFO] Downloading: http://repository.pentaho.org/artifactory/repo/org/apache/curator/curator-client/2.1.0-incubating/curator-client-2.1.0-incubating.pom
[INFO] Downloading: https://repo.maven.apache.org/maven2/org/apache/curator/curator-client/2.1.0-incubating/curator-client-2.1.0-incubating.pom
[INFO] Downloaded: https://repo.maven.apache.org/maven2/org/apache/curator/curator-client/2.1.0-incubating/curator-client-2.1.0-incubating.pom
(2 KB at 332.2 KB/sec)
[INFO] Downloading: http://repository.pentaho.org/artifactory/repo/org/jboss/netty/netty/3.2.2.Final/netty-3.2.2.Final.pom
[INFO] Downloading: https://repo.maven.apache.org/maven2/org/jboss/netty/netty/3.2.2.Final/netty-3.2.2.Final.pom
[INFO] Downloaded: https://repo.maven.apache.org/maven2/org/jboss/netty/netty/3.2.2.Final/netty-3.2.2.Final.pom
(24 KB at 2328.7 KB/sec)
[INFO] Downloading: http://repository.pentaho.org/artifactory/repo/org/jboss/jboss-parent/5/jboss-parent-5.pom
[INFO] Downloading: https://repo.maven.apache.org/maven2/org/jboss/jboss-parent/5/jboss-parent-5.pom
[INFO] Downloaded: https://repo.maven.apache.org/maven2/org/jboss/jboss-parent/5/jboss-parent-5.pom
(19 KB at 2293.9 KB/sec)
[INFO] Downloading: http://repository.pentaho.org/artifactory/repo/org/slf4j/slf4j-api/1.7.2/slf4j-api-1.7.2.pom
[INFO] Downloading: https://repo.maven.apache.org/maven2/org/slf4j/slf4j-api/1.7.2/slf4j-api-1.7.2.pom
[INFO] Downloaded: https://repo.maven.apache.org/maven2/org/slf4j/slf4j-api/1.7.2/slf4j-api-1.7.2.pom
(3 KB at 328.2 KB/sec)
[INFO] Downloading: http://repository.pentaho.org/artifactory/repo/org/slf4j/slf4j-parent/1.7.2/slf4j-parent-1.7.2.pom
[INFO] Downloading: https://repo.maven.apache.org/maven2/org/slf4j/slf4j-parent/1.7.2/slf4j-parent-1.7.2.pom
[INFO] Downloaded: https://repo.maven.apache.org/maven2/org/slf4j/slf4j-parent/1.7.2/slf4j-parent-1.7.2.pom
(12 KB at 1646.8 KB/sec)
[INFO] Downloading: http://repository.pentaho.org/artifactory/repo/org/tachyonproject/tachyon-underfs-hdfs/0.7.1/tachyon-underfs-hdfs-0.7.1.pom
[INFO] Downloading: https://repo.maven.apache.org/maven2/org/tachyonproject/tachyon-underfs-hdfs/0.7.1/tachyon-underfs-hdfs-0.7.1.pom
[INFO] Downloaded: https://repo.maven.apache.org/maven2/org/tachyonproject/tachyon-underfs-hdfs/0.7.1/tachyon-underfs-hdfs-0.7.1.pom
(2 KB at 236.3 KB/sec)
[INFO] Downloading: http://repository.pentaho.org/artifactory/repo/org/tachyonproject/tachyon-underfs/0.7.1/tachyon-underfs-0.7.1.pom
[INFO] Downloading: https://repo.maven.apache.org/maven2/org/tachyonproject/tachyon-underfs/0.7.1/tachyon-underfs-0.7.1.pom
[INFO] Downloaded: https://repo.maven.apache.org/maven2/org/tachyonproject/tachyon-underfs/0.7.1/tachyon-underfs-0.7.1.pom
(2 KB at 145.6 KB/sec)
[INFO] Downloading: http://repository.pentaho.org/artifactory/repo/org/tachyonproject/tachyon-underfs-local/0.7.1/tachyon-underfs-local-0.7.1.pom
[INFO] Downloading: https://repo.maven.apache.org/maven2/org/tachyonproject/tachyon-underfs-local/0.7.1/tachyon-underfs-local-0.7.1.pom
[INFO] Downloaded: https://repo.maven.apache.org/maven2/org/tachyonproject/tachyon-underfs-local/0.7.1/tachyon-underfs-local-0.7.1.pom
(2 KB at 247.9 KB/sec)
[INFO] Downloading: http://repository.pentaho.org/artifactory/repo/net/razorvine/pyrolite/4.4/pyrolite-4.4.pom
[INFO] Downloading: https://repo.maven.apache.org/maven2/net/razorvine/pyrolite/4.4/pyrolite-4.4.pom
[INFO] Downloaded: https://repo.maven.apache.org/maven2/net/razorvine/pyrolite/4.4/pyrolite-4.4.pom
(4 KB at 479.5 KB/sec)
[INFO] Downloading: http://repository.pentaho.org/artifactory/repo/net/sf/py4j/py4j/0.8.2.1/py4j-0.8.2.1.pom
[INFO] Downloading: https://repo.maven.apache.org/maven2/net/sf/py4j/py4j/0.8.2.1/py4j-0.8.2.1.pom
[INFO] Downloaded: https://repo.maven.apache.org/maven2/net/sf/py4j/py4j/0.8.2.1/py4j-0.8.2.1.pom
(2 KB at 236.5 KB/sec)
[INFO] Downloading: http://repository.pentaho.org/artifactory/repo/org/apache/spark/spark-catalyst_2.10/1.5.2/spark-catalyst_2.10-1.5.2.pom
[INFO] Downloading: https://repo.maven.apache.org/maven2/org/apache/spark/spark-catalyst_2.10/1.5.2/spark-catalyst_2.10-1.5.2.pom
[INFO] Downloaded: https://repo.maven.apache.org/maven2/org/apache/spark/spark-catalyst_2.10/1.5.2/spark-catalyst_2.10-1.5.2.pom
(6 KB at 626.6 KB/sec)
[INFO] Downloading: http://repository.pentaho.org/artifactory/repo/org/codehaus/janino/janino/2.7.8/janino-2.7.8.pom
[INFO] Downloading: https://repo.maven.apache.org/maven2/org/codehaus/janino/janino/2.7.8/janino-2.7.8.pom
[INFO] Downloaded: https://repo.maven.apache.org/maven2/org/codehaus/janino/janino/2.7.8/janino-2.7.8.pom
(925 B at 129.0 KB/sec)
[INFO] Downloading: http://repository.pentaho.org/artifactory/repo/org/codehaus/janino/janino-parent/2.7.8/janino-parent-2.7.8.pom
[INFO] Downloading: https://repo.maven.apache.org/maven2/org/codehaus/janino/janino-parent/2.7.8/janino-parent-2.7.8.pom
[INFO] Downloaded: https://repo.maven.apache.org/maven2/org/codehaus/janino/janino-parent/2.7.8/janino-parent-2.7.8.pom
(9 KB at 1164.3 KB/sec)
[INFO] Downloading: http://repository.pentaho.org/artifactory/repo/org/codehaus/janino/commons-compiler/2.7.8/commons-compiler-2.7.8.pom
[INFO] Downloading: https://repo.maven.apache.org/maven2/org/codehaus/janino/commons-compiler/2.7.8/commons-compiler-2.7.8.pom
[INFO] Downloaded: https://repo.maven.apache.org/maven2/org/codehaus/janino/commons-compiler/2.7.8/commons-compiler-2.7.8.pom
(666 B at 81.3 KB/sec)
[INFO] Downloading: http://repository.pentaho.org/artifactory/repo/org/apache/parquet/parquet-column/1.7.0/parquet-column-1.7.0.pom
[INFO] Downloading: https://repo.maven.apache.org/maven2/org/apache/parquet/parquet-column/1.7.0/parquet-column-1.7.0.pom
[INFO] Downloaded: https://repo.maven.apache.org/maven2/org/apache/parquet/parquet-column/1.7.0/parquet-column-1.7.0.pom
(5 KB at 303.6 KB/sec)
[INFO] Downloading: http://repository.pentaho.org/artifactory/repo/org/apache/parquet/parquet/1.7.0/parquet-1.7.0.pom
[INFO] Downloading: https://repo.maven.apache.org/maven2/org/apache/parquet/parquet/1.7.0/parquet-1.7.0.pom
[INFO] Downloaded: https://repo.maven.apache.org/maven2/org/apache/parquet/parquet/1.7.0/parquet-1.7.0.pom
(16 KB at 2272.3 KB/sec)
[INFO] Downloading: http://repository.pentaho.org/artifactory/repo/org/apache/parquet/parquet-common/1.7.0/parquet-common-1.7.0.pom
[INFO] Downloading: https://repo.maven.apache.org/maven2/org/apache/parquet/parquet-common/1.7.0/parquet-common-1.7.0.pom
[INFO] Downloaded: https://repo.maven.apache.org/maven2/org/apache/parquet/parquet-common/1.7.0/parquet-common-1.7.0.pom
(2 KB at 243.4 KB/sec)
[INFO] Downloading: http://repository.pentaho.org/artifactory/repo/org/apache/parquet/parquet-encoding/1.7.0/parquet-encoding-1.7.0.pom
[INFO] Downloading: https://repo.maven.apache.org/maven2/org/apache/parquet/parquet-encoding/1.7.0/parquet-encoding-1.7.0.pom
[INFO] Downloaded: https://repo.maven.apache.org/maven2/org/apache/parquet/parquet-encoding/1.7.0/parquet-encoding-1.7.0.pom
(3 KB at 408.8 KB/sec)
[INFO] Downloading: http://repository.pentaho.org/artifactory/repo/org/apache/parquet/parquet-generator/1.7.0/parquet-generator-1.7.0.pom
[INFO] Downloading: https://repo.maven.apache.org/maven2/org/apache/parquet/parquet-generator/1.7.0/parquet-generator-1.7.0.pom
[INFO] Downloaded: https://repo.maven.apache.org/maven2/org/apache/parquet/parquet-generator/1.7.0/parquet-generator-1.7.0.pom
(2 KB at 193.9 KB/sec)
[INFO] Downloading: http://repository.pentaho.org/artifactory/repo/commons-codec/commons-codec/1.5/commons-codec-1.5.pom
[INFO] Downloading: https://repo.maven.apache.org/maven2/commons-codec/commons-codec/1.5/commons-codec-1.5.pom
[INFO] Downloaded: https://repo.maven.apache.org/maven2/commons-codec/commons-codec/1.5/commons-codec-1.5.pom
(10 KB at 1246.7 KB/sec)
[INFO] Downloading: http://repository.pentaho.org/artifactory/repo/org/apache/commons/commons-parent/20/commons-parent-20.pom
[INFO] Downloading: https://repo.maven.apache.org/maven2/org/apache/commons/commons-parent/20/commons-parent-20.pom
[INFO] Downloaded: https://repo.maven.apache.org/maven2/org/apache/commons/commons-parent/20/commons-parent-20.pom
(33 KB at 3261.5 KB/sec)
[INFO] Downloading: http://repository.pentaho.org/artifactory/repo/org/apache/parquet/parquet-hadoop/1.7.0/parquet-hadoop-1.7.0.pom
[INFO] Downloading: https://repo.maven.apache.org/maven2/org/apache/parquet/parquet-hadoop/1.7.0/parquet-hadoop-1.7.0.pom
[INFO] Downloaded: https://repo.maven.apache.org/maven2/org/apache/parquet/parquet-hadoop/1.7.0/parquet-hadoop-1.7.0.pom
(4 KB at 430.3 KB/sec)
[INFO] Downloading: http://repository.pentaho.org/artifactory/repo/org/apache/parquet/parquet-format/2.3.0-incubating/parquet-format-2.3.0-incubating.pom
[INFO] Downloading: https://repo.maven.apache.org/maven2/org/apache/parquet/parquet-format/2.3.0-incubating/parquet-format-2.3.0-incubating.pom
[INFO] Downloaded: https://repo.maven.apache.org/maven2/org/apache/parquet/parquet-format/2.3.0-incubating/parquet-format-2.3.0-incubating.pom
(7 KB at 759.7 KB/sec)
[INFO] Downloading: http://repository.pentaho.org/artifactory/repo/org/apache/parquet/parquet-jackson/1.7.0/parquet-jackson-1.7.0.pom
[INFO] Downloading: https://repo.maven.apache.org/maven2/org/apache/parquet/parquet-jackson/1.7.0/parquet-jackson-1.7.0.pom
[INFO] Downloaded: https://repo.maven.apache.org/maven2/org/apache/parquet/parquet-jackson/1.7.0/parquet-jackson-1.7.0.pom
(4 KB at 493.0 KB/sec)
[INFO] Downloading: http://repository.pentaho.org/artifactory/repo/org/codehaus/jackson/jackson-mapper-asl/1.9.11/jackson-mapper-asl-1.9.11.pom
[INFO] Downloading: https://repo.maven.apache.org/maven2/org/codehaus/jackson/jackson-mapper-asl/1.9.11/jackson-mapper-asl-1.9.11.pom
[INFO] Downloaded: https://repo.maven.apache.org/maven2/org/codehaus/jackson/jackson-mapper-asl/1.9.11/jackson-mapper-asl-1.9.11.pom
(2 KB at 202.5 KB/sec)
[INFO] Downloading: http://repository.pentaho.org/artifactory/repo/org/codehaus/jackson/jackson-core-asl/1.9.11/jackson-core-asl-1.9.11.pom
[INFO] Downloading: https://repo.maven.apache.org/maven2/org/codehaus/jackson/jackson-core-asl/1.9.11/jackson-core-asl-1.9.11.pom
[INFO] Downloaded: https://repo.maven.apache.org/maven2/org/codehaus/jackson/jackson-core-asl/1.9.11/jackson-core-asl-1.9.11.pom
(1017 B at 165.5 KB/sec)
[INFO] Downloading: http://repository.pentaho.org/artifactory/repo/org/xerial/snappy/snappy-java/1.1.1.6/snappy-java-1.1.1.6.pom
[INFO] Downloading: https://repo.maven.apache.org/maven2/org/xerial/snappy/snappy-java/1.1.1.6/snappy-java-1.1.1.6.pom
[INFO] Downloaded: https://repo.maven.apache.org/maven2/org/xerial/snappy/snappy-java/1.1.1.6/snappy-java-1.1.1.6.pom
(4 KB at 401.5 KB/sec)
[INFO] Downloading: http://repository.pentaho.org/artifactory/repo/org/apache/zookeeper/zookeeper/3.4.7/zookeeper-3.4.7.pom
[INFO] Downloading: https://repo.maven.apache.org/maven2/org/apache/zookeeper/zookeeper/3.4.7/zookeeper-3.4.7.pom
[INFO] Downloaded: https://repo.maven.apache.org/maven2/org/apache/zookeeper/zookeeper/3.4.7/zookeeper-3.4.7.pom
(4 KB at 624.2 KB/sec)
[INFO] Downloading: http://repository.pentaho.org/artifactory/repo/io/netty/netty/3.7.0.Final/netty-3.7.0.Final.pom
[INFO] Downloading: https://repo.maven.apache.org/maven2/io/netty/netty/3.7.0.Final/netty-3.7.0.Final.pom
[INFO] Downloaded: https://repo.maven.apache.org/maven2/io/netty/netty/3.7.0.Final/netty-3.7.0.Final.pom
(26 KB at 3198.7 KB/sec)
[INFO] ------------------------------------------------------------------------
[INFO] Reactor Summary:
[INFO] 
[INFO] Apache CarbonData :: Parent ........................ SUCCESS [  7.981 s]
[INFO] Apache CarbonData :: Common ........................ SUCCESS [  6.433 s]
[INFO] Apache CarbonData :: Core .......................... FAILURE [12:55 min]
[INFO] Apache CarbonData :: Processing .................... SKIPPED
[INFO] Apache CarbonData :: Hadoop ........................ SKIPPED
[INFO] Apache CarbonData :: Spark ......................... SKIPPED
[INFO] Apache CarbonData :: Assembly ...................... SKIPPED
[INFO] Apache CarbonData :: Examples ...................... SKIPPED
[INFO] ------------------------------------------------------------------------
[INFO] BUILD FAILURE
[INFO] ------------------------------------------------------------------------
[INFO] Total time: 13:17 min
[INFO] Finished at: 2016-11-07T13:59:33+00:00
[INFO] Final Memory: 37M/512M
[INFO] ------------------------------------------------------------------------
Waiting for Jenkins to finish collecting data
[ERROR] Failed to execute goal on project carbondata-core: Could not resolve dependencies
for project org.apache.carbondata:carbondata-core:jar:0.2.0-incubating-SNAPSHOT: Failed to
collect dependencies at pentaho-kettle:kettle-engine:jar:4.4.0-stable: Failed to read artifact
descriptor for pentaho-kettle:kettle-engine:jar:4.4.0-stable: Could not transfer artifact
pentaho-kettle:kettle-engine:pom:4.4.0-stable from/to pentaho-releases (http://repository.pentaho.org/artifactory/repo/):
Failed to transfer file: http://repository.pentaho.org/artifactory/repo/pentaho-kettle/kettle-engine/4.4.0-stable/kettle-engine-4.4.0-stable.pom.
Return code is: 503 , ReasonPhrase:Service Temporarily Unavailable. -> [Help 1]
org.apache.maven.lifecycle.LifecycleExecutionException: Failed to execute goal on project
carbondata-core: Could not resolve dependencies for project org.apache.carbondata:carbondata-core:jar:0.2.0-incubating-SNAPSHOT:
Failed to collect dependencies at pentaho-kettle:kettle-engine:jar:4.4.0-stable
	at org.apache.maven.lifecycle.internal.LifecycleDependencyResolver.getDependencies(LifecycleDependencyResolver.java:221)
	at org.apache.maven.lifecycle.internal.LifecycleDependencyResolver.resolveProjectDependencies(LifecycleDependencyResolver.java:127)
	at org.apache.maven.lifecycle.internal.MojoExecutor.ensureDependenciesAreResolved(MojoExecutor.java:257)
	at org.apache.maven.lifecycle.internal.MojoExecutor.execute(MojoExecutor.java:200)
	at org.apache.maven.lifecycle.internal.MojoExecutor.execute(MojoExecutor.java:153)
	at org.apache.maven.lifecycle.internal.MojoExecutor.execute(MojoExecutor.java:145)
	at org.apache.maven.lifecycle.internal.LifecycleModuleBuilder.buildProject(LifecycleModuleBuilder.java:116)
	at org.apache.maven.lifecycle.internal.LifecycleModuleBuilder.buildProject(LifecycleModuleBuilder.java:80)
	at org.apache.maven.lifecycle.internal.builder.singlethreaded.SingleThreadedBuilder.build(SingleThreadedBuilder.java:51)
	at org.apache.maven.lifecycle.internal.LifecycleStarter.execute(LifecycleStarter.java:128)
	at org.apache.maven.DefaultMaven.doExecute(DefaultMaven.java:307)
	at org.apache.maven.DefaultMaven.doExecute(DefaultMaven.java:193)
	at org.apache.maven.DefaultMaven.execute(DefaultMaven.java:106)
	at org.jvnet.hudson.maven3.launcher.Maven32Launcher.main(Maven32Launcher.java:132)
	at sun.reflect.NativeMethodAccessorImpl.invoke0(Native Method)
	at sun.reflect.NativeMethodAccessorImpl.invoke(NativeMethodAccessorImpl.java:62)
	at sun.reflect.DelegatingMethodAccessorImpl.invoke(DelegatingMethodAccessorImpl.java:43)
	at java.lang.reflect.Method.invoke(Method.java:498)
	at org.codehaus.plexus.classworlds.launcher.Launcher.launchStandard(Launcher.java:330)
	at org.codehaus.plexus.classworlds.launcher.Launcher.launch(Launcher.java:238)
	at jenkins.maven3.agent.Maven32Main.launch(Maven32Main.java:186)
	at sun.reflect.NativeMethodAccessorImpl.invoke0(Native Method)
	at sun.reflect.NativeMethodAccessorImpl.invoke(NativeMethodAccessorImpl.java:62)
	at sun.reflect.DelegatingMethodAccessorImpl.invoke(DelegatingMethodAccessorImpl.java:43)
	at java.lang.reflect.Method.invoke(Method.java:498)
	at hudson.maven.Maven3Builder.call(Maven3Builder.java:136)
	at hudson.maven.Maven3Builder.call(Maven3Builder.java:71)
	at hudson.remoting.UserRequest.perform(UserRequest.java:153)
	at hudson.remoting.UserRequest.perform(UserRequest.java:50)
	at hudson.remoting.Request$2.run(Request.java:332)
	at hudson.remoting.InterceptingExecutorService$1.call(InterceptingExecutorService.java:68)
	at java.util.concurrent.FutureTask.run(FutureTask.java:266)
	at java.util.concurrent.ThreadPoolExecutor.runWorker(ThreadPoolExecutor.java:1142)
	at java.util.concurrent.ThreadPoolExecutor$Worker.run(ThreadPoolExecutor.java:617)
	at java.lang.Thread.run(Thread.java:745)
Caused by: org.apache.maven.project.DependencyResolutionException: Could not resolve dependencies
for project org.apache.carbondata:carbondata-core:jar:0.2.0-incubating-SNAPSHOT: Failed to
collect dependencies at pentaho-kettle:kettle-engine:jar:4.4.0-stable
	at org.apache.maven.project.DefaultProjectDependenciesResolver.resolve(DefaultProjectDependenciesResolver.java:180)
	at org.apache.maven.lifecycle.internal.LifecycleDependencyResolver.getDependencies(LifecycleDependencyResolver.java:195)
	... 34 more
Caused by: org.eclipse.aether.collection.DependencyCollectionException: Failed to collect
dependencies at pentaho-kettle:kettle-engine:jar:4.4.0-stable
	at org.eclipse.aether.internal.impl.DefaultDependencyCollector.collectDependencies(DefaultDependencyCollector.java:291)
	at org.eclipse.aether.internal.impl.DefaultRepositorySystem.collectDependencies(DefaultRepositorySystem.java:316)
	at org.apache.maven.project.DefaultProjectDependenciesResolver.resolve(DefaultProjectDependenciesResolver.java:172)
	... 35 more
Caused by: org.eclipse.aether.resolution.ArtifactDescriptorException: Failed to read artifact
descriptor for pentaho-kettle:kettle-engine:jar:4.4.0-stable
	at org.apache.maven.repository.internal.DefaultArtifactDescriptorReader.loadPom(DefaultArtifactDescriptorReader.java:302)
	at org.apache.maven.repository.internal.DefaultArtifactDescriptorReader.readArtifactDescriptor(DefaultArtifactDescriptorReader.java:218)
	at org.eclipse.aether.internal.impl.DefaultDependencyCollector.resolveCachedArtifactDescriptor(DefaultDependencyCollector.java:535)
	at org.eclipse.aether.internal.impl.DefaultDependencyCollector.getArtifactDescriptorResult(DefaultDependencyCollector.java:519)
	at org.eclipse.aether.internal.impl.DefaultDependencyCollector.processDependency(DefaultDependencyCollector.java:409)
	at org.eclipse.aether.internal.impl.DefaultDependencyCollector.processDependency(DefaultDependencyCollector.java:363)
	at org.eclipse.aether.internal.impl.DefaultDependencyCollector.process(DefaultDependencyCollector.java:351)
	at org.eclipse.aether.internal.impl.DefaultDependencyCollector.collectDependencies(DefaultDependencyCollector.java:254)
	... 37 more
Caused by: org.eclipse.aether.resolution.ArtifactResolutionException: Could not transfer artifact
pentaho-kettle:kettle-engine:pom:4.4.0-stable from/to pentaho-releases (http://repository.pentaho.org/artifactory/repo/):
Failed to transfer file: http://repository.pentaho.org/artifactory/repo/pentaho-kettle/kettle-engine/4.4.0-stable/kettle-engine-4.4.0-stable.pom.
Return code is: 503 , ReasonPhrase:Service Temporarily Unavailable.
	at org.eclipse.aether.internal.impl.DefaultArtifactResolver.resolve(DefaultArtifactResolver.java:444)
	at org.eclipse.aether.internal.impl.DefaultArtifactResolver.resolveArtifacts(DefaultArtifactResolver.java:246)
	at org.eclipse.aether.internal.impl.DefaultArtifactResolver.resolveArtifact(DefaultArtifactResolver.java:223)
	at org.apache.maven.repository.internal.DefaultArtifactDescriptorReader.loadPom(DefaultArtifactDescriptorReader.java:287)
	... 44 more
Caused by: org.eclipse.aether.transfer.ArtifactTransferException: Could not transfer artifact
pentaho-kettle:kettle-engine:pom:4.4.0-stable from/to pentaho-releases (http://repository.pentaho.org/artifactory/repo/):
Failed to transfer file: http://repository.pentaho.org/artifactory/repo/pentaho-kettle/kettle-engine/4.4.0-stable/kettle-engine-4.4.0-stable.pom.
Return code is: 503 , ReasonPhrase:Service Temporarily Unavailable.
	at org.eclipse.aether.connector.basic.ArtifactTransportListener.transferFailed(ArtifactTransportListener.java:43)
	at org.eclipse.aether.connector.basic.BasicRepositoryConnector$TaskRunner.run(BasicRepositoryConnector.java:355)
	at org.eclipse.aether.util.concurrency.RunnableErrorForwarder$1.run(RunnableErrorForwarder.java:67)
	at org.eclipse.aether.connector.basic.BasicRepositoryConnector$DirectExecutor.execute(BasicRepositoryConnector.java:581)
	at org.eclipse.aether.connector.basic.BasicRepositoryConnector.get(BasicRepositoryConnector.java:249)
	at org.eclipse.aether.internal.impl.DefaultArtifactResolver.performDownloads(DefaultArtifactResolver.java:520)
	at org.eclipse.aether.internal.impl.DefaultArtifactResolver.resolve(DefaultArtifactResolver.java:421)
	... 47 more
Caused by: org.apache.maven.wagon.TransferFailedException: Failed to transfer file: http://repository.pentaho.org/artifactory/repo/pentaho-kettle/kettle-engine/4.4.0-stable/kettle-engine-4.4.0-stable.pom.
Return code is: 503 , ReasonPhrase:Service Temporarily Unavailable.
	at org.apache.maven.wagon.providers.http.AbstractHttpClientWagon.fillInputData(AbstractHttpClientWagon.java:1021)
	at org.apache.maven.wagon.providers.http.AbstractHttpClientWagon.fillInputData(AbstractHttpClientWagon.java:960)
	at org.apache.maven.wagon.StreamWagon.getInputStream(StreamWagon.java:116)
	at org.apache.maven.wagon.StreamWagon.getIfNewer(StreamWagon.java:88)
	at org.apache.maven.wagon.StreamWagon.get(StreamWagon.java:61)
	at org.eclipse.aether.transport.wagon.WagonTransporter$GetTaskRunner.run(WagonTransporter.java:560)
	at org.eclipse.aether.transport.wagon.WagonTransporter.execute(WagonTransporter.java:427)
	at org.eclipse.aether.transport.wagon.WagonTransporter.get(WagonTransporter.java:404)
	at org.eclipse.aether.connector.basic.BasicRepositoryConnector$GetTaskRunner.runTask(BasicRepositoryConnector.java:447)
	at org.eclipse.aether.connector.basic.BasicRepositoryConnector$TaskRunner.run(BasicRepositoryConnector.java:350)
	... 52 more
[ERROR] 
[ERROR] Re-run Maven using the -X switch to enable full debug logging.
[ERROR] 
[ERROR] For more information about the errors and possible solutions, please read the following
articles:
[ERROR] [Help 1] http://cwiki.apache.org/confluence/display/MAVEN/DependencyResolutionException
[ERROR] 
[ERROR] After correcting the problems, you can resume the build with the command
[ERROR]   mvn <goals> -rf :carbondata-core
[JENKINS] Archiving <https://builds.apache.org/job/CarbonData-master/ws/processing/pom.xml>
to org.apache.carbondata/carbondata-processing/0.2.0-incubating-SNAPSHOT/carbondata-processing-0.2.0-incubating-SNAPSHOT.pom
[JENKINS] Archiving <https://builds.apache.org/job/CarbonData-master/ws/assembly/pom.xml>
to org.apache.carbondata/carbondata-assembly/0.2.0-incubating-SNAPSHOT/carbondata-assembly-0.2.0-incubating-SNAPSHOT.pom
[JENKINS] Archiving <https://builds.apache.org/job/CarbonData-master/ws/pom.xml> to
org.apache.carbondata/carbondata-parent/0.2.0-incubating-SNAPSHOT/carbondata-parent-0.2.0-incubating-SNAPSHOT.pom
[JENKINS] Archiving <https://builds.apache.org/job/CarbonData-master/ws/core/pom.xml>
to org.apache.carbondata/carbondata-core/0.2.0-incubating-SNAPSHOT/carbondata-core-0.2.0-incubating-SNAPSHOT.pom
[JENKINS] Archiving <https://builds.apache.org/job/CarbonData-master/ws/hadoop/pom.xml>
to org.apache.carbondata/carbondata-hadoop/0.2.0-incubating-SNAPSHOT/carbondata-hadoop-0.2.0-incubating-SNAPSHOT.pom
[JENKINS] Archiving <https://builds.apache.org/job/CarbonData-master/ws/examples/pom.xml>
to org.apache.carbondata/carbondata-examples/0.2.0-incubating-SNAPSHOT/carbondata-examples-0.2.0-incubating-SNAPSHOT.pom
[JENKINS] Archiving <https://builds.apache.org/job/CarbonData-master/ws/common/pom.xml>
to org.apache.carbondata/carbondata-common/0.2.0-incubating-SNAPSHOT/carbondata-common-0.2.0-incubating-SNAPSHOT.pom
[JENKINS] Archiving <https://builds.apache.org/job/CarbonData-master/ws/common/target/carbondata-common-0.2.0-incubating-SNAPSHOT.jar>
to org.apache.carbondata/carbondata-common/0.2.0-incubating-SNAPSHOT/carbondata-common-0.2.0-incubating-SNAPSHOT.jar
[JENKINS] Archiving <https://builds.apache.org/job/CarbonData-master/ws/integration/spark/pom.xml>
to org.apache.carbondata/carbondata-spark/0.2.0-incubating-SNAPSHOT/carbondata-spark-0.2.0-incubating-SNAPSHOT.pom
Sending e-mails to: commits@carbondata.incubator.apache.org
channel stopped

Mime
View raw message