carbondata-commits mailing list archives

Site index · List index
Message view « Date » · « Thread »
Top « Date » · « Thread »
From Apache Jenkins Server <jenk...@builds.apache.org>
Subject Build failed in Jenkins: CarbonData-master #7
Date Mon, 18 Jul 2016 15:31:35 GMT
See <https://builds.apache.org/job/CarbonData-master/7/changes>

Changes:

[chenliang613] Added Spark 1.6.2 support in Carbon

------------------------------------------
Started by an SCM change
[EnvInject] - Loading node environment variables.
Building remotely on ubuntu-6 (docker Ubuntu ubuntu yahoo-not-h2) in workspace <https://builds.apache.org/job/CarbonData-master/ws/>
Cloning the remote Git repository
Cloning repository https://git-wip-us.apache.org/repos/asf/incubator-carbondata.git
 > git init <https://builds.apache.org/job/CarbonData-master/ws/> # timeout=10
Fetching upstream changes from https://git-wip-us.apache.org/repos/asf/incubator-carbondata.git
 > git --version # timeout=10
 > git -c core.askpass=true fetch --tags --progress https://git-wip-us.apache.org/repos/asf/incubator-carbondata.git
+refs/heads/*:refs/remotes/origin/*
 > git config remote.origin.url https://git-wip-us.apache.org/repos/asf/incubator-carbondata.git
# timeout=10
 > git config --add remote.origin.fetch +refs/heads/*:refs/remotes/origin/* # timeout=10
 > git config remote.origin.url https://git-wip-us.apache.org/repos/asf/incubator-carbondata.git
# timeout=10
Fetching upstream changes from https://git-wip-us.apache.org/repos/asf/incubator-carbondata.git
 > git -c core.askpass=true fetch --tags --progress https://git-wip-us.apache.org/repos/asf/incubator-carbondata.git
+refs/heads/*:refs/remotes/origin/*
 > git rev-parse refs/remotes/origin/master^{commit} # timeout=10
 > git rev-parse refs/remotes/origin/origin/master^{commit} # timeout=10
Checking out Revision 6948cb05ddc2736ea3d82ecdd3647f6c40896b02 (refs/remotes/origin/master)
 > git config core.sparsecheckout # timeout=10
 > git checkout -f 6948cb05ddc2736ea3d82ecdd3647f6c40896b02
 > git rev-list 66f1e195273343406291ab6f0eabccaecb5dc587 # timeout=10
Parsing POMs
Established TCP socket on 39060
maven32-agent.jar already up to date
maven32-interceptor.jar already up to date
maven3-interceptor-commons.jar already up to date
[CarbonData-master] $ /home/jenkins/jenkins-slave/tools/hudson.model.JDK/jdk1.8.0_66/bin/java
-Xmx2g -Xms256m -XX:MaxPermSize=512m -cp /home/jenkins/jenkins-slave/maven32-agent.jar:/home/jenkins/jenkins-slave/tools/hudson.tasks.Maven_MavenInstallation/maven-3.3.3/boot/plexus-classworlds-2.5.2.jar:/home/jenkins/jenkins-slave/tools/hudson.tasks.Maven_MavenInstallation/maven-3.3.3/conf/logging
jenkins.maven3.agent.Maven32Main /home/jenkins/jenkins-slave/tools/hudson.tasks.Maven_MavenInstallation/maven-3.3.3
/home/jenkins/jenkins-slave/slave.jar /home/jenkins/jenkins-slave/maven32-interceptor.jar
/home/jenkins/jenkins-slave/maven3-interceptor-commons.jar 39060
Java HotSpot(TM) 64-Bit Server VM warning: ignoring option MaxPermSize=512m; support was removed
in 8.0
<===[JENKINS REMOTING CAPACITY]===>   channel started
Executing Maven:  -B -f <https://builds.apache.org/job/CarbonData-master/ws/pom.xml>
-Dmaven.repo.local=/home/jenkins/jenkins-slave/maven-repositories/0 -B -e clean package[INFO]
Error stacktraces are turned on.

[INFO] Scanning for projects...
[WARNING] 
[WARNING] Some problems were encountered while building the effective model for org.carbondata:carbon-common:jar:0.1.0-SNAPSHOT
[WARNING] 'build.plugins.plugin.version' for org.apache.maven.plugins:maven-compiler-plugin
is missing. @ line 69, column 15
[WARNING] 
[WARNING] Some problems were encountered while building the effective model for org.carbondata:carbon-core:jar:0.1.0-SNAPSHOT
[WARNING] 'build.plugins.plugin.version' for org.apache.maven.plugins:maven-compiler-plugin
is missing. @ line 163, column 15
[WARNING] 
[WARNING] Some problems were encountered while building the effective model for org.carbondata:carbon-processing:jar:0.1.0-SNAPSHOT
[WARNING] 'build.plugins.plugin.version' for org.apache.maven.plugins:maven-compiler-plugin
is missing. @ line 151, column 15
[WARNING] 
[WARNING] Some problems were encountered while building the effective model for org.carbondata:carbon-hadoop:jar:0.1.0-SNAPSHOT
[WARNING] 'build.plugins.plugin.version' for org.apache.maven.plugins:maven-compiler-plugin
is missing. @ line 108, column 15
[WARNING] 
[WARNING] Some problems were encountered while building the effective model for org.carbondata:carbon-spark:jar:0.1.0-SNAPSHOT
[WARNING] 'build.plugins.plugin.version' for org.apache.maven.plugins:maven-compiler-plugin
is missing. @ line 178, column 15
[WARNING] 
[WARNING] Some problems were encountered while building the effective model for com.huawei.datasight:carbon-assembly:pom:0.1.0-SNAPSHOT
[WARNING] 'build.plugins.plugin.version' for org.apache.maven.plugins:maven-shade-plugin is
missing. @ line 76, column 15
[WARNING] 'build.plugins.plugin.version' for org.apache.maven.plugins:maven-install-plugin
is missing. @ line 69, column 15
[WARNING] 'build.plugins.plugin.version' for org.apache.maven.plugins:maven-deploy-plugin
is missing. @ line 62, column 15
[WARNING] 
[WARNING] Some problems were encountered while building the effective model for org.carbondata:carbon-examples:jar:0.1.0-SNAPSHOT
[WARNING] 'build.plugins.plugin.version' for org.apache.maven.plugins:maven-compiler-plugin
is missing. @ line 151, column 15
[WARNING] 
[WARNING] It is highly recommended to fix these problems because they threaten the stability
of your build.
[WARNING] 
[WARNING] For this reason, future Maven versions might no longer support building such malformed
projects.
[WARNING] 
[INFO] ------------------------------------------------------------------------
[INFO] Reactor Build Order:
[INFO] 
[INFO] carbondata
[INFO] carbon-common
[INFO] carbon-format
[INFO] carbon-core
[INFO] carbon-processing
[INFO] carbon-hadoop
[INFO] carbon-spark
[INFO] carbon-assembly
[INFO] carbon-examples
[INFO]                                                                         
[INFO] ------------------------------------------------------------------------
[INFO] Building carbondata 0.1.0-SNAPSHOT
[INFO] ------------------------------------------------------------------------
[INFO] Downloading: https://repo.maven.apache.org/maven2/org/scalastyle/scalastyle-maven-plugin/0.8.0/scalastyle-maven-plugin-0.8.0.pom
[INFO] Downloaded: https://repo.maven.apache.org/maven2/org/scalastyle/scalastyle-maven-plugin/0.8.0/scalastyle-maven-plugin-0.8.0.pom
(9 KB at 5.8 KB/sec)
[INFO] Downloading: https://repo.maven.apache.org/maven2/org/scalastyle/scalastyle-maven-plugin/0.8.0/scalastyle-maven-plugin-0.8.0.jar
[INFO] Downloaded: https://repo.maven.apache.org/maven2/org/scalastyle/scalastyle-maven-plugin/0.8.0/scalastyle-maven-plugin-0.8.0.jar
(19 KB at 160.9 KB/sec)
[INFO] 
[INFO] --- maven-clean-plugin:2.5:clean (default-clean) @ carbondata-parent ---
[INFO]                                                                         
[INFO] ------------------------------------------------------------------------
[INFO] Building carbon-common 0.1.0-SNAPSHOT
[INFO] ------------------------------------------------------------------------
[INFO] Downloading: https://repo.maven.apache.org/maven2/org/jmockit/jmockit/1.10/jmockit-1.10.pom
[INFO] Downloaded: https://repo.maven.apache.org/maven2/org/jmockit/jmockit/1.10/jmockit-1.10.pom
(9 KB at 76.2 KB/sec)
[INFO] Downloading: https://repo.maven.apache.org/maven2/org/jmockit/jmockit/1.10/jmockit-1.10.jar
[INFO] Downloaded: https://repo.maven.apache.org/maven2/org/jmockit/jmockit/1.10/jmockit-1.10.jar
(550 KB at 1771.4 KB/sec)
[INFO] 
[INFO] --- maven-clean-plugin:2.5:clean (default-clean) @ carbon-common ---
[INFO] 
[INFO] --- maven-resources-plugin:2.6:resources (default-resources) @ carbon-common ---
[INFO] Using 'UTF-8' encoding to copy filtered resources.
[INFO] skip non existing resourceDirectory <https://builds.apache.org/job/CarbonData-master/ws/common/src/main/resources>
[INFO] 
[INFO] --- maven-compiler-plugin:3.1:compile (default-compile) @ carbon-common ---
[INFO] Changes detected - recompiling the module!
[INFO] Compiling 8 source files to <https://builds.apache.org/job/CarbonData-master/ws/common/target/classes>
[INFO] 
[INFO] --- maven-resources-plugin:2.6:testResources (default-testResources) @ carbon-common
---
[INFO] Using 'UTF-8' encoding to copy filtered resources.
[INFO] skip non existing resourceDirectory <https://builds.apache.org/job/CarbonData-master/ws/common/src/test/resources>
[INFO] 
[INFO] --- maven-compiler-plugin:3.1:testCompile (default-testCompile) @ carbon-common ---
[INFO] Changes detected - recompiling the module!
[INFO] Compiling 7 source files to <https://builds.apache.org/job/CarbonData-master/ws/common/target/test-classes>
[WARNING] <https://builds.apache.org/job/CarbonData-master/ws/common/src/test/java/org/carbondata/common/logging/impl/ExtendedRollingFileAppenderTest_UT.java>:
Some input files use or override a deprecated API.
[WARNING] <https://builds.apache.org/job/CarbonData-master/ws/common/src/test/java/org/carbondata/common/logging/impl/ExtendedRollingFileAppenderTest_UT.java>:
Recompile with -Xlint:deprecation for details.
[INFO] 
[INFO] --- maven-surefire-plugin:2.12.4:test (default-test) @ carbon-common ---
[JENKINS] Recording test results
[INFO] 
[INFO] --- maven-jar-plugin:2.4:jar (default-jar) @ carbon-common ---
[INFO] Building jar: <https://builds.apache.org/job/CarbonData-master/ws/common/target/carbon-common-0.1.0-SNAPSHOT.jar>
[INFO]                                                                         
[INFO] ------------------------------------------------------------------------
[INFO] Building carbon-format 0.1.0-SNAPSHOT
[INFO] ------------------------------------------------------------------------
[INFO] Downloading: https://repo.maven.apache.org/maven2/org/apache/thrift/tools/maven-thrift-plugin/0.1.11/maven-thrift-plugin-0.1.11.pom
[INFO] Downloaded: https://repo.maven.apache.org/maven2/org/apache/thrift/tools/maven-thrift-plugin/0.1.11/maven-thrift-plugin-0.1.11.pom
(4 KB at 18.5 KB/sec)
[INFO] Downloading: https://repo.maven.apache.org/maven2/org/apache/thrift/tools/maven-thrift-plugin/0.1.11/maven-thrift-plugin-0.1.11.jar
[INFO] Downloaded: https://repo.maven.apache.org/maven2/org/apache/thrift/tools/maven-thrift-plugin/0.1.11/maven-thrift-plugin-0.1.11.jar
(18 KB at 156.4 KB/sec)
[INFO] 
[INFO] --- maven-clean-plugin:2.5:clean (default-clean) @ carbon-format ---
[INFO] 
[INFO] --- maven-thrift-plugin:0.1.11:compile (generate-thrift-java) @ carbon-format ---
[INFO] Downloading: https://repo.maven.apache.org/maven2/com/google/collections/google-collections/0.8/google-collections-0.8.pom
[INFO] Downloaded: https://repo.maven.apache.org/maven2/com/google/collections/google-collections/0.8/google-collections-0.8.pom
(3 KB at 16.2 KB/sec)
[INFO] Downloading: https://repo.maven.apache.org/maven2/org/slf4j/slf4j-simple/1.5.8/slf4j-simple-1.5.8.pom
[INFO] Downloaded: https://repo.maven.apache.org/maven2/org/slf4j/slf4j-simple/1.5.8/slf4j-simple-1.5.8.pom
(2 KB at 13.5 KB/sec)
[INFO] Downloading: https://repo.maven.apache.org/maven2/com/google/collections/google-collections/0.8/google-collections-0.8.jar
[INFO] Downloading: https://repo.maven.apache.org/maven2/org/slf4j/slf4j-api/1.5.8/slf4j-api-1.5.8.jar
[INFO] Downloading: https://repo.maven.apache.org/maven2/org/slf4j/slf4j-simple/1.5.8/slf4j-simple-1.5.8.jar
[INFO] Downloaded: https://repo.maven.apache.org/maven2/com/google/collections/google-collections/0.8/google-collections-0.8.jar
(473 KB at 3089.6 KB/sec)
[INFO] Downloaded: https://repo.maven.apache.org/maven2/org/slf4j/slf4j-simple/1.5.8/slf4j-simple-1.5.8.jar
(8 KB at 7.4 KB/sec)
[INFO] Downloaded: https://repo.maven.apache.org/maven2/org/slf4j/slf4j-api/1.5.8/slf4j-api-1.5.8.jar
(23 KB at 21.8 KB/sec)
[ERROR] thrift failed output: 
[ERROR] thrift failed error: /bin/sh: 1: thrift: not found

[INFO] ------------------------------------------------------------------------
[INFO] Reactor Summary:
[INFO] 
[INFO] carbondata ......................................... SUCCESS [ 13.532 s]
[INFO] carbon-common ...................................... SUCCESS [ 28.100 s]
[INFO] carbon-format ...................................... FAILURE [  4.806 s]
[INFO] carbon-core ........................................ SKIPPED
[INFO] carbon-processing .................................. SKIPPED
[INFO] carbon-hadoop ...................................... SKIPPED
[INFO] carbon-spark ....................................... SKIPPED
[INFO] carbon-assembly .................................... SKIPPED
[INFO] carbon-examples .................................... SKIPPED
[INFO] ------------------------------------------------------------------------
[INFO] BUILD FAILURE
[INFO] ------------------------------------------------------------------------
[INFO] Total time: 01:43 min
[INFO] Finished at: 2016-07-18T15:30:33+00:00
[INFO] Final Memory: 27M/246M
[INFO] ------------------------------------------------------------------------
Waiting for Jenkins to finish collecting data[ERROR] Failed to execute goal org.apache.thrift.tools:maven-thrift-plugin:0.1.11:compile
(generate-thrift-java) on project carbon-format: thrift did not exit cleanly. Review output
for more information. -> [Help 1]
org.apache.maven.lifecycle.LifecycleExecutionException: Failed to execute goal org.apache.thrift.tools:maven-thrift-plugin:0.1.11:compile
(generate-thrift-java) on project carbon-format: thrift did not exit cleanly. Review output
for more information.
	at org.apache.maven.lifecycle.internal.MojoExecutor.execute(MojoExecutor.java:212)
	at org.apache.maven.lifecycle.internal.MojoExecutor.execute(MojoExecutor.java:153)
	at org.apache.maven.lifecycle.internal.MojoExecutor.execute(MojoExecutor.java:145)
	at org.apache.maven.lifecycle.internal.LifecycleModuleBuilder.buildProject(LifecycleModuleBuilder.java:116)
	at org.apache.maven.lifecycle.internal.LifecycleModuleBuilder.buildProject(LifecycleModuleBuilder.java:80)
	at org.apache.maven.lifecycle.internal.builder.singlethreaded.SingleThreadedBuilder.build(SingleThreadedBuilder.java:51)
	at org.apache.maven.lifecycle.internal.LifecycleStarter.execute(LifecycleStarter.java:128)
	at org.apache.maven.DefaultMaven.doExecute(DefaultMaven.java:307)
	at org.apache.maven.DefaultMaven.doExecute(DefaultMaven.java:193)
	at org.apache.maven.DefaultMaven.execute(DefaultMaven.java:106)
	at org.jvnet.hudson.maven3.launcher.Maven32Launcher.main(Maven32Launcher.java:132)
	at sun.reflect.NativeMethodAccessorImpl.invoke0(Native Method)
	at sun.reflect.NativeMethodAccessorImpl.invoke(NativeMethodAccessorImpl.java:62)
	at sun.reflect.DelegatingMethodAccessorImpl.invoke(DelegatingMethodAccessorImpl.java:43)
	at java.lang.reflect.Method.invoke(Method.java:497)
	at org.codehaus.plexus.classworlds.launcher.Launcher.launchStandard(Launcher.java:330)
	at org.codehaus.plexus.classworlds.launcher.Launcher.launch(Launcher.java:238)
	at jenkins.maven3.agent.Maven32Main.launch(Maven32Main.java:186)
	at sun.reflect.NativeMethodAccessorImpl.invoke0(Native Method)
	at sun.reflect.NativeMethodAccessorImpl.invoke(NativeMethodAccessorImpl.java:62)
	at sun.reflect.DelegatingMethodAccessorImpl.invoke(DelegatingMethodAccessorImpl.java:43)
	at java.lang.reflect.Method.invoke(Method.java:497)
	at hudson.maven.Maven3Builder.call(Maven3Builder.java:136)
	at hudson.maven.Maven3Builder.call(Maven3Builder.java:71)
	at hudson.remoting.UserRequest.perform(UserRequest.java:120)
	at hudson.remoting.UserRequest.perform(UserRequest.java:48)
	at hudson.remoting.Request$2.run(Request.java:326)
	at hudson.remoting.InterceptingExecutorService$1.call(InterceptingExecutorService.java:68)
	at java.util.concurrent.FutureTask.run(FutureTask.java:266)
	at java.util.concurrent.ThreadPoolExecutor.runWorker(ThreadPoolExecutor.java:1142)
	at java.util.concurrent.ThreadPoolExecutor$Worker.run(ThreadPoolExecutor.java:617)
	at java.lang.Thread.run(Thread.java:745)
Caused by: org.apache.maven.plugin.MojoFailureException: thrift did not exit cleanly. Review
output for more information.
	at org.apache.thrift.maven.AbstractThriftMojo.execute(AbstractThriftMojo.java:177)
	at org.apache.thrift.maven.ThriftCompileMojo.execute(ThriftCompileMojo.java:21)
	at org.apache.maven.plugin.DefaultBuildPluginManager.executeMojo(DefaultBuildPluginManager.java:134)
	at org.apache.maven.lifecycle.internal.MojoExecutor.execute(MojoExecutor.java:208)
	... 31 more
[ERROR] 
[ERROR] Re-run Maven using the -X switch to enable full debug logging.
[ERROR] 
[ERROR] For more information about the errors and possible solutions, please read the following
articles:
[ERROR] [Help 1] http://cwiki.apache.org/confluence/display/MAVEN/MojoFailureException
[ERROR] 
[ERROR] After correcting the problems, you can resume the build with the command
[ERROR]   mvn <goals> -rf :carbon-format

[JENKINS] Archiving <https://builds.apache.org/job/CarbonData-master/ws/common/pom.xml>
to org.carbondata/carbon-common/0.1.0-SNAPSHOT/carbon-common-0.1.0-SNAPSHOT.pom
[JENKINS] Archiving <https://builds.apache.org/job/CarbonData-master/ws/common/target/carbon-common-0.1.0-SNAPSHOT.jar>
to org.carbondata/carbon-common/0.1.0-SNAPSHOT/carbon-common-0.1.0-SNAPSHOT.jar
[JENKINS] Archiving <https://builds.apache.org/job/CarbonData-master/ws/examples/pom.xml>
to org.carbondata/carbon-examples/0.1.0-SNAPSHOT/carbon-examples-0.1.0-SNAPSHOT.pom
No prior successful build to compare, so performing full copy of artifacts
[JENKINS] Archiving <https://builds.apache.org/job/CarbonData-master/ws/processing/pom.xml>
to org.carbondata/carbon-processing/0.1.0-SNAPSHOT/carbon-processing-0.1.0-SNAPSHOT.pom
No prior successful build to compare, so performing full copy of artifacts
[JENKINS] Archiving <https://builds.apache.org/job/CarbonData-master/ws/integration/spark/pom.xml>
to org.carbondata/carbon-spark/0.1.0-SNAPSHOT/carbon-spark-0.1.0-SNAPSHOT.pom
No prior successful build to compare, so performing full copy of artifacts
[JENKINS] Archiving <https://builds.apache.org/job/CarbonData-master/ws/assembly/pom.xml>
to com.huawei.datasight/carbon-assembly/0.1.0-SNAPSHOT/carbon-assembly-0.1.0-SNAPSHOT.pom
No prior successful build to compare, so performing full copy of artifacts
[JENKINS] Archiving <https://builds.apache.org/job/CarbonData-master/ws/pom.xml> to
org.carbondata/carbondata-parent/0.1.0-SNAPSHOT/carbondata-parent-0.1.0-SNAPSHOT.pom
[JENKINS] Archiving <https://builds.apache.org/job/CarbonData-master/ws/core/pom.xml>
to org.carbondata/carbon-core/0.1.0-SNAPSHOT/carbon-core-0.1.0-SNAPSHOT.pom
No prior successful build to compare, so performing full copy of artifacts
[JENKINS] Archiving <https://builds.apache.org/job/CarbonData-master/ws/hadoop/pom.xml>
to org.carbondata/carbon-hadoop/0.1.0-SNAPSHOT/carbon-hadoop-0.1.0-SNAPSHOT.pom
No prior successful build to compare, so performing full copy of artifacts
[JENKINS] Archiving <https://builds.apache.org/job/CarbonData-master/ws/format/pom.xml>
to org.carbondata/carbon-format/0.1.0-SNAPSHOT/carbon-format-0.1.0-SNAPSHOT.pom
No prior successful build to compare, so performing full copy of artifacts
Sending e-mails to: commits@carbondata.incubator.apache.org
channel stopped

Mime
View raw message