camel-users mailing list archives

Site index · List index
Message view « Date » · « Thread »
Top « Date » · « Thread »
From Willem Jiang <willem.ji...@gmail.com>
Subject Re: Build break in camel-jetty
Date Thu, 09 Jun 2011 14:13:00 GMT
Maybe it relates to the openjdk.
Can you try the latest SUN/Oracle JDK 1.6 to run the test ?

On 6/8/11 3:21 PM, Jim Talbut wrote:
> Environmet:
> Apache Maven 2.2.1 (rdebian-4)
> Java version: 1.6.0_22
> Java home: /usr/lib/jvm/java-6-openjdk/jre
> Default locale: en_GB, platform encoding: UTF-8
> OS name: "linux" version: "2.6.38-8-generic" arch: "amd64" Family: "unix"
>
> Source:
> URL: https://svn.apache.org/repos/asf/camel/trunk
> Repository Root: https://svn.apache.org/repos/asf
> Repository UUID: 13f79535-47bb-0310-9956-ffa450edef68
> Revision: 1133250
>
> Failure:
> Tests run: 1, Failures: 1, Errors: 0, Skipped: 0, Time elapsed: 2.219
> sec <<< FAILURE!
> testSendMultiPartForm(org.apache.camel.component.jetty.MultiPartFormTest) Time
> elapsed: 1.78 sec <<< FAILURE!
> java.lang.AssertionError: Get a wrong response status expected:<200> but
> was:<500>
> at org.junit.Assert.fail(Assert.java:91)
> at org.junit.Assert.failNotEquals(Assert.java:645)
> at org.junit.Assert.assertEquals(Assert.java:126)
> at org.junit.Assert.assertEquals(Assert.java:470)
> at
> org.apache.camel.component.jetty.MultiPartFormTest.testSendMultiPartForm(MultiPartFormTest.java:53)
>
>
> Should I investigate further?
>
> Jim
>


-- 
Willem
----------------------------------
FuseSource
Web: http://www.fusesource.com
Blog:    http://willemjiang.blogspot.com (English)
          http://jnn.javaeye.com (Chinese)
Twitter: willemjiang
Weibo: willemjiang

Mime
View raw message