camel-issues mailing list archives

Site index · List index
Message view « Date » · « Thread »
Top « Date » · « Thread »
From "Ioannis Sermetziadis (JIRA)" <j...@apache.org>
Subject [jira] [Commented] (CAMEL-11942) camel-spring build failure on windows
Date Mon, 20 Nov 2017 02:12:00 GMT

    [ https://issues.apache.org/jira/browse/CAMEL-11942?page=com.atlassian.jira.plugin.system.issuetabpanels:comment-tabpanel&focusedCommentId=16258729#comment-16258729
] 

Ioannis Sermetziadis commented on CAMEL-11942:
----------------------------------------------

Hello! I faced this issue while trying to build apache-camel on windows, so tried to resolve
it.

I switched the camel-spring module build to use jaxb2-maven-plugin for schemagen and it works
fine. Also did a sanity check by comparing the spring-schema.xsd between the master and release
tags and it looks ok. Hope I am not missing something.

PR: https://github.com/apache/camel/pull/2099

Cheers

> camel-spring build failure on windows
> -------------------------------------
>
>                 Key: CAMEL-11942
>                 URL: https://issues.apache.org/jira/browse/CAMEL-11942
>             Project: Camel
>          Issue Type: Task
>          Components: build system
>    Affects Versions: 2.20.0
>            Reporter: ├ľnder Sezgin
>            Priority: Minor
>             Fix For: 2.21.0
>
>
> [INFO] Executed tasks
> [INFO]
> [INFO] --- exec-maven-plugin:1.1.1:exec (generate schema) @ camel-spring ---
> [INFO] ------------------------------------------------------------------------
> [INFO] BUILD FAILURE
> [INFO] ------------------------------------------------------------------------
> [INFO] Total time: 03:33 min
> [INFO] Finished at: 2017-10-24T10:27:33+03:00
> [INFO] Final Memory: 37M/240M
> [INFO] ------------------------------------------------------------------------
> [ERROR] Failed to execute goal org.codehaus.mojo:exec-maven-plugin:1.1.1:exec (g
> enerate schema) on project camel-spring: Command execution failed. Error while e
> xecuting process. Cannot run program "cmd.exe" (in directory "D:\dev\github\came
> l\components\camel-spring"): CreateProcess error=206, The filename or extension
> is too long -> [Help 1]
> [ERROR]



--
This message was sent by Atlassian JIRA
(v6.4.14#64029)

Mime
View raw message