camel-issues mailing list archives

Site index · List index
Message view « Date » · « Thread »
Top « Date » · « Thread »
From "Claus Ibsen (JIRA)" <j...@apache.org>
Subject [jira] [Commented] (CAMEL-11602) camel-cxf - there are failing test cases on Windows
Date Tue, 12 Sep 2017 13:25:00 GMT

    [ https://issues.apache.org/jira/browse/CAMEL-11602?page=com.atlassian.jira.plugin.system.issuetabpanels:comment-tabpanel&focusedCommentId=16162928#comment-16162928
] 

Claus Ibsen commented on CAMEL-11602:
-------------------------------------

If you have seen other test failures on windows, then you are welcome to report them. We would
like to have a 100% pass on windows as well.

> camel-cxf - there are failing test cases on Windows
> ---------------------------------------------------
>
>                 Key: CAMEL-11602
>                 URL: https://issues.apache.org/jira/browse/CAMEL-11602
>             Project: Camel
>          Issue Type: Test
>          Components: camel-cxf
>    Affects Versions: 2.19.1, 2.20.0
>         Environment: windows
>            Reporter: Önder Sezgin
>            Priority: Trivial
>
> [ERROR] Failures:
> [ERROR]   CxfProducerRouterTest.testCannotSendRequest:98 mock://error Received m
> essage count. Expected: <1> but was: <0>
> [ERROR] Errors:
> [ERROR]   CxfProducerRouterTest.startServer:67 » Runtime Soap 1.1 endpoint alrea
> dy regis...
> [ERROR] org.apache.camel.component.cxf.CxfProducerSoapActionTest.testSendSoapReq
> uestWithoutSoapActionSet(org.apache.camel.component.cxf.CxfProducerSoapActionTes
> t)
> [ERROR]   Run 1: CxfProducerSoapActionTest>CamelTestSupport.setUp:262->CamelTest
> Support.doSetUp:361->CamelTestSupport.startCamelContext:678 » Fault
> [ERROR]   Run 2: CxfProducerSoapActionTest>CamelTestSupport.setUp:262->CamelTest
> Support.doSetUp:361->CamelTestSupport.startCamelContext:678 » Fault
> [ERROR]   Run 3: CxfProducerSoapActionTest>CamelTestSupport.setUp:262->CamelTest
> Support.doSetUp:361->CamelTestSupport.startCamelContext:678 » Fault
> [INFO]
> [INFO]
> [ERROR] Tests run: 460, Failures: 1, Errors: 2, Skipped: 2



--
This message was sent by Atlassian JIRA
(v6.4.14#64029)

Mime
View raw message