camel-issues mailing list archives

Site index · List index
Message view « Date » · « Thread »
Top « Date » · « Thread »
From Önder Sezgin (JIRA) <j...@apache.org>
Subject [jira] [Updated] (CAMEL-11602) there are already failing test cases
Date Mon, 31 Jul 2017 08:10:00 GMT

     [ https://issues.apache.org/jira/browse/CAMEL-11602?page=com.atlassian.jira.plugin.system.issuetabpanels:all-tabpanel
]

Önder Sezgin updated CAMEL-11602:
---------------------------------
    Priority: Trivial  (was: Minor)

> there are already failing test cases
> ------------------------------------
>
>                 Key: CAMEL-11602
>                 URL: https://issues.apache.org/jira/browse/CAMEL-11602
>             Project: Camel
>          Issue Type: Test
>          Components: camel-cxf
>    Affects Versions: 2.19.1, 2.20.0
>         Environment: windows
>            Reporter: Önder Sezgin
>            Priority: Trivial
>
> [ERROR] Failures:
> [ERROR]   CxfProducerRouterTest.testCannotSendRequest:98 mock://error Received m
> essage count. Expected: <1> but was: <0>
> [ERROR] Errors:
> [ERROR]   CxfProducerRouterTest.startServer:67 » Runtime Soap 1.1 endpoint alrea
> dy regis...
> [ERROR] org.apache.camel.component.cxf.CxfProducerSoapActionTest.testSendSoapReq
> uestWithoutSoapActionSet(org.apache.camel.component.cxf.CxfProducerSoapActionTes
> t)
> [ERROR]   Run 1: CxfProducerSoapActionTest>CamelTestSupport.setUp:262->CamelTest
> Support.doSetUp:361->CamelTestSupport.startCamelContext:678 » Fault
> [ERROR]   Run 2: CxfProducerSoapActionTest>CamelTestSupport.setUp:262->CamelTest
> Support.doSetUp:361->CamelTestSupport.startCamelContext:678 » Fault
> [ERROR]   Run 3: CxfProducerSoapActionTest>CamelTestSupport.setUp:262->CamelTest
> Support.doSetUp:361->CamelTestSupport.startCamelContext:678 » Fault
> [INFO]
> [INFO]
> [ERROR] Tests run: 460, Failures: 1, Errors: 2, Skipped: 2



--
This message was sent by Atlassian JIRA
(v6.4.14#64029)

Mime
View raw message