camel-issues mailing list archives

Site index · List index
Message view « Date » · « Thread »
Top « Date » · « Thread »
From "Thomas Termin (JIRA)" <j...@apache.org>
Subject [jira] [Commented] (CAMEL-8350) camel-netty4 - UDP unit test fails
Date Sun, 15 Feb 2015 20:37:12 GMT

    [ https://issues.apache.org/jira/browse/CAMEL-8350?page=com.atlassian.jira.plugin.system.issuetabpanels:comment-tabpanel&focusedCommentId=14322178#comment-14322178
] 

Thomas Termin commented on CAMEL-8350:
--------------------------------------

And this is what I get now within the nett4 module:

[ERROR] Failed to execute goal org.apache.maven.plugins:maven-compiler-plugin:2.5.1:compile
(default-compile) on project camel-netty4: Compilation failure
[ERROR] Failure executing javac,  but could not parse the error:
[ERROR] 
[ERROR] 
[ERROR] An annotation processor threw an uncaught exception.
[ERROR] Consult the following stack trace for details.
[ERROR] java.lang.NoSuchMethodError: org.apache.camel.spi.UriParam.label()Ljava/lang/String;
[ERROR] at org.apache.camel.tools.apt.EndpointAnnotationProcessor.findClassProperties(EndpointAnnotationProcessor.java:535)
[ERROR] at org.apache.camel.tools.apt.EndpointAnnotationProcessor.showDocumentationAndFieldInjections(EndpointAnnotationProcessor.java:288)
[ERROR] at org.apache.camel.tools.apt.EndpointAnnotationProcessor.writeHtmlDocumentation(EndpointAnnotationProcessor.java:127)
[ERROR] at org.apache.camel.tools.apt.EndpointAnnotationProcessor$1.call(EndpointAnnotationProcessor.java:88)
[ERROR] at org.apache.camel.tools.apt.EndpointAnnotationProcessor$1.call(EndpointAnnotationProcessor.java:85)
[ERROR] at org.apache.camel.tools.apt.AbstractAnnotationProcessor.processFile(AbstractAnnotationProcessor.java:282)
[ERROR] at org.apache.camel.tools.apt.EndpointAnnotationProcessor.processEndpointClass(EndpointAnnotationProcessor.java:92)
[ERROR] at org.apache.camel.tools.apt.EndpointAnnotationProcessor.process(EndpointAnnotationProcessor.java:65)
[ERROR] at com.sun.tools.javac.processing.JavacProcessingEnvironment.callProcessor(JavacProcessingEnvironment.java:793)
[ERROR] at com.sun.tools.javac.processing.JavacProcessingEnvironment.discoverAndRunProcs(JavacProcessingEnvironment.java:722)
[ERROR] at com.sun.tools.javac.processing.JavacProcessingEnvironment.access$1700(JavacProcessingEnvironment.java:97)
[ERROR] at com.sun.tools.javac.processing.JavacProcessingEnvironment$Round.run(JavacProcessingEnvironment.java:1029)
[ERROR] at com.sun.tools.javac.processing.JavacProcessingEnvironment.doProcessing(JavacProcessingEnvironment.java:1163)
[ERROR] at com.sun.tools.javac.main.JavaCompiler.processAnnotations(JavaCompiler.java:1108)
[ERROR] at com.sun.tools.javac.main.JavaCompiler.compile(JavaCompiler.java:824)
[ERROR] at com.sun.tools.javac.main.Main.compile(Main.java:439)
[ERROR] at com.sun.tools.javac.main.Main.compile(Main.java:353)
[ERROR] at com.sun.tools.javac.main.Main.compile(Main.java:342)
[ERROR] at com.sun.tools.javac.main.Main.compile(Main.java:333)
[ERROR] at com.sun.tools.javac.Main.compile(Main.java:76)
[ERROR] at com.sun.tools.javac.Main.main(Main.java:61)
[ERROR] -> [Help 1]
[ERROR] 
[ERROR] To see the full stack trace of the errors, re-run Maven with the -e switch.
[ERROR] Re-run Maven using the -X switch to enable full debug logging.
[ERROR] 
[ERROR] For more information about the errors and possible solutions, please read the following
articles:
[ERROR] [Help 1] http://cwiki.apache.org/confluence/display/MAVEN/MojoFailureException


> camel-netty4 - UDP unit test fails
> ----------------------------------
>
>                 Key: CAMEL-8350
>                 URL: https://issues.apache.org/jira/browse/CAMEL-8350
>             Project: Camel
>          Issue Type: Test
>    Affects Versions: 2.15.0
>            Reporter: Claus Ibsen
>            Assignee: Willem Jiang
>             Fix For: 2.15.0
>
>
> This test fails often when doing a full Camel test
> Tests run: 2, Failures: 1, Errors: 0, Skipped: 0, Time elapsed: 0.113 sec <<<
FAILURE! - in org.apache.camel.component.netty4.NettyUdpConnectedSendTest
> sendConnectedWithoutReceiver(org.apache.camel.component.netty4.NettyUdpConnectedSendTest)
 Time elapsed: 0.076 sec  <<< FAILURE!
> java.lang.AssertionError: There should at least one exception because port is unreachable
> 	at org.junit.Assert.fail(Assert.java:88)
> 	at org.junit.Assert.assertTrue(Assert.java:41)
> 	at org.apache.camel.component.netty4.NettyUdpConnectedSendTest.sendConnectedWithoutReceiver(NettyUdpConnectedSendTest.java:89)



--
This message was sent by Atlassian JIRA
(v6.3.4#6332)

Mime
View raw message