camel-issues mailing list archives

Site index · List index
Message view « Date » · « Thread »
Top « Date » · « Thread »
From "Claus Ibsen (JIRA)" <j...@apache.org>
Subject [jira] [Resolved] (CAMEL-8255) camel-aws - Test fails
Date Fri, 06 Feb 2015 13:15:34 GMT

     [ https://issues.apache.org/jira/browse/CAMEL-8255?page=com.atlassian.jira.plugin.system.issuetabpanels:all-tabpanel
]

Claus Ibsen resolved CAMEL-8255.
--------------------------------
    Resolution: Fixed
      Assignee: Claus Ibsen

> camel-aws - Test fails
> ----------------------
>
>                 Key: CAMEL-8255
>                 URL: https://issues.apache.org/jira/browse/CAMEL-8255
>             Project: Camel
>          Issue Type: Test
>          Components: camel-aws
>    Affects Versions: 2.15.0
>            Reporter: Claus Ibsen
>            Assignee: Claus Ibsen
>            Priority: Minor
>             Fix For: 2.15.0
>
>
> This test fails if running a full Camel test
> {code}
> Tests run: 1, Failures: 1, Errors: 0, Skipped: 0, Time elapsed: 3.063 sec <<<
FAILURE! - in org.apache.camel.component.aws.swf.CamelSWFWorkflowConsumerTest
> receivesDecisionTask(org.apache.camel.component.aws.swf.CamelSWFWorkflowConsumerTest)
 Time elapsed: 3.062 sec  <<< FAILURE!
> java.lang.AssertionError: mock://result Received message count. Expected: <1> but
was: <4>
> 	at org.apache.camel.component.mock.MockEndpoint.fail(MockEndpoint.java:1370)
> 	at org.apache.camel.component.mock.MockEndpoint.assertEquals(MockEndpoint.java:1352)
> 	at org.apache.camel.component.mock.MockEndpoint.doAssertIsSatisfied(MockEndpoint.java:399)
> 	at org.apache.camel.component.mock.MockEndpoint.assertIsSatisfied(MockEndpoint.java:378)
> 	at org.apache.camel.component.mock.MockEndpoint.assertIsSatisfied(MockEndpoint.java:366)
> 	at org.apache.camel.component.mock.MockEndpoint.assertIsSatisfied(MockEndpoint.java:204)
> 	at org.apache.camel.test.junit4.CamelTestSupport.assertMockEndpointsSatisfied(CamelTestSupport.java:675)
> 	at org.apache.camel.component.aws.swf.CamelSWFWorkflowConsumerTest.receivesDecisionTask(CamelSWFWorkflowConsumerTest.java:63)
> {code}



--
This message was sent by Atlassian JIRA
(v6.3.4#6332)

Mime
View raw message