camel-dev mailing list archives

Site index · List index
Message view « Date » · « Thread »
Top « Date » · « Thread »
From Apache Jenkins Server <jenk...@builds.apache.org>
Subject Build failed in Jenkins: Camel #1291
Date Tue, 02 Aug 2011 09:50:04 GMT
See <https://builds.apache.org/job/Camel/1291/changes>

Changes:

[davsclaus] CAMEL-4168: Added getRouteId to trace event message

[davsclaus] CAMEL-4248: Introducing a set of Camel JMX annotations to be used for JMX management.

[davsclaus] CAMEL-4168: Added getRouteId to trace event message

[davsclaus] Fixed problem with attribute not using same type in ManagedThreadPool causing
that option not accessible in JMX

[dkulp] Fix compile error by removing the non-utf8 chars.  Someone may need to
figure out what those chars should have been.

[dkulp] Use an async process to destroy the JMS DefaultMessageListenerContainer
as the destroy method can take quite a while.  (might be an issue in
ActiveMQ).   This chops the build time on my machine from 15min 28s
to  10min 36s.

[cschneider] CAMEL-4244 Moved default values to createProcessor

[cmueller] added a test for a user forum issue

[janstey] CAMEL-4290 - Add idleConsumerLimit option for DMLC to camel-jms

[davsclaus] CAMEL-4288: Added showFiles option to log formatter.

[janstey] CAMEL-4287 - get AWS component building offline

[ningjiang] CAMEL-4286 BlueprintCamelContextFactoryBean should set the ApplicationContextClassLoader
for the CamelContext

[ningjiang] Update the spring schemas version

[ningjiang] Fixed a CS error of camel-xmpp

------------------------------------------
[...truncated 31958 lines...]
[INFO] An error has occurred in JavaDocs report generation:Unable to resolve artifact:groupId
= 'com.sun.jersey'
artifactId = 'jersey-server'
version = '1.8'

Missing:
----------
1) javax.persistence:persistence-api:jar:1.0.2

  Try downloading the file manually from the project website.

  Then, install it using the command: 
      mvn install:install-file -DgroupId=javax.persistence -DartifactId=persistence-api -Dversion=1.0.2
-Dpackaging=jar -Dfile=/path/to/file

  Alternatively, if you host your own repository you can deploy the file there: 
      mvn deploy:deploy-file -DgroupId=javax.persistence -DartifactId=persistence-api -Dversion=1.0.2
-Dpackaging=jar -Dfile=/path/to/file -Durl=[url] -DrepositoryId=[id]

  Path to dependency: 
  	1) com.sun.jersey:jersey-server:bundle:1.8
  	2) javax.persistence:persistence-api:jar:1.0.2

----------
1 required artifact is missing.

for artifact: 
  com.sun.jersey:jersey-server:bundle:1.8

from the specified remote repositories:
  m2.dev.java.net (http://download.java.net/maven/2),
  central (http://repo1.maven.org/maven2),
  glassfish-repository (http://maven.glassfish.org/content/groups/glassfish),
  glassfish.dev.java.net (http://download.java.net/maven/glassfish)


[INFO] ------------------------------------------------------------------------
[INFO] Trace
org.apache.maven.lifecycle.LifecycleExecutionException: An error has occurred in JavaDocs
report generation:Unable to resolve artifact:groupId = 'com.sun.jersey'
artifactId = 'jersey-server'
version = '1.8'
	at org.apache.maven.lifecycle.DefaultLifecycleExecutor.executeGoals(DefaultLifecycleExecutor.java:719)
	at org.apache.maven.lifecycle.DefaultLifecycleExecutor.executeGoalWithLifecycle(DefaultLifecycleExecutor.java:556)
	at org.apache.maven.lifecycle.DefaultLifecycleExecutor.executeGoal(DefaultLifecycleExecutor.java:535)
	at org.apache.maven.lifecycle.DefaultLifecycleExecutor.executeGoalAndHandleFailures(DefaultLifecycleExecutor.java:387)
	at org.apache.maven.lifecycle.DefaultLifecycleExecutor.executeTaskSegments(DefaultLifecycleExecutor.java:348)
	at org.apache.maven.lifecycle.DefaultLifecycleExecutor.execute(DefaultLifecycleExecutor.java:180)
	at org.apache.maven.lifecycle.LifecycleExecutorInterceptor.execute(LifecycleExecutorInterceptor.java:65)
	at org.apache.maven.DefaultMaven.doExecute(DefaultMaven.java:328)
	at org.apache.maven.DefaultMaven.execute(DefaultMaven.java:138)
	at org.apache.maven.cli.MavenCli.main(MavenCli.java:362)
	at sun.reflect.NativeMethodAccessorImpl.invoke0(Native Method)
	at sun.reflect.NativeMethodAccessorImpl.invoke(NativeMethodAccessorImpl.java:39)
	at sun.reflect.DelegatingMethodAccessorImpl.invoke(DelegatingMethodAccessorImpl.java:25)
	at java.lang.reflect.Method.invoke(Method.java:597)
	at org.codehaus.classworlds.Launcher.launchEnhanced(Launcher.java:315)
	at org.codehaus.classworlds.Launcher.launch(Launcher.java:255)
	at hudson.maven.agent.Main.launch(Main.java:185)
	at hudson.maven.MavenBuilder.call(MavenBuilder.java:164)
	at hudson.maven.MavenModuleSetBuild$Builder.call(MavenModuleSetBuild.java:987)
	at hudson.maven.MavenModuleSetBuild$Builder.call(MavenModuleSetBuild.java:918)
	at hudson.remoting.UserRequest.perform(UserRequest.java:118)
	at hudson.remoting.UserRequest.perform(UserRequest.java:48)
	at hudson.remoting.Request$2.run(Request.java:270)
	at java.util.concurrent.Executors$RunnableAdapter.call(Executors.java:441)
	at java.util.concurrent.FutureTask$Sync.innerRun(FutureTask.java:303)
	at java.util.concurrent.FutureTask.run(FutureTask.java:138)
	at java.util.concurrent.ThreadPoolExecutor$Worker.runTask(ThreadPoolExecutor.java:886)
	at java.util.concurrent.ThreadPoolExecutor$Worker.run(ThreadPoolExecutor.java:908)
	at java.lang.Thread.run(Thread.java:619)
Caused by: org.apache.maven.plugin.MojoExecutionException: An error has occurred in JavaDocs
report generation:Unable to resolve artifact:groupId = 'com.sun.jersey'
artifactId = 'jersey-server'
version = '1.8'
	at org.apache.maven.plugin.javadoc.JavadocReport.execute(JavadocReport.java:298)
	at org.apache.maven.plugin.DefaultPluginManager.executeMojo(DefaultPluginManager.java:490)
	at hudson.maven.agent.PluginManagerInterceptor.executeMojo(PluginManagerInterceptor.java:182)
	at org.apache.maven.lifecycle.DefaultLifecycleExecutor.executeGoals(DefaultLifecycleExecutor.java:694)
	... 28 more
Caused by: org.apache.maven.reporting.MavenReportException: Unable to resolve artifact:groupId
= 'com.sun.jersey'
artifactId = 'jersey-server'
version = '1.8'
	at org.apache.maven.plugin.javadoc.AbstractJavadocMojo.getArtifactsAbsolutePath(AbstractJavadocMojo.java:3241)
	at org.apache.maven.plugin.javadoc.AbstractJavadocMojo.getDocletPath(AbstractJavadocMojo.java:2730)
	at org.apache.maven.plugin.javadoc.AbstractJavadocMojo.addJavadocOptions(AbstractJavadocMojo.java:4514)
	at org.apache.maven.plugin.javadoc.AbstractJavadocMojo.executeReport(AbstractJavadocMojo.java:1911)
	at org.apache.maven.plugin.javadoc.JavadocReport.generate(JavadocReport.java:124)
	at org.apache.maven.plugin.javadoc.JavadocReport.execute(JavadocReport.java:292)
	... 31 more
Caused by: org.apache.maven.artifact.resolver.MultipleArtifactsNotFoundException: Missing:
----------
1) javax.persistence:persistence-api:jar:1.0.2

  Try downloading the file manually from the project website.

  Then, install it using the command: 
      mvn install:install-file -DgroupId=javax.persistence -DartifactId=persistence-api -Dversion=1.0.2
-Dpackaging=jar -Dfile=/path/to/file

  Alternatively, if you host your own repository you can deploy the file there: 
      mvn deploy:deploy-file -DgroupId=javax.persistence -DartifactId=persistence-api -Dversion=1.0.2
-Dpackaging=jar -Dfile=/path/to/file -Durl=[url] -DrepositoryId=[id]

  Path to dependency: 
  	1) com.sun.jersey:jersey-server:bundle:1.8
  	2) javax.persistence:persistence-api:jar:1.0.2

----------
1 required artifact is missing.

for artifact: 
  com.sun.jersey:jersey-server:bundle:1.8

from the specified remote repositories:
  m2.dev.java.net (http://download.java.net/maven/2),
  central (http://repo1.maven.org/maven2),
  glassfish-repository (http://maven.glassfish.org/content/groups/glassfish),
  glassfish.dev.java.net (http://download.java.net/maven/glassfish)


	at org.apache.maven.artifact.resolver.DefaultArtifactResolver.resolveTransitively(DefaultArtifactResolver.java:360)
	at org.apache.maven.artifact.resolver.DefaultArtifactResolver.resolveTransitively(DefaultArtifactResolver.java:304)
	at org.apache.maven.artifact.resolver.DefaultArtifactResolver.resolveTransitively(DefaultArtifactResolver.java:275)
	at org.apache.maven.artifact.resolver.DefaultArtifactResolver.resolveTransitively(DefaultArtifactResolver.java:384)
	at org.apache.maven.plugin.javadoc.AbstractJavadocMojo.getArtifactsAbsolutePath(AbstractJavadocMojo.java:3219)
	... 36 more
[INFO] ------------------------------------------------------------------------
[INFO] Error for project: Camel :: Guice (during install)
[INFO] ------------------------------------------------------------------------
[INFO] Error building POM (may not be this project's POM).


Project ID: null:guiceyfruit-junit4:bundle:null

Reason: Cannot find parent: org.guiceyfruit:parent for project: null:guiceyfruit-junit4:bundle:null
for project null:guiceyfruit-junit4:bundle:null


[INFO] ------------------------------------------------------------------------
[INFO] Trace
org.apache.maven.lifecycle.LifecycleExecutionException: Unable to get dependency information:
Unable to read the metadata file for artifact 'org.guiceyfruit:guiceyfruit-junit4:jar': Cannot
find parent: org.guiceyfruit:parent for project: null:guiceyfruit-junit4:bundle:null for project
null:guiceyfruit-junit4:bundle:null
  org.guiceyfruit:guiceyfruit-junit4:jar:2.0

from the specified remote repositories:
  apache.snapshots (http://repository.apache.org/snapshots/),
  central (http://repo1.maven.org/maven2),
  guiceyfruit.release (http://guiceyfruit.googlecode.com/svn/repo/releases/)

Path to dependency: 
	1) org.apache.camel:camel-guice:bundle:2.9-SNAPSHOT


	at org.apache.maven.lifecycle.DefaultLifecycleExecutor.executeGoals(DefaultLifecycleExecutor.java:711)
	at org.apache.maven.lifecycle.DefaultLifecycleExecutor.executeGoalWithLifecycle(DefaultLifecycleExecutor.java:556)
	at org.apache.maven.lifecycle.DefaultLifecycleExecutor.executeGoal(DefaultLifecycleExecutor.java:535)
	at org.apache.maven.lifecycle.DefaultLifecycleExecutor.executeGoalAndHandleFailures(DefaultLifecycleExecutor.java:387)
	at org.apache.maven.lifecycle.DefaultLifecycleExecutor.executeTaskSegments(DefaultLifecycleExecutor.java:348)
	at org.apache.maven.lifecycle.DefaultLifecycleExecutor.execute(DefaultLifecycleExecutor.java:180)
	at org.apache.maven.lifecycle.LifecycleExecutorInterceptor.execute(LifecycleExecutorInterceptor.java:65)
	at org.apache.maven.DefaultMaven.doExecute(DefaultMaven.java:328)
	at org.apache.maven.DefaultMaven.execute(DefaultMaven.java:138)
	at org.apache.maven.cli.MavenCli.main(MavenCli.java:362)
	at sun.reflect.NativeMethodAccessorImpl.invoke0(Native Method)
	at sun.reflect.NativeMethodAccessorImpl.invoke(NativeMethodAccessorImpl.java:39)
	at sun.reflect.DelegatingMethodAccessorImpl.invoke(DelegatingMethodAccessorImpl.java:25)
	at java.lang.reflect.Method.invoke(Method.java:597)
	at org.codehaus.classworlds.Launcher.launchEnhanced(Launcher.java:315)
	at org.codehaus.classworlds.Launcher.launch(Launcher.java:255)
	at hudson.maven.agent.Main.launch(Main.java:185)
	at hudson.maven.MavenBuilder.call(MavenBuilder.java:164)
	at hudson.maven.MavenModuleSetBuild$Builder.call(MavenModuleSetBuild.java:987)
	at hudson.maven.MavenModuleSetBuild$Builder.call(MavenModuleSetBuild.java:918)
	at hudson.remoting.UserRequest.perform(UserRequest.java:118)
	at hudson.remoting.UserRequest.perform(UserRequest.java:48)
	at hudson.remoting.Request$2.run(Request.java:270)
	at java.util.concurrent.Executors$RunnableAdapter.call(Executors.java:441)
	at java.util.concurrent.FutureTask$Sync.innerRun(FutureTask.java:303)
	at java.util.concurrent.FutureTask.run(FutureTask.java:138)
	at java.util.concurrent.ThreadPoolExecutor$Worker.runTask(ThreadPoolExecutor.java:886)
	at java.util.concurrent.ThreadPoolExecutor$Worker.run(ThreadPoolExecutor.java:908)
	at java.lang.Thread.run(Thread.java:619)
Caused by: org.apache.maven.artifact.resolver.ArtifactResolutionException: Unable to get dependency
information: Unable to read the metadata file for artifact 'org.guiceyfruit:guiceyfruit-junit4:jar':
Cannot find parent: org.guiceyfruit:parent for project: null:guiceyfruit-junit4:bundle:null
for project null:guiceyfruit-junit4:bundle:null
  org.guiceyfruit:guiceyfruit-junit4:jar:2.0

from the specified remote repositories:
  apache.snapshots (http://repository.apache.org/snapshots/),
  central (http://repo1.maven.org/maven2),
  guiceyfruit.release (http://guiceyfruit.googlecode.com/svn/repo/releases/)

Path to dependency: 
	1) org.apache.camel:camel-guice:bundle:2.9-SNAPSHOT


	at org.apache.maven.artifact.resolver.DefaultArtifactCollector.recurse(DefaultArtifactCollector.java:430)
	at org.apache.maven.artifact.resolver.DefaultArtifactCollector.collect(DefaultArtifactCollector.java:74)
	at org.apache.maven.artifact.resolver.DefaultArtifactResolver.resolveTransitively(DefaultArtifactResolver.java:316)
	at org.apache.maven.artifact.resolver.DefaultArtifactResolver.resolveTransitively(DefaultArtifactResolver.java:304)
	at org.apache.maven.plugin.DefaultPluginManager.resolveTransitiveDependencies(DefaultPluginManager.java:1499)
	at org.apache.maven.plugin.DefaultPluginManager.executeMojo(DefaultPluginManager.java:442)
	at hudson.maven.agent.PluginManagerInterceptor.executeMojo(PluginManagerInterceptor.java:182)
	at org.apache.maven.lifecycle.DefaultLifecycleExecutor.executeGoals(DefaultLifecycleExecutor.java:694)
	... 28 more
Caused by: org.apache.maven.artifact.metadata.ArtifactMetadataRetrievalException: Unable to
read the metadata file for artifact 'org.guiceyfruit:guiceyfruit-junit4:jar': Cannot find
parent: org.guiceyfruit:parent for project: null:guiceyfruit-junit4:bundle:null for project
null:guiceyfruit-junit4:bundle:null
	at org.apache.maven.project.artifact.MavenMetadataSource.retrieveRelocatedProject(MavenMetadataSource.java:200)
	at org.apache.maven.project.artifact.MavenMetadataSource.retrieveRelocatedArtifact(MavenMetadataSource.java:94)
	at org.apache.maven.artifact.resolver.DefaultArtifactCollector.recurse(DefaultArtifactCollector.java:387)
	... 35 more
Caused by: org.apache.maven.project.ProjectBuildingException: Cannot find parent: org.guiceyfruit:parent
for project: null:guiceyfruit-junit4:bundle:null for project null:guiceyfruit-junit4:bundle:null
	at org.apache.maven.project.DefaultMavenProjectBuilder.assembleLineage(DefaultMavenProjectBuilder.java:1396)
	at org.apache.maven.project.DefaultMavenProjectBuilder.buildInternal(DefaultMavenProjectBuilder.java:823)
	at org.apache.maven.project.DefaultMavenProjectBuilder.buildFromRepository(DefaultMavenProjectBuilder.java:255)
	at org.apache.maven.project.artifact.MavenMetadataSource.retrieveRelocatedProject(MavenMetadataSource.java:163)
	... 37 more
Caused by: org.apache.maven.project.ProjectBuildingException: POM 'org.guiceyfruit:parent'
not found in repository: Unable to download the artifact from any repository

  org.guiceyfruit:parent:pom:2.0

from the specified remote repositories:
  guiceyfruit.release (http://guiceyfruit.googlecode.com/svn/repo/releases/),
  central (http://repo1.maven.org/maven2),
  Nexus (http://repository.apache.org/snapshots)

 for project org.guiceyfruit:parent
	at org.apache.maven.project.DefaultMavenProjectBuilder.findModelFromRepository(DefaultMavenProjectBuilder.java:605)
	at org.apache.maven.project.DefaultMavenProjectBuilder.assembleLineage(DefaultMavenProjectBuilder.java:1392)
	... 40 more
Caused by: org.apache.maven.artifact.resolver.ArtifactNotFoundException: Unable to download
the artifact from any repository

  org.guiceyfruit:parent:pom:2.0

from the specified remote repositories:
  guiceyfruit.release (http://guiceyfruit.googlecode.com/svn/repo/releases/),
  central (http://repo1.maven.org/maven2),
  Nexus (http://repository.apache.org/snapshots)


	at org.apache.maven.artifact.resolver.DefaultArtifactResolver.resolve(DefaultArtifactResolver.java:228)
	at org.apache.maven.artifact.resolver.DefaultArtifactResolver.resolve(DefaultArtifactResolver.java:90)
	at org.apache.maven.project.DefaultMavenProjectBuilder.findModelFromRepository(DefaultMavenProjectBuilder.java:558)
	... 41 more
Caused by: org.apache.maven.wagon.ResourceDoesNotExistException: Unable to download the artifact
from any repository
	at org.apache.maven.artifact.manager.DefaultWagonManager.getArtifact(DefaultWagonManager.java:404)
	at org.apache.maven.artifact.resolver.DefaultArtifactResolver.resolve(DefaultArtifactResolver.java:216)
	... 43 more
[INFO] ------------------------------------------------------------------------
[INFO] BUILD ERRORS
[INFO] ------------------------------------------------------------------------
[INFO] Total time: 51 minutes 15 seconds
[INFO] Finished at: Tue Aug 02 09:39:41 UTC 2011
[INFO] Final Memory: 251M/476M
[INFO] ------------------------------------------------------------------------
Sending e-mails to: dev@camel.apache.org
Sending e-mails to: dev@camel.apache.org
channel stopped
[locks-and-latches] Releasing all the locks
[locks-and-latches] All the locks released


Mime
View raw message