camel-dev mailing list archives

Site index · List index
Message view « Date » · « Thread »
Top « Date » · « Thread »
From Apache Jenkins Server <jenk...@builds.apache.org>
Subject Build failed in Jenkins: Camel » Camel :: JMS #1309
Date Thu, 25 Aug 2011 14:40:50 GMT
See <https://builds.apache.org/job/Camel/org.apache.camel$camel-jms/1309/>

------------------------------------------
[INFO] ------------------------------------------------------------------------
[INFO] Building Camel :: JMS
[INFO]    task-segment: [clean, install]
[INFO] ------------------------------------------------------------------------
[INFO] [clean:clean {execution: default-clean}]
[INFO] Deleting <https://builds.apache.org/job/Camel/org.apache.camel$camel-jms/ws/target>
[INFO] [antrun:run {execution: create-prop}]
[INFO] Executing tasks
     [echo] Maven version: 2.9-SNAPSHOT
     [echo] OSGi version: 2.9.0.SNAPSHOT
    [mkdir] Created dir: <https://builds.apache.org/job/Camel/org.apache.camel$camel-jms/ws/target>
[INFO] Executed tasks
[INFO] [properties:read-project-properties {execution: default}]
[INFO] [remote-resources:process {execution: default}]
[INFO] [resources:resources {execution: default-resources}]
[INFO] Using 'UTF-8' encoding to copy filtered resources.
[INFO] Copying 3 resources
[INFO] Copying 3 resources
[INFO] [compiler:compile {execution: default-compile}]
[INFO] Compiling 42 source files to <https://builds.apache.org/job/Camel/org.apache.camel$camel-jms/ws/target/classes>
[INFO] [resources:testResources {execution: default-testResources}]
[INFO] Using 'UTF-8' encoding to copy filtered resources.
[INFO] Copying 48 resources
[INFO] Copying 3 resources
[INFO] [compiler:testCompile {execution: default-testCompile}]
[INFO] Compiling 206 source files to <https://builds.apache.org/job/Camel/org.apache.camel$camel-jms/ws/target/test-classes>
[INFO] -------------------------------------------------------------
[ERROR] COMPILATION ERROR : 
[INFO] -------------------------------------------------------------
[ERROR] <https://builds.apache.org/job/Camel/org.apache.camel$camel-jms/ws/src/test/java/org/apache/camel/component/jms/JmsXMLRouteTest.java>:[29,38]
cannot find symbol
symbol  : class StringSource
location: package org.apache.camel.converter.jaxp
[ERROR] <https://builds.apache.org/job/Camel/org.apache.camel$camel-jms/ws/src/test/java/org/apache/camel/component/jms/JmsXMLRouteTest.java>:[134,28]
cannot find symbol
symbol  : class StringSource
location: class org.apache.camel.component.jms.JmsXMLRouteTest
[ERROR] <https://builds.apache.org/job/Camel/org.apache.camel$camel-jms/ws/src/test/java/org/apache/camel/component/jms/JmsXMLRouteTest.java>:[153,28]
cannot find symbol
symbol  : class StringSource
location: class org.apache.camel.component.jms.JmsXMLRouteTest
[ERROR] <https://builds.apache.org/job/Camel/org.apache.camel$camel-jms/ws/src/test/java/org/apache/camel/component/jms/JmsXMLRouteTest.java>:[172,28]
cannot find symbol
symbol  : class StringSource
location: class org.apache.camel.component.jms.JmsXMLRouteTest
[INFO] 4 errors 
[INFO] -------------------------------------------------------------
[JENKINS] Archiving <https://builds.apache.org/job/Camel/org.apache.camel$camel-jms/ws/pom.xml>
to /home/hudson/hudson/jobs/Camel/modules/org.apache.camel$camel-jms/builds/2011-08-25_14-10-15/archive/org.apache.camel/camel-jms/2.9-SNAPSHOT/camel-jms-2.9-SNAPSHOT.pom


Mime
View raw message