camel-dev mailing list archives

Site index · List index
Message view « Date » · « Thread »
Top « Date » · « Thread »
From Apache Jenkins Server <jenk...@builds.apache.org>
Subject Build failed in Jenkins: Camel #1266
Date Mon, 04 Jul 2011 03:14:33 GMT
See <https://builds.apache.org/job/Camel/1266/changes>

Changes:

[cmueller] CAMEL-4170: camel-smpp component doesn't support sms messages longer than 254 symbols.

------------------------------------------
[...truncated 9189 lines...]
[INFO] Checking legal files in: apache-camel-2.8-SNAPSHOT-src.zip
[INFO] [install:install {execution: default-install}]
[INFO] Installing <https://builds.apache.org/job/Camel/ws/camel-trunk/apache-camel/pom.xml>
to <https://builds.apache.org/job/Camel/ws/.repository/org/apache/camel/apache-camel/2.8-SNAPSHOT/apache-camel-2.8-SNAPSHOT.pom>
[INFO] Installing <https://builds.apache.org/job/Camel/ws/camel-trunk/apache-camel/target/apache-camel-2.8-SNAPSHOT.tar.gz>
to <https://builds.apache.org/job/Camel/ws/.repository/org/apache/camel/apache-camel/2.8-SNAPSHOT/apache-camel-2.8-SNAPSHOT.tar.gz>
[INFO] Installing <https://builds.apache.org/job/Camel/ws/camel-trunk/apache-camel/target/apache-camel-2.8-SNAPSHOT.zip>
to <https://builds.apache.org/job/Camel/ws/.repository/org/apache/camel/apache-camel/2.8-SNAPSHOT/apache-camel-2.8-SNAPSHOT.zip>
[INFO] Installing <https://builds.apache.org/job/Camel/ws/camel-trunk/apache-camel/target/apache-camel-2.8-SNAPSHOT-src.zip>
to <https://builds.apache.org/job/Camel/ws/.repository/org/apache/camel/apache-camel/2.8-SNAPSHOT/apache-camel-2.8-SNAPSHOT-src.zip>
[JENKINS] Archiving <https://builds.apache.org/job/Camel/ws/camel-trunk/apache-camel/pom.xml>
to /home/hudson/hudson/jobs/Camel/modules/org.apache.camel$apache-camel/builds/2011-07-04_02-45-42/archive/org.apache.camel/apache-camel/2.8-SNAPSHOT/apache-camel-2.8-SNAPSHOT.pom
[JENKINS] Archiving <https://builds.apache.org/job/Camel/ws/camel-trunk/apache-camel/target/apache-camel-2.8-SNAPSHOT.tar.gz>
to /home/hudson/hudson/jobs/Camel/modules/org.apache.camel$apache-camel/builds/2011-07-04_02-45-42/archive/org.apache.camel/apache-camel/2.8-SNAPSHOT/apache-camel-2.8-SNAPSHOT.tar.gz
[JENKINS] Archiving <https://builds.apache.org/job/Camel/ws/camel-trunk/apache-camel/target/apache-camel-2.8-SNAPSHOT.zip>
to /home/hudson/hudson/jobs/Camel/modules/org.apache.camel$apache-camel/builds/2011-07-04_02-45-42/archive/org.apache.camel/apache-camel/2.8-SNAPSHOT/apache-camel-2.8-SNAPSHOT.zip
[JENKINS] Archiving <https://builds.apache.org/job/Camel/ws/camel-trunk/apache-camel/target/apache-camel-2.8-SNAPSHOT-src.zip>
to /home/hudson/hudson/jobs/Camel/modules/org.apache.camel$apache-camel/builds/2011-07-04_02-45-42/archive/org.apache.camel/apache-camel/2.8-SNAPSHOT/apache-camel-2.8-SNAPSHOT-src.zip
[INFO] 
[INFO] 
[INFO] ------------------------------------------------------------------------
[INFO] Reactor Summary:
[INFO] ------------------------------------------------------------------------
[INFO] Camel ................................................. SUCCESS [10.836s]
[INFO] Apache :: Camel Buildtools ............................ SUCCESS [3.150s]
[INFO] Camel :: Parent ....................................... SUCCESS [1.534s]
[INFO] Camel :: Core ......................................... SUCCESS [23.678s]
[INFO] Camel :: Core XML ..................................... SUCCESS [2.506s]
[INFO] Camel :: Core OSGi .................................... SUCCESS [2.977s]
[INFO] Camel :: Spring ....................................... SUCCESS [13.531s]
[INFO] Camel :: Test ......................................... SUCCESS [2.866s]
[INFO] Camel :: TestNG ....................................... SUCCESS [2.441s]
[INFO] Camel :: Blueprint .................................... SUCCESS [6.304s]
[INFO] Camel :: JUEL ......................................... SUCCESS [2.620s]
[INFO] Camel :: BAM .......................................... SUCCESS [3.564s]
[INFO] Camel :: Groovy ....................................... SUCCESS [2.852s]
[INFO] Camel :: JXPath ....................................... SUCCESS [1.992s]
[INFO] Camel :: Velocity ..................................... SUCCESS [2.637s]
[INFO] Camel :: Scala ........................................ SUCCESS [31.294s]
[INFO] Camel :: HTTP ......................................... SUCCESS [3.013s]
[INFO] Camel :: HTTP4 (HttpClient 4.x) ....................... SUCCESS [3.100s]
[INFO] Camel :: Jetty ........................................ SUCCESS [3.990s]
[INFO] Camel :: CXF :: Transport ............................. SUCCESS [10.494s]
[INFO] Camel :: CXF .......................................... SUCCESS [10.204s]
[INFO] Camel :: Components ................................... SUCCESS [0.318s]
[INFO] Camel :: Web .......................................... FAILED [3.832s]
[INFO] Camel :: Web :: Standalone ............................ SKIPPED (dependency build failed
or was skipped)
[INFO] Camel :: JMS .......................................... SUCCESS [4.972s]
[INFO] Camel :: AHC .......................................... SUCCESS [3.654s]
[INFO] Camel :: AMQP ......................................... SUCCESS [4.395s]
[INFO] Camel :: APNS ......................................... SUCCESS [2.595s]
[INFO] Camel :: Atom ......................................... SUCCESS [2.473s]
[INFO] Camel :: AWS .......................................... SUCCESS [3.169s]
[INFO] Camel :: Bean validator ............................... SUCCESS [2.670s]
[INFO] Camel :: Bindy ........................................ SUCCESS [3.558s]
[INFO] Camel :: Cache ........................................ SUCCESS [2.841s]
[INFO] Camel :: Castor ....................................... SUCCESS [2.272s]
[INFO] Camel :: Stream ....................................... SUCCESS [2.261s]
[INFO] Camel :: Cometd ....................................... SUCCESS [2.641s]
[INFO] Camel :: Context ...................................... SUCCESS [2.042s]
[INFO] Camel :: Crypto ....................................... SUCCESS [3.210s]
[INFO] Camel :: CSV .......................................... SUCCESS [1.973s]
[INFO] Camel :: DNS .......................................... SUCCESS [2.292s]
[INFO] Camel :: Dozer ........................................ SUCCESS [1.941s]
[INFO] Camel :: Eclipse ...................................... SUCCESS [1.212s]
[INFO] Camel :: EJB .......................................... SUCCESS [2.776s]
[INFO] Camel :: Event Admin .................................. SUCCESS [1.178s]
[INFO] Camel :: Exec ......................................... SUCCESS [3.064s]
[INFO] Camel :: FlatPack ..................................... SUCCESS [2.401s]
[INFO] Camel :: Freemarker ................................... SUCCESS [2.115s]
[INFO] Camel :: FTP .......................................... SUCCESS [4.373s]
[INFO] Camel :: Servlet ...................................... SUCCESS [2.498s]
[INFO] Camel :: GAE .......................................... SUCCESS [3.531s]
[INFO] Camel :: Guice ........................................ SUCCESS [2.293s]
[INFO] Camel :: HawtDB ....................................... SUCCESS [2.363s]
[INFO] Camel :: HazelCast .................................... SUCCESS [2.660s]
[INFO] Camel :: HDFS ......................................... SUCCESS [4.501s]
[INFO] Camel :: MINA ......................................... SUCCESS [2.848s]
[INFO] Camel :: HL7 .......................................... SUCCESS [2.916s]
[INFO] Camel :: iBatis ....................................... SUCCESS [2.287s]
[INFO] Camel :: IRC .......................................... SUCCESS [2.526s]
[INFO] Camel :: Jackson ...................................... SUCCESS [1.987s]
[INFO] Camel :: Javaspace .................................... SUCCESS [2.572s]
[INFO] Camel :: Spring JavaConfig ............................ SUCCESS [2.098s]
[INFO] Camel :: JAXB ......................................... SUCCESS [3.011s]
[INFO] Camel :: Jasypt ....................................... SUCCESS [2.773s]
[INFO] Camel :: JCR .......................................... SUCCESS [2.783s]
[INFO] Camel :: JDBC ......................................... SUCCESS [2.187s]
[INFO] Camel :: Jibx ......................................... SUCCESS [8.922s]
[INFO] Camel :: Jing ......................................... SUCCESS [2.215s]
[INFO] Camel :: JMX .......................................... SUCCESS [4.064s]
[INFO] Camel :: JoSQL ........................................ SUCCESS [2.237s]
[INFO] Camel :: JPA .......................................... SUCCESS [4.166s]
[INFO] Camel :: Java Toolbox for AS/400 ...................... SUCCESS [2.409s]
[INFO] Camel :: Kestrel ...................................... SUCCESS [2.021s]
[INFO] Camel :: LDAP ......................................... SUCCESS [3.189s]
[INFO] Camel :: Lucene ....................................... SUCCESS [2.339s]
[INFO] Camel :: Mail ......................................... SUCCESS [2.739s]
[INFO] Camel :: MSV .......................................... SUCCESS [2.339s]
[INFO] Camel :: MVEL ......................................... SUCCESS [2.940s]
[INFO] Camel :: MyBatis ...................................... SUCCESS [2.221s]
[INFO] Camel :: Nagios ....................................... SUCCESS [2.104s]
[INFO] Camel :: Netty ........................................ SUCCESS [3.515s]
[INFO] Camel :: OGNL ......................................... SUCCESS [2.186s]
[INFO] Camel :: Pax Logging .................................. SUCCESS [1.169s]
[INFO] Camel :: Printer ...................................... SUCCESS [2.234s]
[INFO] Camel :: Protobuf ..................................... SUCCESS [2.296s]
[INFO] Camel :: Quartz ....................................... SUCCESS [2.676s]
[INFO] Camel :: QuickFIX/J ................................... SUCCESS [3.312s]
[INFO] Camel :: Restlet ...................................... SUCCESS [2.423s]
[INFO] Camel :: RMI .......................................... SUCCESS [2.080s]
[INFO] Camel :: Routebox ..................................... SUCCESS [2.246s]
[INFO] Camel :: Ruby ......................................... SUCCESS [2.869s]
[INFO] Camel :: RSS .......................................... SUCCESS [3.746s]
[INFO] Camel :: SAXON ........................................ SUCCESS [2.617s]
[INFO] Camel :: Script ....................................... SUCCESS [2.335s]
[INFO] Camel :: Shiro ........................................ SUCCESS [1.899s]
[INFO] Camel :: SIP .......................................... SUCCESS [2.176s]
[INFO] Camel :: SMPP ......................................... SUCCESS [2.789s]
[INFO] Camel :: SNMP ......................................... SUCCESS [2.128s]
[INFO] Camel :: SOAP ......................................... SUCCESS [6.949s]
[INFO] Camel :: Spring Integration ........................... SUCCESS [2.351s]
[INFO] Camel :: Spring Security .............................. SUCCESS [2.325s]
[INFO] Camel :: Spring Web Services .......................... SUCCESS [3.205s]
[INFO] Camel :: SQL .......................................... SUCCESS [2.717s]
[INFO] Camel :: StringTemplate ............................... SUCCESS [2.027s]
[INFO] Camel :: Syslog ....................................... SUCCESS [2.416s]
[INFO] Camel :: TagSoup ...................................... SUCCESS [2.054s]
[INFO] Camel :: XMLBeans ..................................... SUCCESS [2.217s]
[INFO] Camel :: XML Security ................................. SUCCESS [3.033s]
[INFO] Camel :: XMPP ......................................... SUCCESS [2.227s]
[INFO] Camel :: XStream ...................................... SUCCESS [2.176s]
[INFO] Camel :: Platforms .................................... SUCCESS [0.289s]
[INFO] Camel :: Platforms :: Apache Karaf .................... SUCCESS [0.258s]
[INFO] Camel :: Platforms :: Apache Karaf :: Commands ........ SUCCESS [1.566s]
[INFO] Camel :: Platforms :: Apache Karaf :: Features ........ SUCCESS [0.554s]
[INFO] Camel :: Maven Plugins ................................ SUCCESS [0.531s]
[INFO] Camel :: Maven Camel Plugin ........................... SUCCESS [3.254s]
[INFO] Camel :: Maven Guice Plugin ........................... SUCCESS [2.158s]
[INFO] Camel :: Html to Pdf Plugin ........................... SUCCESS [1.613s]
[INFO] Camel :: Archetypes ................................... SUCCESS [0.249s]
[INFO] Camel :: Archetypes :: Camel Router with ActiveMQ ..... SUCCESS [1.193s]
[INFO] Camel :: Archetypes :: Blueprint (OSGi) Based Router .. SUCCESS [0.458s]
[INFO] Camel :: Archetypes :: Component ...................... SUCCESS [0.572s]
[INFO] Camel :: Archetypes :: Router ......................... SUCCESS [0.504s]
[INFO] Camel :: Archetypes :: Scala Router ................... SUCCESS [0.350s]
[INFO] Camel :: Archetypes :: Spring XML Based Router ........ SUCCESS [0.750s]
[INFO] Camel :: Archetypes :: Spring DM (OSGi) Based Router .. SUCCESS [0.458s]
[INFO] Camel :: Archetypes :: Camel Routes WAR ............... SUCCESS [0.560s]
[INFO] Camel :: Archetypes :: Camel Router with web console .. SUCCESS [0.347s]
[INFO] Camel :: Manual ....................................... SUCCESS [3.574s]
[INFO] Camel :: Tooling ...................................... SUCCESS [0.256s]
[INFO] Camel :: Tests Bundles ................................ SUCCESS [1.665s]
[INFO] Camel :: Test Bundles: mock-javamail-1.7 .............. SUCCESS [1.539s]
[INFO] Camel :: Integration Tests :: Standalone .............. SUCCESS [1.621s]
[INFO] Camel :: Integration Tests ............................ SUCCESS [16.209s]
[INFO] Camel :: Partial Classpath Tests ...................... SUCCESS [1.870s]
[INFO] Camel :: OSGi Integration Tests ....................... SUCCESS [19.024s]
[INFO] Camel :: Tests ........................................ SUCCESS [0.305s]
[INFO] Camel :: Examples ..................................... SUCCESS [0.513s]
[INFO] Camel :: Example :: Aggregate ......................... SUCCESS [1.280s]
[INFO] Camel :: Example :: Axis .............................. SUCCESS [4.907s]
[INFO] Camel :: Example :: BAM ............................... SUCCESS [1.636s]
[INFO] Camel :: Example :: Cafe .............................. SUCCESS [2.136s]
[INFO] Camel :: Example :: CXF ............................... SUCCESS [6.349s]
[INFO] Camel :: Example :: CXF :: Blueprint .................. SUCCESS [5.054s]
[INFO] Camel :: Example :: CXF :: OSGI ....................... SUCCESS [5.374s]
[INFO] Camel :: Example :: CXF Proxy ......................... SUCCESS [5.476s]
[INFO] Camel :: Example :: CXF Tomcat ........................ SUCCESS [3.128s]
[INFO] Camel :: Example :: Docs .............................. SUCCESS [2.191s]
[INFO] Camel :: Example :: ETL ............................... SUCCESS [6.054s]
[INFO] Camel :: Example :: GAE ............................... SUCCESS [7.700s]
[INFO] Camel :: Example :: GAuth ............................. SUCCESS [6.217s]
[INFO] Camel :: Example :: Guice :: JMS ...................... SUCCESS [1.992s]
[INFO] Camel :: Example :: JMX ............................... SUCCESS [1.787s]
[INFO] Camel :: Example :: JMS-File .......................... SUCCESS [1.945s]
[INFO] Camel :: Example :: Loadbalancer camel-mina ........... SUCCESS [1.707s]
[INFO] Camel :: Example :: Loan-Broker ....................... SUCCESS [2.801s]
[INFO] Camel :: Example :: Management ........................ SUCCESS [1.828s]
[INFO] Camel :: Example :: OSGi .............................. SUCCESS [1.276s]
[INFO] Camel :: Example :: OSGi RMI .......................... SUCCESS [1.934s]
[INFO] Camel :: Example :: POJO Messaging .................... SUCCESS [2.009s]
[INFO] Camel :: Example :: Report Incident ................... SUCCESS [7.969s]
[INFO] Camel :: Example :: Report Incident :: WS-Security .... SUCCESS [6.099s]
[INFO] Camel :: Example :: Route :: Throttling ............... SUCCESS [1.305s]
[INFO] Camel :: Example :: Servlet Tomcat .................... SUCCESS [1.674s]
[INFO] Camel :: Example :: Simple Jira Bot ................... SUCCESS [0.563s]
[INFO] Camel :: Example :: Simple Jira Bot :: Java DSL ....... SUCCESS [1.203s]
[INFO] Camel :: Example :: Simple Jira Bot :: XML Configuration  SUCCESS [0.831s]
[INFO] Camel :: Example :: Spring ............................ SUCCESS [1.981s]
[INFO] Camel :: Example :: Spring :: JavaConfig .............. SUCCESS [2.125s]
[INFO] Camel :: Example :: Spring :: JMS ..................... SUCCESS [2.105s]
[INFO] Camel :: Example :: Spring Web Services ............... SUCCESS [2.680s]
[INFO] Camel :: Example :: Spring :: XQuery .................. SUCCESS [0.684s]
[INFO] Camel :: Example :: Spring Security ................... SUCCESS [2.022s]
[INFO] Camel :: Example :: Tracer ............................ SUCCESS [1.395s]
[INFO] Camel :: Assembly ..................................... SUCCESS [3:18.148s]
[INFO] ------------------------------------------------------------------------
[INFO] Error for project: Camel :: Web (during install)
[INFO] ------------------------------------------------------------------------
[INFO] Compilation failure
error: error reading <https://builds.apache.org/job/Camel/ws/.repository/org/codehaus/jackson/jackson-xc/1.7.1/jackson-xc-1.7.1.jar;>
error in opening zip file

[INFO] ------------------------------------------------------------------------
[INFO] Trace
org.apache.maven.BuildFailureException: Compilation failure
error: error reading <https://builds.apache.org/job/Camel/ws/.repository/org/codehaus/jackson/jackson-xc/1.7.1/jackson-xc-1.7.1.jar;>
error in opening zip file

	at org.apache.maven.lifecycle.DefaultLifecycleExecutor.executeGoals(DefaultLifecycleExecutor.java:715)
	at org.apache.maven.lifecycle.DefaultLifecycleExecutor.executeGoalWithLifecycle(DefaultLifecycleExecutor.java:556)
	at org.apache.maven.lifecycle.DefaultLifecycleExecutor.executeGoal(DefaultLifecycleExecutor.java:535)
	at org.apache.maven.lifecycle.DefaultLifecycleExecutor.executeGoalAndHandleFailures(DefaultLifecycleExecutor.java:387)
	at org.apache.maven.lifecycle.DefaultLifecycleExecutor.executeTaskSegments(DefaultLifecycleExecutor.java:348)
	at org.apache.maven.lifecycle.DefaultLifecycleExecutor.execute(DefaultLifecycleExecutor.java:180)
	at org.apache.maven.lifecycle.LifecycleExecutorInterceptor.execute(LifecycleExecutorInterceptor.java:65)
	at org.apache.maven.DefaultMaven.doExecute(DefaultMaven.java:328)
	at org.apache.maven.DefaultMaven.execute(DefaultMaven.java:138)
	at org.apache.maven.cli.MavenCli.main(MavenCli.java:362)
	at sun.reflect.NativeMethodAccessorImpl.invoke0(Native Method)
	at sun.reflect.NativeMethodAccessorImpl.invoke(NativeMethodAccessorImpl.java:39)
	at sun.reflect.DelegatingMethodAccessorImpl.invoke(DelegatingMethodAccessorImpl.java:25)
	at java.lang.reflect.Method.invoke(Method.java:597)
	at org.codehaus.classworlds.Launcher.launchEnhanced(Launcher.java:315)
	at org.codehaus.classworlds.Launcher.launch(Launcher.java:255)
	at hudson.maven.agent.Main.launch(Main.java:185)
	at hudson.maven.MavenBuilder.call(MavenBuilder.java:164)
	at hudson.maven.MavenModuleSetBuild$Builder.call(MavenModuleSetBuild.java:987)
	at hudson.maven.MavenModuleSetBuild$Builder.call(MavenModuleSetBuild.java:918)
	at hudson.remoting.UserRequest.perform(UserRequest.java:118)
	at hudson.remoting.UserRequest.perform(UserRequest.java:48)
	at hudson.remoting.Request$2.run(Request.java:270)
	at java.util.concurrent.Executors$RunnableAdapter.call(Executors.java:441)
	at java.util.concurrent.FutureTask$Sync.innerRun(FutureTask.java:303)
	at java.util.concurrent.FutureTask.run(FutureTask.java:138)
	at java.util.concurrent.ThreadPoolExecutor$Worker.runTask(ThreadPoolExecutor.java:886)
	at java.util.concurrent.ThreadPoolExecutor$Worker.run(ThreadPoolExecutor.java:908)
	at java.lang.Thread.run(Thread.java:619)
Caused by: org.apache.maven.plugin.CompilationFailureException: Compilation failure
error: error reading <https://builds.apache.org/job/Camel/ws/.repository/org/codehaus/jackson/jackson-xc/1.7.1/jackson-xc-1.7.1.jar;>
error in opening zip file

	at org.apache.maven.plugin.AbstractCompilerMojo.execute(AbstractCompilerMojo.java:656)
	at org.apache.maven.plugin.CompilerMojo.execute(CompilerMojo.java:128)
	at org.apache.maven.plugin.DefaultPluginManager.executeMojo(DefaultPluginManager.java:490)
	at hudson.maven.agent.PluginManagerInterceptor.executeMojo(PluginManagerInterceptor.java:182)
	at org.apache.maven.lifecycle.DefaultLifecycleExecutor.executeGoals(DefaultLifecycleExecutor.java:694)
	... 28 more
[INFO] ------------------------------------------------------------------------
[INFO] BUILD ERRORS
[INFO] ------------------------------------------------------------------------
[INFO] Total time: 28 minutes 18 seconds
[INFO] Finished at: Mon Jul 04 03:14:29 UTC 2011
[INFO] Final Memory: 230M/636M
[INFO] ------------------------------------------------------------------------
Sending e-mails to: dev@camel.apache.org
channel stopped
[locks-and-latches] Releasing all the locks
[locks-and-latches] All the locks released


Mime
View raw message