camel-dev mailing list archives

Site index · List index
Message view « Date » · « Thread »
Top « Date » · « Thread »
From Apache Jenkins Server <jenk...@builds.apache.org>
Subject Build failed in Jenkins: Camel #1269
Date Sun, 10 Jul 2011 08:36:25 GMT
See <https://builds.apache.org/job/Camel/1269/changes>

Changes:

[davsclaus] CAMEL-4201: Added time it took to execute the test method being logged, when using
the test kits.

[davsclaus] Fixed test that uses topics and may rarely fail otherwise.

[davsclaus] Removed test that causes trouble on CI servers

[davsclaus] CAMEL-4199: Added not() to ValueBuilder.

[jbonofre] [CAMEL-2197] Use released version of ServiceMix Hadoop bundle.

[davsclaus] Upgrade to jersey 1.8 in camel-web

[janstey] add note about updating CXF version range in Karaf features file

[dkulp] [CAMEL-4195] Remove commons-pool from cxf feature
Tighten cxf version range

[davsclaus] Added unit test based on user forum issue.

[davsclaus] CAMEL-4197: scheduled route policy should not start quartz scheduler itself, but
rely on QuartzComponent doing that. Polished logging.

[davsclaus] CAMEL-4176: Fixed fallback to use http4 or http4s for proxy scheme when configured
as property on CamelContext properties.

[davsclaus] CAMEL-4197: scheduled route policy should not start quartz scheduler itself, but
rely on QuartzComponent doing that. Polished unit tests.

[davsclaus] CAMEL-4196: scheduled route policy should fail if misconfigured instead of WARN
logging.

[ningjiang] CAMEL-4195 use servicemix commons-pool bundle in camel-cxf feature

[davsclaus] Use final modifier if possible

[davsclaus] CAMEL-4194: jmx topic endpoints should be non-singleton.

[ningjiang] Fixed the CS error of MailConsumer

[davsclaus] Some osgi tests cannot run anymore.

------------------------------------------
[...truncated 9256 lines...]
[INFO] Checking legal files in: apache-camel-2.8-SNAPSHOT-src.zip
[INFO] [install:install {execution: default-install}]
[INFO] Installing <https://builds.apache.org/job/Camel/ws/camel-trunk/apache-camel/pom.xml>
to <https://builds.apache.org/job/Camel/ws/.repository/org/apache/camel/apache-camel/2.8-SNAPSHOT/apache-camel-2.8-SNAPSHOT.pom>
[INFO] Installing <https://builds.apache.org/job/Camel/ws/camel-trunk/apache-camel/target/apache-camel-2.8-SNAPSHOT.tar.gz>
to <https://builds.apache.org/job/Camel/ws/.repository/org/apache/camel/apache-camel/2.8-SNAPSHOT/apache-camel-2.8-SNAPSHOT.tar.gz>
[INFO] Installing <https://builds.apache.org/job/Camel/ws/camel-trunk/apache-camel/target/apache-camel-2.8-SNAPSHOT.zip>
to <https://builds.apache.org/job/Camel/ws/.repository/org/apache/camel/apache-camel/2.8-SNAPSHOT/apache-camel-2.8-SNAPSHOT.zip>
[INFO] Installing <https://builds.apache.org/job/Camel/ws/camel-trunk/apache-camel/target/apache-camel-2.8-SNAPSHOT-src.zip>
to <https://builds.apache.org/job/Camel/ws/.repository/org/apache/camel/apache-camel/2.8-SNAPSHOT/apache-camel-2.8-SNAPSHOT-src.zip>
[JENKINS] Archiving <https://builds.apache.org/job/Camel/ws/camel-trunk/apache-camel/pom.xml>
to /home/hudson/hudson/jobs/Camel/modules/org.apache.camel$apache-camel/builds/2011-07-10_08-09-16/archive/org.apache.camel/apache-camel/2.8-SNAPSHOT/apache-camel-2.8-SNAPSHOT.pom
[JENKINS] Archiving <https://builds.apache.org/job/Camel/ws/camel-trunk/apache-camel/target/apache-camel-2.8-SNAPSHOT.tar.gz>
to /home/hudson/hudson/jobs/Camel/modules/org.apache.camel$apache-camel/builds/2011-07-10_08-09-16/archive/org.apache.camel/apache-camel/2.8-SNAPSHOT/apache-camel-2.8-SNAPSHOT.tar.gz
[JENKINS] Archiving <https://builds.apache.org/job/Camel/ws/camel-trunk/apache-camel/target/apache-camel-2.8-SNAPSHOT.zip>
to /home/hudson/hudson/jobs/Camel/modules/org.apache.camel$apache-camel/builds/2011-07-10_08-09-16/archive/org.apache.camel/apache-camel/2.8-SNAPSHOT/apache-camel-2.8-SNAPSHOT.zip
[JENKINS] Archiving <https://builds.apache.org/job/Camel/ws/camel-trunk/apache-camel/target/apache-camel-2.8-SNAPSHOT-src.zip>
to /home/hudson/hudson/jobs/Camel/modules/org.apache.camel$apache-camel/builds/2011-07-10_08-09-16/archive/org.apache.camel/apache-camel/2.8-SNAPSHOT/apache-camel-2.8-SNAPSHOT-src.zip
[INFO] 
[INFO] 
[INFO] ------------------------------------------------------------------------
[INFO] Reactor Summary:
[INFO] ------------------------------------------------------------------------
[INFO] Camel ................................................. SUCCESS [8.940s]
[INFO] Apache :: Camel Buildtools ............................ SUCCESS [2.520s]
[INFO] Camel :: Parent ....................................... SUCCESS [1.657s]
[INFO] Camel :: Core ......................................... SUCCESS [23.320s]
[INFO] Camel :: Core XML ..................................... SUCCESS [2.452s]
[INFO] Camel :: Core OSGi .................................... SUCCESS [2.853s]
[INFO] Camel :: Spring ....................................... SUCCESS [11.917s]
[INFO] Camel :: Test ......................................... SUCCESS [2.446s]
[INFO] Camel :: TestNG ....................................... SUCCESS [2.416s]
[INFO] Camel :: Blueprint .................................... SUCCESS [4.580s]
[INFO] Camel :: JUEL ......................................... SUCCESS [2.464s]
[INFO] Camel :: BAM .......................................... SUCCESS [3.332s]
[INFO] Camel :: Groovy ....................................... SUCCESS [2.842s]
[INFO] Camel :: JXPath ....................................... SUCCESS [2.035s]
[INFO] Camel :: Velocity ..................................... SUCCESS [2.510s]
[INFO] Camel :: Scala ........................................ SUCCESS [30.951s]
[INFO] Camel :: HTTP ......................................... SUCCESS [2.856s]
[INFO] Camel :: HTTP4 (HttpClient 4.x) ....................... SUCCESS [2.906s]
[INFO] Camel :: Jetty ........................................ SUCCESS [4.068s]
[INFO] Camel :: CXF :: Transport ............................. SUCCESS [9.967s]
[INFO] Camel :: CXF .......................................... SUCCESS [10.078s]
[INFO] Camel :: Components ................................... SUCCESS [0.282s]
[INFO] Camel :: Web .......................................... FAILED [6.579s]
[INFO] Camel :: Web :: Standalone ............................ SKIPPED (dependency build failed
or was skipped)
[INFO] Camel :: JMS .......................................... SUCCESS [5.109s]
[INFO] Camel :: AHC .......................................... SUCCESS [2.807s]
[INFO] Camel :: AMQP ......................................... SUCCESS [4.011s]
[INFO] Camel :: APNS ......................................... SUCCESS [2.538s]
[INFO] Camel :: Atom ......................................... SUCCESS [2.567s]
[INFO] Camel :: AWS .......................................... SUCCESS [4.267s]
[INFO] Camel :: Bean validator ............................... SUCCESS [2.570s]
[INFO] Camel :: Bindy ........................................ SUCCESS [3.613s]
[INFO] Camel :: Cache ........................................ SUCCESS [2.735s]
[INFO] Camel :: Castor ....................................... SUCCESS [3.143s]
[INFO] Camel :: Stream ....................................... SUCCESS [2.065s]
[INFO] Camel :: Cometd ....................................... SUCCESS [2.473s]
[INFO] Camel :: Context ...................................... SUCCESS [2.060s]
[INFO] Camel :: Crypto ....................................... SUCCESS [2.871s]
[INFO] Camel :: CSV .......................................... SUCCESS [1.965s]
[INFO] Camel :: DNS .......................................... SUCCESS [2.417s]
[INFO] Camel :: Dozer ........................................ SUCCESS [2.347s]
[INFO] Camel :: Eclipse ...................................... SUCCESS [1.165s]
[INFO] Camel :: EJB .......................................... SUCCESS [2.522s]
[INFO] Camel :: Event Admin .................................. SUCCESS [1.976s]
[INFO] Camel :: Exec ......................................... SUCCESS [2.384s]
[INFO] Camel :: FlatPack ..................................... SUCCESS [2.328s]
[INFO] Camel :: Freemarker ................................... SUCCESS [2.180s]
[INFO] Camel :: FTP .......................................... SUCCESS [4.324s]
[INFO] Camel :: Servlet ...................................... SUCCESS [2.454s]
[INFO] Camel :: GAE .......................................... SUCCESS [4.070s]
[INFO] Camel :: Guice ........................................ SUCCESS [2.215s]
[INFO] Camel :: HawtDB ....................................... SUCCESS [2.247s]
[INFO] Camel :: HazelCast .................................... SUCCESS [3.502s]
[INFO] Camel :: HDFS ......................................... SUCCESS [3.376s]
[INFO] Camel :: MINA ......................................... SUCCESS [2.784s]
[INFO] Camel :: HL7 .......................................... SUCCESS [2.886s]
[INFO] Camel :: iBatis ....................................... SUCCESS [2.209s]
[INFO] Camel :: IRC .......................................... SUCCESS [2.339s]
[INFO] Camel :: Jackson ...................................... SUCCESS [2.066s]
[INFO] Camel :: Javaspace .................................... SUCCESS [2.656s]
[INFO] Camel :: Spring JavaConfig ............................ SUCCESS [2.379s]
[INFO] Camel :: JAXB ......................................... SUCCESS [3.702s]
[INFO] Camel :: Jasypt ....................................... SUCCESS [2.404s]
[INFO] Camel :: JCR .......................................... SUCCESS [2.563s]
[INFO] Camel :: JDBC ......................................... SUCCESS [2.113s]
[INFO] Camel :: Jibx ......................................... SUCCESS [9.092s]
[INFO] Camel :: Jing ......................................... SUCCESS [2.228s]
[INFO] Camel :: JMX .......................................... SUCCESS [3.926s]
[INFO] Camel :: JoSQL ........................................ SUCCESS [2.563s]
[INFO] Camel :: JPA .......................................... SUCCESS [3.962s]
[INFO] Camel :: Java Toolbox for AS/400 ...................... SUCCESS [2.446s]
[INFO] Camel :: Kestrel ...................................... SUCCESS [2.154s]
[INFO] Camel :: LDAP ......................................... SUCCESS [3.060s]
[INFO] Camel :: Lucene ....................................... SUCCESS [2.310s]
[INFO] Camel :: Mail ......................................... SUCCESS [2.772s]
[INFO] Camel :: MSV .......................................... SUCCESS [2.938s]
[INFO] Camel :: MVEL ......................................... SUCCESS [1.857s]
[INFO] Camel :: MyBatis ...................................... SUCCESS [3.048s]
[INFO] Camel :: Nagios ....................................... SUCCESS [1.978s]
[INFO] Camel :: Netty ........................................ SUCCESS [2.787s]
[INFO] Camel :: OGNL ......................................... SUCCESS [2.306s]
[INFO] Camel :: Pax Logging .................................. SUCCESS [1.211s]
[INFO] Camel :: Printer ...................................... SUCCESS [2.036s]
[INFO] Camel :: Protobuf ..................................... SUCCESS [2.313s]
[INFO] Camel :: Quartz ....................................... SUCCESS [2.590s]
[INFO] Camel :: QuickFIX/J ................................... SUCCESS [3.124s]
[INFO] Camel :: Restlet ...................................... SUCCESS [2.505s]
[INFO] Camel :: RMI .......................................... SUCCESS [2.350s]
[INFO] Camel :: Routebox ..................................... SUCCESS [2.266s]
[INFO] Camel :: Ruby ......................................... SUCCESS [2.454s]
[INFO] Camel :: RSS .......................................... SUCCESS [2.824s]
[INFO] Camel :: SAXON ........................................ SUCCESS [2.659s]
[INFO] Camel :: Script ....................................... SUCCESS [2.390s]
[INFO] Camel :: Shiro ........................................ SUCCESS [1.940s]
[INFO] Camel :: SIP .......................................... SUCCESS [2.143s]
[INFO] Camel :: SMPP ......................................... SUCCESS [2.671s]
[INFO] Camel :: SNMP ......................................... SUCCESS [2.194s]
[INFO] Camel :: SOAP ......................................... SUCCESS [7.245s]
[INFO] Camel :: Spring Integration ........................... SUCCESS [2.403s]
[INFO] Camel :: Spring Security .............................. SUCCESS [2.450s]
[INFO] Camel :: Spring Web Services .......................... SUCCESS [3.055s]
[INFO] Camel :: SQL .......................................... SUCCESS [2.683s]
[INFO] Camel :: StringTemplate ............................... SUCCESS [2.030s]
[INFO] Camel :: Syslog ....................................... SUCCESS [2.491s]
[INFO] Camel :: TagSoup ...................................... SUCCESS [1.984s]
[INFO] Camel :: XMLBeans ..................................... SUCCESS [2.996s]
[INFO] Camel :: XML Security ................................. SUCCESS [2.400s]
[INFO] Camel :: XMPP ......................................... SUCCESS [2.313s]
[INFO] Camel :: XStream ...................................... SUCCESS [2.197s]
[INFO] Camel :: Platforms .................................... SUCCESS [0.335s]
[INFO] Camel :: Platforms :: Apache Karaf .................... SUCCESS [0.266s]
[INFO] Camel :: Platforms :: Apache Karaf :: Commands ........ SUCCESS [1.636s]
[INFO] Camel :: Platforms :: Apache Karaf :: Features ........ SUCCESS [0.539s]
[INFO] Camel :: Maven Plugins ................................ SUCCESS [0.584s]
[INFO] Camel :: Maven Camel Plugin ........................... SUCCESS [3.148s]
[INFO] Camel :: Maven Guice Plugin ........................... SUCCESS [2.137s]
[INFO] Camel :: Html to Pdf Plugin ........................... SUCCESS [1.778s]
[INFO] Camel :: Archetypes ................................... SUCCESS [0.307s]
[INFO] Camel :: Archetypes :: Camel Router with ActiveMQ ..... SUCCESS [1.886s]
[INFO] Camel :: Archetypes :: Blueprint (OSGi) Based Router .. SUCCESS [0.509s]
[INFO] Camel :: Archetypes :: Component ...................... SUCCESS [0.650s]
[INFO] Camel :: Archetypes :: Router ......................... SUCCESS [0.464s]
[INFO] Camel :: Archetypes :: Scala Router ................... SUCCESS [0.393s]
[INFO] Camel :: Archetypes :: Spring XML Based Router ........ SUCCESS [0.364s]
[INFO] Camel :: Archetypes :: Spring DM (OSGi) Based Router .. SUCCESS [0.452s]
[INFO] Camel :: Archetypes :: Camel Routes WAR ............... SUCCESS [0.480s]
[INFO] Camel :: Archetypes :: Camel Router with web console .. SUCCESS [0.383s]
[INFO] Camel :: Manual ....................................... SUCCESS [2.872s]
[INFO] Camel :: Tooling ...................................... SUCCESS [0.244s]
[INFO] Camel :: Tests Bundles ................................ SUCCESS [2.143s]
[INFO] Camel :: Test Bundles: mock-javamail-1.7 .............. SUCCESS [1.565s]
[INFO] Camel :: Integration Tests :: Standalone .............. SUCCESS [1.629s]
[INFO] Camel :: Integration Tests ............................ SUCCESS [17.298s]
[INFO] Camel :: Partial Classpath Tests ...................... SUCCESS [1.985s]
[INFO] Camel :: OSGi Integration Tests ....................... SUCCESS [18.927s]
[INFO] Camel :: Tests ........................................ SUCCESS [0.272s]
[INFO] Camel :: Examples ..................................... SUCCESS [0.252s]
[INFO] Camel :: Example :: Aggregate ......................... SUCCESS [1.306s]
[INFO] Camel :: Example :: Axis .............................. SUCCESS [4.969s]
[INFO] Camel :: Example :: BAM ............................... SUCCESS [1.795s]
[INFO] Camel :: Example :: Cafe .............................. SUCCESS [2.220s]
[INFO] Camel :: Example :: CXF ............................... SUCCESS [6.384s]
[INFO] Camel :: Example :: CXF :: Blueprint .................. SUCCESS [5.111s]
[INFO] Camel :: Example :: CXF :: OSGI ....................... SUCCESS [5.240s]
[INFO] Camel :: Example :: CXF Proxy ......................... SUCCESS [5.338s]
[INFO] Camel :: Example :: CXF Tomcat ........................ SUCCESS [3.245s]
[INFO] Camel :: Example :: Docs .............................. SUCCESS [2.133s]
[INFO] Camel :: Example :: ETL ............................... SUCCESS [5.542s]
[INFO] Camel :: Example :: GAE ............................... SUCCESS [6.442s]
[INFO] Camel :: Example :: GAuth ............................. SUCCESS [7.653s]
[INFO] Camel :: Example :: Guice :: JMS ...................... SUCCESS [2.053s]
[INFO] Camel :: Example :: JMX ............................... SUCCESS [1.425s]
[INFO] Camel :: Example :: JMS-File .......................... SUCCESS [1.986s]
[INFO] Camel :: Example :: Loadbalancer camel-mina ........... SUCCESS [1.541s]
[INFO] Camel :: Example :: Loan-Broker ....................... SUCCESS [2.711s]
[INFO] Camel :: Example :: Management ........................ SUCCESS [1.906s]
[INFO] Camel :: Example :: OSGi .............................. SUCCESS [1.318s]
[INFO] Camel :: Example :: OSGi RMI .......................... SUCCESS [1.970s]
[INFO] Camel :: Example :: POJO Messaging .................... SUCCESS [2.014s]
[INFO] Camel :: Example :: Report Incident ................... SUCCESS [8.556s]
[INFO] Camel :: Example :: Report Incident :: WS-Security .... SUCCESS [5.900s]
[INFO] Camel :: Example :: Route :: Throttling ............... SUCCESS [1.341s]
[INFO] Camel :: Example :: Servlet Tomcat .................... SUCCESS [1.641s]
[INFO] Camel :: Example :: Simple Jira Bot ................... SUCCESS [0.551s]
[INFO] Camel :: Example :: Simple Jira Bot :: Java DSL ....... SUCCESS [1.316s]
[INFO] Camel :: Example :: Simple Jira Bot :: XML Configuration  SUCCESS [0.822s]
[INFO] Camel :: Example :: Spring ............................ SUCCESS [1.899s]
[INFO] Camel :: Example :: Spring :: JavaConfig .............. SUCCESS [2.097s]
[INFO] Camel :: Example :: Spring :: JMS ..................... SUCCESS [2.124s]
[INFO] Camel :: Example :: Spring Web Services ............... SUCCESS [2.995s]
[INFO] Camel :: Example :: Spring :: XQuery .................. SUCCESS [0.629s]
[INFO] Camel :: Example :: Spring Security ................... SUCCESS [2.194s]
[INFO] Camel :: Example :: Tracer ............................ SUCCESS [1.470s]
[INFO] Camel :: Assembly ..................................... SUCCESS [3:08.513s]
[INFO] ------------------------------------------------------------------------
[INFO] Error for project: Camel :: Web (during install)
[INFO] ------------------------------------------------------------------------
[INFO] Compilation failure
error: error reading <https://builds.apache.org/job/Camel/ws/.repository/org/codehaus/jackson/jackson-xc/1.7.1/jackson-xc-1.7.1.jar;>
error in opening zip file

[INFO] ------------------------------------------------------------------------
[INFO] Trace
org.apache.maven.BuildFailureException: Compilation failure
error: error reading <https://builds.apache.org/job/Camel/ws/.repository/org/codehaus/jackson/jackson-xc/1.7.1/jackson-xc-1.7.1.jar;>
error in opening zip file

	at org.apache.maven.lifecycle.DefaultLifecycleExecutor.executeGoals(DefaultLifecycleExecutor.java:715)
	at org.apache.maven.lifecycle.DefaultLifecycleExecutor.executeGoalWithLifecycle(DefaultLifecycleExecutor.java:556)
	at org.apache.maven.lifecycle.DefaultLifecycleExecutor.executeGoal(DefaultLifecycleExecutor.java:535)
	at org.apache.maven.lifecycle.DefaultLifecycleExecutor.executeGoalAndHandleFailures(DefaultLifecycleExecutor.java:387)
	at org.apache.maven.lifecycle.DefaultLifecycleExecutor.executeTaskSegments(DefaultLifecycleExecutor.java:348)
	at org.apache.maven.lifecycle.DefaultLifecycleExecutor.execute(DefaultLifecycleExecutor.java:180)
	at org.apache.maven.lifecycle.LifecycleExecutorInterceptor.execute(LifecycleExecutorInterceptor.java:65)
	at org.apache.maven.DefaultMaven.doExecute(DefaultMaven.java:328)
	at org.apache.maven.DefaultMaven.execute(DefaultMaven.java:138)
	at org.apache.maven.cli.MavenCli.main(MavenCli.java:362)
	at sun.reflect.NativeMethodAccessorImpl.invoke0(Native Method)
	at sun.reflect.NativeMethodAccessorImpl.invoke(NativeMethodAccessorImpl.java:39)
	at sun.reflect.DelegatingMethodAccessorImpl.invoke(DelegatingMethodAccessorImpl.java:25)
	at java.lang.reflect.Method.invoke(Method.java:597)
	at org.codehaus.classworlds.Launcher.launchEnhanced(Launcher.java:315)
	at org.codehaus.classworlds.Launcher.launch(Launcher.java:255)
	at hudson.maven.agent.Main.launch(Main.java:185)
	at hudson.maven.MavenBuilder.call(MavenBuilder.java:164)
	at hudson.maven.MavenModuleSetBuild$Builder.call(MavenModuleSetBuild.java:987)
	at hudson.maven.MavenModuleSetBuild$Builder.call(MavenModuleSetBuild.java:918)
	at hudson.remoting.UserRequest.perform(UserRequest.java:118)
	at hudson.remoting.UserRequest.perform(UserRequest.java:48)
	at hudson.remoting.Request$2.run(Request.java:270)
	at java.util.concurrent.Executors$RunnableAdapter.call(Executors.java:441)
	at java.util.concurrent.FutureTask$Sync.innerRun(FutureTask.java:303)
	at java.util.concurrent.FutureTask.run(FutureTask.java:138)
	at java.util.concurrent.ThreadPoolExecutor$Worker.runTask(ThreadPoolExecutor.java:886)
	at java.util.concurrent.ThreadPoolExecutor$Worker.run(ThreadPoolExecutor.java:908)
	at java.lang.Thread.run(Thread.java:619)
Caused by: org.apache.maven.plugin.CompilationFailureException: Compilation failure
error: error reading <https://builds.apache.org/job/Camel/ws/.repository/org/codehaus/jackson/jackson-xc/1.7.1/jackson-xc-1.7.1.jar;>
error in opening zip file

	at org.apache.maven.plugin.AbstractCompilerMojo.execute(AbstractCompilerMojo.java:656)
	at org.apache.maven.plugin.CompilerMojo.execute(CompilerMojo.java:128)
	at org.apache.maven.plugin.DefaultPluginManager.executeMojo(DefaultPluginManager.java:490)
	at hudson.maven.agent.PluginManagerInterceptor.executeMojo(PluginManagerInterceptor.java:182)
	at org.apache.maven.lifecycle.DefaultLifecycleExecutor.executeGoals(DefaultLifecycleExecutor.java:694)
	... 28 more
[INFO] ------------------------------------------------------------------------
[INFO] BUILD ERRORS
[INFO] ------------------------------------------------------------------------
[INFO] Total time: 26 minutes 35 seconds
[INFO] Finished at: Sun Jul 10 08:36:21 UTC 2011
[INFO] Final Memory: 234M/656M
[INFO] ------------------------------------------------------------------------
Sending e-mails to: dev@camel.apache.org
channel stopped
[locks-and-latches] Releasing all the locks
[locks-and-latches] All the locks released


Mime
View raw message