camel-dev mailing list archives

Site index · List index
Message view « Date » · « Thread »
Top « Date » · « Thread »
From Apache Jenkins Server <jenk...@builds.apache.org>
Subject Build failed in Jenkins: Camel » Camel :: Web #1276
Date Sun, 17 Jul 2011 02:32:29 GMT
See <https://builds.apache.org/job/Camel/org.apache.camel$camel-web/1276/>

------------------------------------------
[INFO] ------------------------------------------------------------------------
[INFO] Building Camel :: Web
[INFO]    task-segment: [clean, install]
[INFO] ------------------------------------------------------------------------
[INFO] [clean:clean {execution: default-clean}]
[INFO] Deleting <https://builds.apache.org/job/Camel/org.apache.camel$camel-web/ws/target>
[WARNING] POM for 'org.codehaus.jackson:jackson-core-asl:pom:1.7.1:compile' is invalid.

Its dependencies (if any) will NOT be available to the current build.
[WARNING] POM for 'org.codehaus.jackson:jackson-mapper-asl:pom:1.7.1:compile' is invalid.

Its dependencies (if any) will NOT be available to the current build.
[WARNING] POM for 'org.codehaus.jackson:jackson-jaxrs:pom:1.7.1:compile' is invalid.

Its dependencies (if any) will NOT be available to the current build.
[WARNING] POM for 'org.codehaus.jackson:jackson-xc:pom:1.7.1:compile' is invalid.

Its dependencies (if any) will NOT be available to the current build.
[WARNING] POM for 'org.w3c.css:sac:pom:1.3:test' is invalid.

Its dependencies (if any) will NOT be available to the current build.
[INFO] [antrun:run {execution: create-prop}]
[INFO] Executing tasks
     [echo] Maven version: 2.9-SNAPSHOT
     [echo] OSGi version: 2.9.0.SNAPSHOT
    [mkdir] Created dir: <https://builds.apache.org/job/Camel/org.apache.camel$camel-web/ws/target>
[INFO] Executed tasks
[INFO] [properties:read-project-properties {execution: default}]
[INFO] [antrun:run {execution: process-sources}]
[INFO] Executing tasks
     [echo] Copying to code together for the XSD generation
    [mkdir] Created dir: <https://builds.apache.org/job/Camel/org.apache.camel$camel-web/ws/target/schema-src>
    [mkdir] Created dir: <https://builds.apache.org/job/Camel/org.apache.camel$camel-web/ws/target/schema>
     [copy] Copying 5 files to <https://builds.apache.org/job/Camel/org.apache.camel$camel-web/ws/target/schema-src>
     [echo] Generating XSD schema
[schemagen] Generating schema from 5 source files
error: error reading /home/hudson/hudson-slave/workspace/Camel/.repository/org/codehaus/jackson/jackson-xc/1.7.1/jackson-xc-1.7.1.jar;
error in opening zip file
Note: Writing <https://builds.apache.org/job/Camel/org.apache.camel$camel-web/ws/target/schema/camel-web.xsd>
[INFO] Executed tasks
[INFO] [remote-resources:process {execution: default}]
[WARNING] POM for 'org.codehaus.jackson:jackson-core-asl:pom:1.7.1:compile' is invalid.

Its dependencies (if any) will NOT be available to the current build.
[WARNING] POM for 'org.codehaus.jackson:jackson-mapper-asl:pom:1.7.1:compile' is invalid.

Its dependencies (if any) will NOT be available to the current build.
[WARNING] POM for 'org.codehaus.jackson:jackson-jaxrs:pom:1.7.1:compile' is invalid.

Its dependencies (if any) will NOT be available to the current build.
[WARNING] POM for 'org.codehaus.jackson:jackson-xc:pom:1.7.1:compile' is invalid.

Its dependencies (if any) will NOT be available to the current build.
[WARNING] POM for 'org.w3c.css:sac:pom:1.3:test' is invalid.

Its dependencies (if any) will NOT be available to the current build.
[WARNING] Invalid project model for artifact [jackson-core-asl:org.codehaus.jackson:1.7.1].
It will be ignored by the remote resources Mojo.
[WARNING] Invalid project model for artifact [jackson-mapper-asl:org.codehaus.jackson:1.7.1].
It will be ignored by the remote resources Mojo.
[WARNING] Invalid project model for artifact [jackson-xc:org.codehaus.jackson:1.7.1]. It will
be ignored by the remote resources Mojo.
[WARNING] Invalid project model for artifact [jackson-jaxrs:org.codehaus.jackson:1.7.1]. It
will be ignored by the remote resources Mojo.
[INFO] [resources:resources {execution: default-resources}]
[INFO] Using 'UTF-8' encoding to copy filtered resources.
[INFO] Copying 7 resources
[INFO] Copying 3 resources
[INFO] [compiler:compile {execution: default-compile}]
[INFO] Compiling 28 source files to <https://builds.apache.org/job/Camel/org.apache.camel$camel-web/ws/target/classes>
[INFO] -------------------------------------------------------------
[ERROR] COMPILATION ERROR : 
[INFO] -------------------------------------------------------------
[ERROR] error: error reading /home/hudson/hudson-slave/workspace/Camel/.repository/org/codehaus/jackson/jackson-xc/1.7.1/jackson-xc-1.7.1.jar;
error in opening zip file
[INFO] 1 error
[INFO] -------------------------------------------------------------
[JENKINS] Archiving <https://builds.apache.org/job/Camel/org.apache.camel$camel-web/ws/pom.xml>
to /home/hudson/hudson/jobs/Camel/modules/org.apache.camel$camel-web/builds/2011-07-17_02-04-06/archive/org.apache.camel/camel-web/2.9-SNAPSHOT/camel-web-2.9-SNAPSHOT.pom


Mime
View raw message