camel-dev mailing list archives

Site index · List index
Message view « Date » · « Thread »
Top « Date » · « Thread »
From Apache Jenkins Server <jenk...@builds.apache.org>
Subject Build failed in Jenkins: Camel » Camel :: Web #1280
Date Thu, 21 Jul 2011 11:12:05 GMT
See <https://builds.apache.org/job/Camel/org.apache.camel$camel-web/1280/>

------------------------------------------
[...truncated 25 lines...]
[INFO] Executing tasks
     [echo] Copying to code together for the XSD generation
    [mkdir] Created dir: <https://builds.apache.org/job/Camel/org.apache.camel$camel-web/ws/target/schema-src>
    [mkdir] Created dir: <https://builds.apache.org/job/Camel/org.apache.camel$camel-web/ws/target/schema>
     [copy] Copying 5 files to <https://builds.apache.org/job/Camel/org.apache.camel$camel-web/ws/target/schema-src>
     [echo] Generating XSD schema
[schemagen] Generating schema from 5 source files
Note: Writing <https://builds.apache.org/job/Camel/org.apache.camel$camel-web/ws/target/schema/camel-web.xsd>
[INFO] Executed tasks
[INFO] [remote-resources:process {execution: default}]
[WARNING] POM for 'org.w3c.css:sac:pom:1.3:test' is invalid.

Its dependencies (if any) will NOT be available to the current build.
[INFO] [resources:resources {execution: default-resources}]
[INFO] Using 'UTF-8' encoding to copy filtered resources.
[INFO] Copying 7 resources
[INFO] Copying 3 resources
[INFO] [compiler:compile {execution: default-compile}]
[INFO] Compiling 28 source files to <https://builds.apache.org/job/Camel/org.apache.camel$camel-web/ws/target/classes>
Downloading: http://download.java.net/maven/2//org/fusesource/scalate/scalate-wikitext/1.5.0/scalate-wikitext-1.5.0.pom
[INFO] Unable to find resource 'org.fusesource.scalate:scalate-wikitext:pom:1.5.0' in repository
java.net.m2 (http://download.java.net/maven/2/)
Downloading: http://repo1.maven.org/maven2/org/fusesource/scalate/scalate-wikitext/1.5.0/scalate-wikitext-1.5.0.pom

Downloading: http://download.java.net/maven/2//org/fusesource/wikitext/confluence-core/1.2/confluence-core-1.2.pom
[INFO] Unable to find resource 'org.fusesource.wikitext:confluence-core:pom:1.2' in repository
java.net.m2 (http://download.java.net/maven/2/)
Downloading: http://maven.glassfish.org/content/groups/glassfish/org/fusesource/wikitext/confluence-core/1.2/confluence-core-1.2.pom
1K downloaded  (confluence-core-1.2.pom)
Downloading: http://download.java.net/maven/2//org/fusesource/wikitext/wikitext-project/1.2/wikitext-project-1.2.pom
[INFO] Unable to find resource 'org.fusesource.wikitext:wikitext-project:pom:1.2' in repository
java.net.m2 (http://download.java.net/maven/2/)
Downloading: http://maven.glassfish.org/content/groups/glassfish/org/fusesource/wikitext/wikitext-project/1.2/wikitext-project-1.2.pom
4K downloaded  (wikitext-project-1.2.pom)
Downloading: http://download.java.net/maven/2//org/fusesource/fusesource-pom/1.3/fusesource-pom-1.3.pom
[INFO] Unable to find resource 'org.fusesource:fusesource-pom:pom:1.3' in repository java.net.m2
(http://download.java.net/maven/2/)
Downloading: http://maven.glassfish.org/content/groups/glassfish/org/fusesource/fusesource-pom/1.3/fusesource-pom-1.3.pom
13K downloaded  (fusesource-pom-1.3.pom)
Downloading: http://download.java.net/maven/2//org/fusesource/wikitext/wikitext-core/1.2/wikitext-core-1.2.pom
[INFO] Unable to find resource 'org.fusesource.wikitext:wikitext-core:pom:1.2' in repository
java.net.m2 (http://download.java.net/maven/2/)
Downloading: http://maven.glassfish.org/content/groups/glassfish/org/fusesource/wikitext/wikitext-core/1.2/wikitext-core-1.2.pom
1K downloaded  (wikitext-core-1.2.pom)
Downloading: http://download.java.net/maven/2//org/fusesource/wikitext/textile-core/1.2/textile-core-1.2.pom
[INFO] Unable to find resource 'org.fusesource.wikitext:textile-core:pom:1.2' in repository
java.net.m2 (http://download.java.net/maven/2/)
Downloading: http://maven.glassfish.org/content/groups/glassfish/org/fusesource/wikitext/textile-core/1.2/textile-core-1.2.pom
1K downloaded  (textile-core-1.2.pom)
Downloading: http://download.java.net/maven/2//org/fusesource/scalate/scalate-page/1.5.0/scalate-page-1.5.0.pom
[INFO] Unable to find resource 'org.fusesource.scalate:scalate-page:pom:1.5.0' in repository
java.net.m2 (http://download.java.net/maven/2/)
Downloading: http://repo1.maven.org/maven2/org/fusesource/scalate/scalate-page/1.5.0/scalate-page-1.5.0.pom

Downloading: http://download.java.net/maven/2//org/yaml/snakeyaml/1.7/snakeyaml-1.7.pom
[INFO] Unable to find resource 'org.yaml:snakeyaml:pom:1.7' in repository java.net.m2 (http://download.java.net/maven/2/)
Downloading: http://maven.glassfish.org/content/groups/glassfish/org/yaml/snakeyaml/1.7/snakeyaml-1.7.pom
11K downloaded  (snakeyaml-1.7.pom)
Downloading: http://download.java.net/maven/2//org/fusesource/scalamd/scalamd/1.5/scalamd-1.5.pom
[INFO] Unable to find resource 'org.fusesource.scalamd:scalamd:pom:1.5' in repository java.net.m2
(http://download.java.net/maven/2/)
Downloading: http://maven.glassfish.org/content/groups/glassfish/org/fusesource/scalamd/scalamd/1.5/scalamd-1.5.pom
7K downloaded  (scalamd-1.5.pom)
Downloading: http://download.java.net/maven/2//org/slf4j/slf4j-nop/1.6.1/slf4j-nop-1.6.1.pom
[INFO] Unable to find resource 'org.slf4j:slf4j-nop:pom:1.6.1' in repository java.net.m2 (http://download.java.net/maven/2/)
Downloading: http://repo1.maven.org/maven2/org/slf4j/slf4j-nop/1.6.1/slf4j-nop-1.6.1.pom

Downloading: http://download.java.net/maven/2//org/fusesource/mvnplugins/scala-mojo-support/1.15/scala-mojo-support-1.15.pom
[INFO] Unable to find resource 'org.fusesource.mvnplugins:scala-mojo-support:pom:1.15' in
repository java.net.m2 (http://download.java.net/maven/2/)
Downloading: http://repo1.maven.org/maven2/org/fusesource/mvnplugins/scala-mojo-support/1.15/scala-mojo-support-1.15.pom

Downloading: http://download.java.net/maven/2//org/fusesource/mvnplugins/mvnplugins/1.15/mvnplugins-1.15.pom
[INFO] Unable to find resource 'org.fusesource.mvnplugins:mvnplugins:pom:1.15' in repository
java.net.m2 (http://download.java.net/maven/2/)
Downloading: http://repo1.maven.org/maven2/org/fusesource/mvnplugins/mvnplugins/1.15/mvnplugins-1.15.pom

Downloading: http://download.java.net/maven/2//org/fusesource/fusesource-pom/1.5/fusesource-pom-1.5.pom
[INFO] Unable to find resource 'org.fusesource:fusesource-pom:pom:1.5' in repository java.net.m2
(http://download.java.net/maven/2/)
Downloading: http://repo1.maven.org/maven2/org/fusesource/fusesource-pom/1.5/fusesource-pom-1.5.pom

Downloading: http://download.java.net/maven/2//org/apache/maven/maven-plugin-tools-api/2.1/maven-plugin-tools-api-2.1.pom
[INFO] Unable to find resource 'org.apache.maven:maven-plugin-tools-api:pom:2.1' in repository
java.net.m2 (http://download.java.net/maven/2/)
Downloading: http://maven.glassfish.org/content/groups/glassfish/org/apache/maven/maven-plugin-tools-api/2.1/maven-plugin-tools-api-2.1.pom
1K downloaded  (maven-plugin-tools-api-2.1.pom)
Downloading: http://download.java.net/maven/2//org/apache/maven/maven-plugin-tools/2.1/maven-plugin-tools-2.1.pom
[INFO] Unable to find resource 'org.apache.maven:maven-plugin-tools:pom:2.1' in repository
java.net.m2 (http://download.java.net/maven/2/)
Downloading: http://maven.glassfish.org/content/groups/glassfish/org/apache/maven/maven-plugin-tools/2.1/maven-plugin-tools-2.1.pom
3K downloaded  (maven-plugin-tools-2.1.pom)
Downloading: http://download.java.net/maven/2//org/apache/maven/wagon/wagon-provider-api/1.0-beta-7/wagon-provider-api-1.0-beta-7.pom
[INFO] Unable to find resource 'org.apache.maven.wagon:wagon-provider-api:pom:1.0-beta-7'
in repository java.net.m2 (http://download.java.net/maven/2/)
Downloading: http://repo1.maven.org/maven2/org/apache/maven/wagon/wagon-provider-api/1.0-beta-7/wagon-provider-api-1.0-beta-7.pom

Downloading: http://download.java.net/maven/2//org/apache/maven/wagon/wagon/1.0-beta-7/wagon-1.0-beta-7.pom
[INFO] Unable to find resource 'org.apache.maven.wagon:wagon:pom:1.0-beta-7' in repository
java.net.m2 (http://download.java.net/maven/2/)
Downloading: http://repo1.maven.org/maven2/org/apache/maven/wagon/wagon/1.0-beta-7/wagon-1.0-beta-7.pom

Downloading: http://download.java.net/maven/2//org/apache/maven/wagon/wagon-file/1.0-beta-7/wagon-file-1.0-beta-7.pom
[INFO] Unable to find resource 'org.apache.maven.wagon:wagon-file:pom:1.0-beta-7' in repository
java.net.m2 (http://download.java.net/maven/2/)
Downloading: http://repo1.maven.org/maven2/org/apache/maven/wagon/wagon-file/1.0-beta-7/wagon-file-1.0-beta-7.pom

Downloading: http://download.java.net/maven/2//org/apache/maven/wagon/wagon-providers/1.0-beta-7/wagon-providers-1.0-beta-7.pom
[INFO] Unable to find resource 'org.apache.maven.wagon:wagon-providers:pom:1.0-beta-7' in
repository java.net.m2 (http://download.java.net/maven/2/)
Downloading: http://repo1.maven.org/maven2/org/apache/maven/wagon/wagon-providers/1.0-beta-7/wagon-providers-1.0-beta-7.pom

Downloading: http://download.java.net/maven/2//org/apache/maven/wagon/wagon-ssh/1.0-beta-7/wagon-ssh-1.0-beta-7.pom
[INFO] Unable to find resource 'org.apache.maven.wagon:wagon-ssh:pom:1.0-beta-7' in repository
java.net.m2 (http://download.java.net/maven/2/)
Downloading: http://repo1.maven.org/maven2/org/apache/maven/wagon/wagon-ssh/1.0-beta-7/wagon-ssh-1.0-beta-7.pom

Downloading: http://download.java.net/maven/2//org/apache/maven/wagon/wagon-ssh-common/1.0-beta-7/wagon-ssh-common-1.0-beta-7.pom
[INFO] Unable to find resource 'org.apache.maven.wagon:wagon-ssh-common:pom:1.0-beta-7' in
repository java.net.m2 (http://download.java.net/maven/2/)
Downloading: http://maven.glassfish.org/content/groups/glassfish/org/apache/maven/wagon/wagon-ssh-common/1.0-beta-7/wagon-ssh-common-1.0-beta-7.pom
1K downloaded  (wagon-ssh-common-1.0-beta-7.pom)
Downloading: http://download.java.net/maven/2//org/apache/maven/wagon/wagon-http-lightweight/1.0-beta-7/wagon-http-lightweight-1.0-beta-7.pom
[INFO] Unable to find resource 'org.apache.maven.wagon:wagon-http-lightweight:pom:1.0-beta-7'
in repository java.net.m2 (http://download.java.net/maven/2/)
Downloading: http://repo1.maven.org/maven2/org/apache/maven/wagon/wagon-http-lightweight/1.0-beta-7/wagon-http-lightweight-1.0-beta-7.pom

Downloading: http://download.java.net/maven/2//org/apache/maven/wagon/wagon-http-shared/1.0-beta-7/wagon-http-shared-1.0-beta-7.pom
[INFO] Unable to find resource 'org.apache.maven.wagon:wagon-http-shared:pom:1.0-beta-7' in
repository java.net.m2 (http://download.java.net/maven/2/)
Downloading: http://maven.glassfish.org/content/groups/glassfish/org/apache/maven/wagon/wagon-http-shared/1.0-beta-7/wagon-http-shared-1.0-beta-7.pom
2K downloaded  (wagon-http-shared-1.0-beta-7.pom)
Downloading: http://download.java.net/maven/2//org/codehaus/plexus/plexus-utils/2.0.2/plexus-utils-2.0.2.pom
[INFO] Unable to find resource 'org.codehaus.plexus:plexus-utils:pom:2.0.2' in repository
java.net.m2 (http://download.java.net/maven/2/)
Downloading: http://repo1.maven.org/maven2/org/codehaus/plexus/plexus-utils/2.0.2/plexus-utils-2.0.2.pom

Downloading: http://download.java.net/maven/2//org/codehaus/swizzle/swizzle-confluence/1.4/swizzle-confluence-1.4.pom
[INFO] Unable to find resource 'org.codehaus.swizzle:swizzle-confluence:pom:1.4' in repository
java.net.m2 (http://download.java.net/maven/2/)
Downloading: http://repo1.maven.org/maven2/org/codehaus/swizzle/swizzle-confluence/1.4/swizzle-confluence-1.4.pom

Downloading: http://download.java.net/maven/2//org/codehaus/swizzle/swizzle/1.4/swizzle-1.4.pom
[INFO] Unable to find resource 'org.codehaus.swizzle:swizzle:pom:1.4' in repository java.net.m2
(http://download.java.net/maven/2/)
Downloading: http://repo1.maven.org/maven2/org/codehaus/swizzle/swizzle/1.4/swizzle-1.4.pom

Downloading: http://download.java.net/maven/2//xmlrpc/xmlrpc-client/3.0/xmlrpc-client-3.0.pom
[INFO] Unable to find resource 'xmlrpc:xmlrpc-client:pom:3.0' in repository java.net.m2 (http://download.java.net/maven/2/)
Downloading: http://maven.glassfish.org/content/groups/glassfish/xmlrpc/xmlrpc-client/3.0/xmlrpc-client-3.0.pom
808b downloaded  (xmlrpc-client-3.0.pom)
Downloading: http://download.java.net/maven/2//org/apache/xmlrpc/xmlrpc/3.0/xmlrpc-3.0.pom
[INFO] Unable to find resource 'org.apache.xmlrpc:xmlrpc:pom:3.0' in repository java.net.m2
(http://download.java.net/maven/2/)
Downloading: http://maven.glassfish.org/content/groups/glassfish/org/apache/xmlrpc/xmlrpc/3.0/xmlrpc-3.0.pom
11K downloaded  (xmlrpc-3.0.pom)
Downloading: http://download.java.net/maven/2//org/apache/xmlrpc/xmlrpc-common/3.0/xmlrpc-common-3.0.pom
[INFO] Unable to find resource 'org.apache.xmlrpc:xmlrpc-common:pom:3.0' in repository java.net.m2
(http://download.java.net/maven/2/)
Downloading: http://maven.glassfish.org/content/groups/glassfish/org/apache/xmlrpc/xmlrpc-common/3.0/xmlrpc-common-3.0.pom
854b downloaded  (xmlrpc-common-3.0.pom)
Downloading: http://download.java.net/maven/2//org/apache/ws/commons/ws-commons-util/1.0.1/ws-commons-util-1.0.1.pom
[INFO] Unable to find resource 'org.apache.ws.commons:ws-commons-util:pom:1.0.1' in repository
java.net.m2 (http://download.java.net/maven/2/)
Downloading: http://maven.glassfish.org/content/groups/glassfish/org/apache/ws/commons/ws-commons-util/1.0.1/ws-commons-util-1.0.1.pom
5K downloaded  (ws-commons-util-1.0.1.pom)
Downloading: http://download.java.net/maven/2//org/yaml/snakeyaml/1.7/snakeyaml-1.7.jar
Downloading: http://download.java.net/maven/2//org/codehaus/swizzle/swizzle-confluence/1.4/swizzle-confluence-1.4.jar
Downloading: http://download.java.net/maven/2//org/fusesource/mvnplugins/scala-mojo-support/1.15/scala-mojo-support-1.15.jar
Downloading: http://download.java.net/maven/2//org/fusesource/wikitext/confluence-core/1.2/confluence-core-1.2.jar
Downloading: http://download.java.net/maven/2//org/scala-lang/scala-library/2.9.0-1/scala-library-2.9.0-1.jar
[INFO] Unable to find resource 'org.codehaus.swizzle:swizzle-confluence:jar:1.4' in repository
java.net.m2 (http://download.java.net/maven/2/)
Downloading: http://repo1.maven.org/maven2/org/codehaus/swizzle/swizzle-confluence/1.4/swizzle-confluence-1.4.jar
[INFO] Unable to find resource 'org.fusesource.wikitext:confluence-core:jar:1.2' in repository
java.net.m2 (http://download.java.net/maven/2/)
[INFO] [INFO] Unable to find resource 'org.yaml:snakeyaml:jar:1.7' in repository java.net.m2
(http://download.java.net/maven/2/)
Unable to find resource 'org.scala-lang:scala-library:jar:2.9.0-1' in repository java.net.m2
(http://download.java.net/maven/2/)
[INFO] Unable to find resource 'org.fusesource.mvnplugins:scala-mojo-support:jar:1.15' in
repository java.net.m2 (http://download.java.net/maven/2/)
Downloading: http://maven.glassfish.org/content/groups/glassfish/org/fusesource/wikitext/confluence-core/1.2/confluence-core-1.2.jar
Downloading: http://maven.glassfish.org/content/groups/glassfish/org/yaml/snakeyaml/1.7/snakeyaml-1.7.jar
Downloading: http://repo1.maven.org/maven2/org/scala-lang/scala-library/2.9.0-1/scala-library-2.9.0-1.jar
Downloading: http://repo1.maven.org/maven2/org/fusesource/mvnplugins/scala-mojo-support/1.15/scala-mojo-support-1.15.jar

64K downloaded  (confluence-core-1.2.jar)
247K downloaded  (snakeyaml-1.7.jar)
Downloading: http://download.java.net/maven/2//xmlrpc/xmlrpc-client/3.0/xmlrpc-client-3.0.jar

[INFO] Unable to find resource 'xmlrpc:xmlrpc-client:jar:3.0' in repository java.net.m2 (http://download.java.net/maven/2/)
Downloading: http://maven.glassfish.org/content/groups/glassfish/xmlrpc/xmlrpc-client/3.0/xmlrpc-client-3.0.jar
Downloading: http://download.java.net/maven/2//org/codehaus/plexus/plexus-utils/2.0.2/plexus-utils-2.0.2.jar
[INFO] Unable to find resource 'org.codehaus.plexus:plexus-utils:jar:2.0.2' in repository
java.net.m2 (http://download.java.net/maven/2/)
Downloading: http://repo1.maven.org/maven2/org/codehaus/plexus/plexus-utils/2.0.2/plexus-utils-2.0.2.jar
Downloading: http://download.java.net/maven/2//org/apache/maven/maven-plugin-tools-api/2.1/maven-plugin-tools-api-2.1.jar
[INFO] Unable to find resource 'org.apache.maven:maven-plugin-tools-api:jar:2.1' in repository
java.net.m2 (http://download.java.net/maven/2/)
Downloading: http://maven.glassfish.org/content/groups/glassfish/org/apache/maven/maven-plugin-tools-api/2.1/maven-plugin-tools-api-2.1.jar
42K downloaded  (xmlrpc-client-3.0.jar)
Downloading: http://download.java.net/maven/2//org/fusesource/scalamd/scalamd/1.5/scalamd-1.5.jar

[INFO] Unable to find resource 'org.fusesource.scalamd:scalamd:jar:1.5' in repository java.net.m2
(http://download.java.net/maven/2/)
Downloading: http://repo1.maven.org/maven2/org/fusesource/scalamd/scalamd/1.5/scalamd-1.5.jar
Downloading: http://download.java.net/maven/2//org/apache/xmlrpc/xmlrpc-common/3.0/xmlrpc-common-3.0.jar
28K downloaded  (maven-plugin-tools-api-2.1.jar)
Downloading: http://download.java.net/maven/2//org/apache/ws/commons/ws-commons-util/1.0.1/ws-commons-util-1.0.1.jar
[INFO] Unable to find resource 'org.apache.xmlrpc:xmlrpc-common:jar:3.0' in repository java.net.m2
(http://download.java.net/maven/2/)
Downloading: http://maven.glassfish.org/content/groups/glassfish/org/apache/xmlrpc/xmlrpc-common/3.0/xmlrpc-common-3.0.jar
[INFO] Unable to find resource 'org.apache.ws.commons:ws-commons-util:jar:1.0.1' in repository
java.net.m2 (http://download.java.net/maven/2/)
Downloading: http://maven.glassfish.org/content/groups/glassfish/org/apache/ws/commons/ws-commons-util/1.0.1/ws-commons-util-1.0.1.jar

Downloading: http://download.java.net/maven/2//org/slf4j/slf4j-nop/1.6.1/slf4j-nop-1.6.1.jar
[INFO] Unable to find resource 'org.slf4j:slf4j-nop:jar:1.6.1' in repository java.net.m2 (http://download.java.net/maven/2/)
Downloading: http://repo1.maven.org/maven2/org/slf4j/slf4j-nop/1.6.1/slf4j-nop-1.6.1.jar

Downloading: http://download.java.net/maven/2//org/fusesource/wikitext/wikitext-core/1.2/wikitext-core-1.2.jar
95K downloaded  (xmlrpc-common-3.0.jar)
[INFO] Unable to find resource 'org.fusesource.wikitext:wikitext-core:jar:1.2' in repository
java.net.m2 (http://download.java.net/maven/2/)
Downloading: http://maven.glassfish.org/content/groups/glassfish/org/fusesource/wikitext/wikitext-core/1.2/wikitext-core-1.2.jar
34K downloaded  (ws-commons-util-1.0.1.jar)

Downloading: http://download.java.net/maven/2//org/scala-lang/scala-compiler/2.9.0-1/scala-compiler-2.9.0-1.jar
[INFO] Unable to find resource 'org.scala-lang:scala-compiler:jar:2.9.0-1' in repository java.net.m2
(http://download.java.net/maven/2/)
Downloading: http://repo1.maven.org/maven2/org/scala-lang/scala-compiler/2.9.0-1/scala-compiler-2.9.0-1.jar
Downloading: http://download.java.net/maven/2//org/fusesource/scalate/scalate-wikitext/1.5.0/scalate-wikitext-1.5.0.jar
[INFO] Unable to find resource 'org.fusesource.scalate:scalate-wikitext:jar:1.5.0' in repository
java.net.m2 (http://download.java.net/maven/2/)
Downloading: http://repo1.maven.org/maven2/org/fusesource/scalate/scalate-wikitext/1.5.0/scalate-wikitext-1.5.0.jar
236K downloaded  (wikitext-core-1.2.jar)
Downloading: http://download.java.net/maven/2//org/fusesource/wikitext/textile-core/1.2/textile-core-1.2.jar
[INFO] Unable to find resource 'org.fusesource.wikitext:textile-core:jar:1.2' in repository
java.net.m2 (http://download.java.net/maven/2/)
Downloading: http://maven.glassfish.org/content/groups/glassfish/org/fusesource/wikitext/textile-core/1.2/textile-core-1.2.jar

Downloading: http://download.java.net/maven/2//org/fusesource/scalate/scalate-page/1.5.0/scalate-page-1.5.0.jar
[INFO] Unable to find resource 'org.fusesource.scalate:scalate-page:jar:1.5.0' in repository
java.net.m2 (http://download.java.net/maven/2/)
Downloading: http://repo1.maven.org/maven2/org/fusesource/scalate/scalate-page/1.5.0/scalate-page-1.5.0.jar
53K downloaded  (textile-core-1.2.jar)


Processing Configuration for child elements
Processing child [project]
Processing child [warSourceDirectory]
Processing child [resourcesSourceDirectory]
Processing child [targetDirectory]
Processing child [classesDirectory]
Processing child [classPathElements]
[INFO] [scalate:precompile {execution: default}]
[INFO] Precompiling Scalate Templates into Scala classes...
[INFO]     processing <https://builds.apache.org/job/Camel/org.apache.camel$camel-web/ws/src/main/webapp/WEB-INF/scalate/layouts/default.scaml>
[INFO]     processing <https://builds.apache.org/job/Camel/org.apache.camel$camel-web/ws/src/main/webapp/WEB-INF/org/apache/camel/web/resources/EndpointResource.send.ssp>
[INFO]     processing <https://builds.apache.org/job/Camel/org.apache.camel$camel-web/ws/src/main/webapp/WEB-INF/org/apache/camel/web/resources/ConvertersFromResource.index.ssp>
[INFO]     processing <https://builds.apache.org/job/Camel/org.apache.camel$camel-web/ws/src/main/webapp/WEB-INF/org/apache/camel/web/resources/RouteResource.edit.ssp>
[INFO]     processing <https://builds.apache.org/job/Camel/org.apache.camel$camel-web/ws/src/main/webapp/WEB-INF/org/apache/camel/web/resources/CamelContextResource.index.ssp>
[INFO]     processing <https://builds.apache.org/job/Camel/org.apache.camel$camel-web/ws/src/main/webapp/WEB-INF/org/apache/camel/web/resources/ComponentsResource.index.ssp>
[INFO]     processing <https://builds.apache.org/job/Camel/org.apache.camel$camel-web/ws/src/main/webapp/WEB-INF/org/apache/camel/web/resources/RoutesResource.create.ssp>
[INFO]     processing <https://builds.apache.org/job/Camel/org.apache.camel$camel-web/ws/src/main/webapp/WEB-INF/org/apache/camel/web/resources/ExchangeResource.index.ssp>
[INFO]     processing <https://builds.apache.org/job/Camel/org.apache.camel$camel-web/ws/src/main/webapp/WEB-INF/org/apache/camel/web/resources/EndpointsResource.index.ssp>
[INFO]     processing <https://builds.apache.org/job/Camel/org.apache.camel$camel-web/ws/src/main/webapp/WEB-INF/org/apache/camel/web/resources/CamelContextResource.api.ssp>
[INFO]     processing <https://builds.apache.org/job/Camel/org.apache.camel$camel-web/ws/src/main/webapp/WEB-INF/org/apache/camel/web/resources/ConvertersResource.index.ssp>
[INFO]     processing <https://builds.apache.org/job/Camel/org.apache.camel$camel-web/ws/src/main/webapp/WEB-INF/org/apache/camel/web/resources/EndpointResource.index.ssp>
[INFO]     processing <https://builds.apache.org/job/Camel/org.apache.camel$camel-web/ws/src/main/webapp/WEB-INF/org/apache/camel/web/resources/LanguageResource.index.ssp>
[INFO]     processing <https://builds.apache.org/job/Camel/org.apache.camel$camel-web/ws/src/main/webapp/WEB-INF/org/apache/camel/web/resources/CamelContextResource.systemProperties.ssp>
[INFO]     processing <https://builds.apache.org/job/Camel/org.apache.camel$camel-web/ws/src/main/webapp/WEB-INF/org/apache/camel/web/resources/RouteResource.index.ssp>
[INFO]     processing <https://builds.apache.org/job/Camel/org.apache.camel$camel-web/ws/src/main/webapp/WEB-INF/org/apache/camel/web/resources/RoutesResource.index.ssp>
[INFO]     processing <https://builds.apache.org/job/Camel/org.apache.camel$camel-web/ws/src/main/webapp/WEB-INF/org/apache/camel/web/resources/ComponentResource.index.ssp>
[INFO]     processing <https://builds.apache.org/job/Camel/org.apache.camel$camel-web/ws/src/main/webapp/WEB-INF/org/apache/camel/web/resources/LanguagesResource.index.ssp>
[INFO]     processing <https://builds.apache.org/job/Camel/org.apache.camel$camel-web/ws/src/main/webapp/WEB-INF/snippets/camelContextLinks.ssp>
[INFO] [resources:testResources {execution: default-testResources}]
[INFO] Using 'UTF-8' encoding to copy filtered resources.
[INFO] Copying 4 resources
[INFO] Copying 3 resources
[INFO] [compiler:testCompile {execution: default-testCompile}]
[INFO] Compiling 13 source files to <https://builds.apache.org/job/Camel/org.apache.camel$camel-web/ws/target/test-classes>
[INFO] -------------------------------------------------------------
[ERROR] COMPILATION ERROR : 
[INFO] -------------------------------------------------------------
[ERROR] error: error reading /home/hudson/hudson-slave/workspace/Camel/.repository/net/sourceforge/cssparser/cssparser/0.9.5/cssparser-0.9.5.jar;
error in opening zip file
[ERROR] error: error reading /home/hudson/hudson-slave/workspace/Camel/.repository/org/w3c/css/sac/1.3/sac-1.3.jar;
error in opening zip file
[INFO] 2 errors 
[INFO] -------------------------------------------------------------
[JENKINS] Archiving <https://builds.apache.org/job/Camel/org.apache.camel$camel-web/ws/pom.xml>
to /home/hudson/hudson/jobs/Camel/modules/org.apache.camel$camel-web/builds/2011-07-21_10-42-54/archive/org.apache.camel/camel-web/2.9-SNAPSHOT/camel-web-2.9-SNAPSHOT.pom


Mime
View raw message