camel-dev mailing list archives

Site index · List index
Message view « Date » · « Thread »
Top « Date » · « Thread »
From Apache Jenkins Server <jenk...@builds.apache.org>
Subject Build failed in Jenkins: Camel #1270
Date Mon, 11 Jul 2011 02:44:31 GMT
See <https://builds.apache.org/job/Camel/1270/changes>

Changes:

[davsclaus] CAMEL-4206: Upgrade to scala 2.9.0

[davsclaus] Upgraded to restlet 2.0.8

[davsclaus] Upgraded parent version in pom.xml

[davsclaus] CAMEL-4205: Added whenDoneByIndex to NotifyBuilder.

[davsclaus] Fixed test due CI error

------------------------------------------
[...truncated 1495 lines...]
[WARNING] Warning building bundle org.apache.camel:camel-cxf-transport:bundle:2.8-SNAPSHOT
: Did not find matching referal for org.apache.mina.*
[WARNING] Warning building bundle org.apache.camel:camel-cxf-transport:bundle:2.8-SNAPSHOT
: Did not find matching referal for org.apache.qpid.*
[WARNING] Warning building bundle org.apache.camel:camel-cxf-transport:bundle:2.8-SNAPSHOT
: Did not find matching referal for org.apache.velocity.*
[WARNING] Warning building bundle org.apache.camel:camel-cxf-transport:bundle:2.8-SNAPSHOT
: Did not find matching referal for org.apache.xmlbeans.*
[WARNING] Warning building bundle org.apache.camel:camel-cxf-transport:bundle:2.8-SNAPSHOT
: Did not find matching referal for org.ccil.cowan.tagsoup.*
[WARNING] Warning building bundle org.apache.camel:camel-cxf-transport:bundle:2.8-SNAPSHOT
: Did not find matching referal for org.eclipse.jetty.*
[WARNING] Warning building bundle org.apache.camel:camel-cxf-transport:bundle:2.8-SNAPSHOT
: Did not find matching referal for org.jivesoftware.smack.*
[WARNING] Warning building bundle org.apache.camel:camel-cxf-transport:bundle:2.8-SNAPSHOT
: Did not find matching referal for org.mortbay.cometd.*
[WARNING] Warning building bundle org.apache.camel:camel-cxf-transport:bundle:2.8-SNAPSHOT
: Exporting packages that are not on the Bundle-Classpath[Jar:dot]: [META-INF.cxf.camel]
[INFO] [ianal:verify-legal-files {execution: default}]
[INFO] Checking legal files in: camel-cxf-transport-2.8-SNAPSHOT.jar
[INFO] [install:install {execution: default-install}]
[INFO] Installing <https://builds.apache.org/job/Camel/ws/camel-trunk/components/camel-cxf-transport/target/camel-cxf-transport-2.8-SNAPSHOT.jar>
to <https://builds.apache.org/job/Camel/ws/.repository/org/apache/camel/camel-cxf-transport/2.8-SNAPSHOT/camel-cxf-transport-2.8-SNAPSHOT.jar>
[INFO] [bundle:install {execution: default-install}]
[INFO] Parsing <https://builds.apache.org/job/Camel/ws/.repository/repository.xml>
[INFO] Installing org/apache/camel/camel-cxf-transport/2.8-SNAPSHOT/camel-cxf-transport-2.8-SNAPSHOT.jar
[INFO] Writing OBR metadata
[JENKINS] Archiving <https://builds.apache.org/job/Camel/ws/camel-trunk/components/camel-cxf-transport/pom.xml>
to /home/hudson/hudson/jobs/Camel/modules/org.apache.camel$camel-cxf-transport/builds/2011-07-11_02-40-24/archive/org.apache.camel/camel-cxf-transport/2.8-SNAPSHOT/camel-cxf-transport-2.8-SNAPSHOT.pom
[JENKINS] Archiving <https://builds.apache.org/job/Camel/ws/camel-trunk/components/camel-cxf-transport/target/camel-cxf-transport-2.8-SNAPSHOT.jar>
to /home/hudson/hudson/jobs/Camel/modules/org.apache.camel$camel-cxf-transport/builds/2011-07-11_02-40-24/archive/org.apache.camel/camel-cxf-transport/2.8-SNAPSHOT/camel-cxf-transport-2.8-SNAPSHOT.jar
[INFO] ------------------------------------------------------------------------
[INFO] Building Camel :: CXF
[INFO]    task-segment: [clean, install]
[INFO] ------------------------------------------------------------------------
[INFO] [clean:clean {execution: default-clean}]
[INFO] Deleting <https://builds.apache.org/job/Camel/ws/camel-trunk/components/camel-cxf/target>
[INFO] snapshot org.apache.camel:camel-cxf-transport:2.8-SNAPSHOT: checking for updates from
apache.snapshots
[INFO] snapshot org.apache.camel:camel-blueprint:2.8-SNAPSHOT: checking for updates from apache.snapshots
[INFO] [antrun:run {execution: create-prop}]
[INFO] Executing tasks
     [echo] Maven version: 2.8-SNAPSHOT
     [echo] OSGi version: 2.8.0.SNAPSHOT
    [mkdir] Created dir: <https://builds.apache.org/job/Camel/ws/camel-trunk/components/camel-cxf/target>
[INFO] Executed tasks
[INFO] [properties:read-project-properties {execution: default}]
[INFO] [cxf-codegen:wsdl2java {execution: generate-test-sources}]
[INFO] Running wsdl2java in fork mode...
[INFO] Building jar: /tmp/cxf-tmp-67198/cxf-codegen7185910071125498272.jar
[INFO] [remote-resources:process {execution: default}]
[INFO] [resources:resources {execution: default-resources}]
[INFO] Using 'UTF-8' encoding to copy filtered resources.
[INFO] Copying 13 resources
[INFO] Copying 3 resources
[INFO] [compiler:compile {execution: default-compile}]
[INFO] Compiling 114 source files to <https://builds.apache.org/job/Camel/ws/camel-trunk/components/camel-cxf/target/classes>
[INFO] [resources:testResources {execution: default-testResources}]
[INFO] Using 'UTF-8' encoding to copy filtered resources.
[INFO] Copying 78 resources
[INFO] Copying 3 resources
[INFO] [compiler:testCompile {execution: default-testCompile}]
[INFO] Compiling 142 source files to <https://builds.apache.org/job/Camel/ws/camel-trunk/components/camel-cxf/target/test-classes>
[INFO] [surefire:test {execution: default-test}]
[INFO] Tests are skipped.
[INFO] [bundle:bundle {execution: default-bundle}]
[WARNING] Warning building bundle org.apache.camel:camel-cxf:bundle:2.8-SNAPSHOT : Did not
find matching referal for !META-INF.cxf.camel
[WARNING] Warning building bundle org.apache.camel:camel-cxf:bundle:2.8-SNAPSHOT : Did not
find matching referal for com.thoughtworks.xstream.*
[WARNING] Warning building bundle org.apache.camel:camel-cxf:bundle:2.8-SNAPSHOT : Did not
find matching referal for freemarker.*
[WARNING] Warning building bundle org.apache.camel:camel-cxf:bundle:2.8-SNAPSHOT : Did not
find matching referal for javax.persistence.*
[WARNING] Warning building bundle org.apache.camel:camel-cxf:bundle:2.8-SNAPSHOT : Did not
find matching referal for net.sf.flatpack.*
[WARNING] Warning building bundle org.apache.camel:camel-cxf:bundle:2.8-SNAPSHOT : Did not
find matching referal for org.antlr.stringtemplate.*
[WARNING] Warning building bundle org.apache.camel:camel-cxf:bundle:2.8-SNAPSHOT : Did not
find matching referal for org.apache.abdera.*
[WARNING] Warning building bundle org.apache.camel:camel-cxf:bundle:2.8-SNAPSHOT : Did not
find matching referal for org.apache.commons.httpclient.*
[WARNING] Warning building bundle org.apache.camel:camel-cxf:bundle:2.8-SNAPSHOT : Did not
find matching referal for org.apache.commons.logging.*
[WARNING] Warning building bundle org.apache.camel:camel-cxf:bundle:2.8-SNAPSHOT : Did not
find matching referal for org.apache.mina.*
[WARNING] Warning building bundle org.apache.camel:camel-cxf:bundle:2.8-SNAPSHOT : Did not
find matching referal for org.apache.qpid.*
[WARNING] Warning building bundle org.apache.camel:camel-cxf:bundle:2.8-SNAPSHOT : Did not
find matching referal for org.apache.velocity.*
[WARNING] Warning building bundle org.apache.camel:camel-cxf:bundle:2.8-SNAPSHOT : Did not
find matching referal for org.apache.xmlbeans.*
[WARNING] Warning building bundle org.apache.camel:camel-cxf:bundle:2.8-SNAPSHOT : Did not
find matching referal for org.ccil.cowan.tagsoup.*
[WARNING] Warning building bundle org.apache.camel:camel-cxf:bundle:2.8-SNAPSHOT : Did not
find matching referal for org.eclipse.jetty.*
[WARNING] Warning building bundle org.apache.camel:camel-cxf:bundle:2.8-SNAPSHOT : Did not
find matching referal for org.jivesoftware.smack.*
[WARNING] Warning building bundle org.apache.camel:camel-cxf:bundle:2.8-SNAPSHOT : Did not
find matching referal for org.mortbay.cometd.*
[INFO] [build-helper:attach-artifact {execution: attach-artifacts}]
[INFO] [ianal:verify-legal-files {execution: default}]
[INFO] Checking legal files in: camel-cxf-2.8-SNAPSHOT.jar
[INFO] [install:install {execution: default-install}]
[INFO] Installing <https://builds.apache.org/job/Camel/ws/camel-trunk/components/camel-cxf/target/camel-cxf-2.8-SNAPSHOT.jar>
to <https://builds.apache.org/job/Camel/ws/.repository/org/apache/camel/camel-cxf/2.8-SNAPSHOT/camel-cxf-2.8-SNAPSHOT.jar>
[INFO] Installing <https://builds.apache.org/job/Camel/ws/camel-trunk/components/camel-cxf/src/main/resources/schema/cxfEndpoint.xsd>
to <https://builds.apache.org/job/Camel/ws/.repository/org/apache/camel/camel-cxf/2.8-SNAPSHOT/camel-cxf-2.8-SNAPSHOT.xsd>
[INFO] [bundle:install {execution: default-install}]
[INFO] Parsing <https://builds.apache.org/job/Camel/ws/.repository/repository.xml>
[INFO] Installing org/apache/camel/camel-cxf/2.8-SNAPSHOT/camel-cxf-2.8-SNAPSHOT.jar
[INFO] Writing OBR metadata
[JENKINS] Archiving <https://builds.apache.org/job/Camel/ws/camel-trunk/components/camel-cxf/pom.xml>
to /home/hudson/hudson/jobs/Camel/modules/org.apache.camel$camel-cxf/builds/2011-07-11_02-40-24/archive/org.apache.camel/camel-cxf/2.8-SNAPSHOT/camel-cxf-2.8-SNAPSHOT.pom
[JENKINS] Archiving <https://builds.apache.org/job/Camel/ws/camel-trunk/components/camel-cxf/target/camel-cxf-2.8-SNAPSHOT.jar>
to /home/hudson/hudson/jobs/Camel/modules/org.apache.camel$camel-cxf/builds/2011-07-11_02-40-24/archive/org.apache.camel/camel-cxf/2.8-SNAPSHOT/camel-cxf-2.8-SNAPSHOT.jar
[JENKINS] Archiving <https://builds.apache.org/job/Camel/ws/camel-trunk/components/camel-cxf/src/main/resources/schema/cxfEndpoint.xsd>
to /home/hudson/hudson/jobs/Camel/modules/org.apache.camel$camel-cxf/builds/2011-07-11_02-40-24/archive/org.apache.camel/camel-cxf/2.8-SNAPSHOT/camel-cxf-2.8-SNAPSHOT.xsd
[INFO] ------------------------------------------------------------------------
[INFO] Building Camel :: Components
[INFO]    task-segment: [clean, install]
[INFO] ------------------------------------------------------------------------
[INFO] [clean:clean {execution: default-clean}]
[INFO] Deleting <https://builds.apache.org/job/Camel/ws/camel-trunk/components/target>
[INFO] [antrun:run {execution: create-prop}]
[INFO] Executing tasks
     [echo] Maven version: 2.8-SNAPSHOT
     [echo] OSGi version: 2.8.0.SNAPSHOT
    [mkdir] Created dir: <https://builds.apache.org/job/Camel/ws/camel-trunk/components/target>
[INFO] Executed tasks
[INFO] [properties:read-project-properties {execution: default}]
[INFO] [remote-resources:process {execution: default}]
[INFO] [site:attach-descriptor {execution: default-attach-descriptor}]
[INFO] [ianal:verify-legal-files {execution: default}]
[INFO] [install:install {execution: default-install}]
[INFO] Installing <https://builds.apache.org/job/Camel/ws/camel-trunk/components/pom.xml>
to <https://builds.apache.org/job/Camel/ws/.repository/org/apache/camel/components/2.8-SNAPSHOT/components-2.8-SNAPSHOT.pom>
[JENKINS] Archiving <https://builds.apache.org/job/Camel/ws/camel-trunk/components/pom.xml>
to /home/hudson/hudson/jobs/Camel/modules/org.apache.camel$components/builds/2011-07-11_02-40-24/archive/org.apache.camel/components/2.8-SNAPSHOT/components-2.8-SNAPSHOT.pom
[INFO] ------------------------------------------------------------------------
[INFO] Building Camel :: Web
[INFO]    task-segment: [clean, install]
[INFO] ------------------------------------------------------------------------
Downloading: http://download.java.net/maven/2//com/sun/jersey/contribs/maven-wadl-plugin/1.8/maven-wadl-plugin-1.8.pom
5K downloaded  (maven-wadl-plugin-1.8.pom)
Downloading: http://download.java.net/maven/2//com/sun/jersey/contribs/jersey-contribs/1.8/jersey-contribs-1.8.pom
3K downloaded  (jersey-contribs-1.8.pom)
Downloading: http://download.java.net/maven/2//com/sun/jersey/jersey-project/1.8/jersey-project-1.8.pom
16K downloaded  (jersey-project-1.8.pom)
Downloading: http://download.java.net/maven/2//com/sun/jersey/contribs/maven-wadl-plugin/1.8/maven-wadl-plugin-1.8.jar
17K downloaded  (maven-wadl-plugin-1.8.jar)
[INFO] [clean:clean {execution: default-clean}]
[INFO] Deleting <https://builds.apache.org/job/Camel/ws/camel-trunk/components/camel-web/target>
Downloading: http://maven.glassfish.org/content/groups/glassfish/com/sun/jersey/contribs/jersey-spring/1.8/jersey-spring-1.8.pom
20K downloaded  (jersey-spring-1.8.pom)
Downloading: http://maven.glassfish.org/content/groups/glassfish/com/sun/jersey/jersey-server/1.8/jersey-server-1.8.pom
11K downloaded  (jersey-server-1.8.pom)
Downloading: http://maven.glassfish.org/content/groups/glassfish/com/sun/jersey/jersey-core/1.8/jersey-core-1.8.pom
9K downloaded  (jersey-core-1.8.pom)
Downloading: http://maven.glassfish.org/content/groups/glassfish/com/sun/jersey/jersey-json/1.8/jersey-json-1.8.pom
10K downloaded  (jersey-json-1.8.pom)
Downloading: http://maven.glassfish.org/content/groups/glassfish/com/sun/jersey/jersey-atom/1.8/jersey-atom-1.8.pom
6K downloaded  (jersey-atom-1.8.pom)
Downloading: http://maven.glassfish.org/content/groups/glassfish/com/sun/jersey/jersey-client/1.8/jersey-client-1.8.pom
5K downloaded  (jersey-client-1.8.pom)
Downloading: http://maven.glassfish.org/content/groups/glassfish/com/sun/jersey/jersey-server/1.8/jersey-server-1.8.jar
Downloading: http://maven.glassfish.org/content/groups/glassfish/com/sun/jersey/contribs/jersey-spring/1.8/jersey-spring-1.8.jar
16K downloaded  (jersey-spring-1.8.jar)
678K downloaded  (jersey-server-1.8.jar)
Downloading: http://maven.glassfish.org/content/groups/glassfish/com/sun/jersey/jersey-core/1.8/jersey-core-1.8.jar
447K downloaded  (jersey-core-1.8.jar)
Downloading: http://maven.glassfish.org/content/groups/glassfish/com/sun/jersey/jersey-json/1.8/jersey-json-1.8.jar
144K downloaded  (jersey-json-1.8.jar)
Downloading: http://maven.glassfish.org/content/groups/glassfish/com/sun/jersey/jersey-atom/1.8/jersey-atom-1.8.jar
10K downloaded  (jersey-atom-1.8.jar)
Downloading: http://maven.glassfish.org/content/groups/glassfish/com/sun/jersey/jersey-client/1.8/jersey-client-1.8.jar
126K downloaded  (jersey-client-1.8.jar)
[INFO] [antrun:run {execution: create-prop}]
[INFO] Executing tasks
     [echo] Maven version: 2.8-SNAPSHOT
     [echo] OSGi version: 2.8.0.SNAPSHOT
    [mkdir] Created dir: <https://builds.apache.org/job/Camel/ws/camel-trunk/components/camel-web/target>
[INFO] Executed tasks
[INFO] [properties:read-project-properties {execution: default}]
[INFO] [antrun:run {execution: process-sources}]
[INFO] Executing tasks
     [echo] Copying to code together for the XSD generation
    [mkdir] Created dir: <https://builds.apache.org/job/Camel/ws/camel-trunk/components/camel-web/target/schema-src>
    [mkdir] Created dir: <https://builds.apache.org/job/Camel/ws/camel-trunk/components/camel-web/target/schema>
     [copy] Copying 5 files to <https://builds.apache.org/job/Camel/ws/camel-trunk/components/camel-web/target/schema-src>
     [echo] Generating XSD schema
[schemagen] Generating schema from 5 source files
Note: Writing <https://builds.apache.org/job/Camel/ws/camel-trunk/components/camel-web/target/schema/camel-web.xsd>
[INFO] Executed tasks
[INFO] [remote-resources:process {execution: default}]
[INFO] [resources:resources {execution: default-resources}]
[INFO] Using 'UTF-8' encoding to copy filtered resources.
[INFO] Copying 7 resources
[INFO] Copying 3 resources
[INFO] [compiler:compile {execution: default-compile}]
[INFO] Compiling 28 source files to <https://builds.apache.org/job/Camel/ws/camel-trunk/components/camel-web/target/classes>
Processing Configuration for child elements
Processing child [project]
Processing child [warSourceDirectory]
Processing child [resourcesSourceDirectory]
Processing child [targetDirectory]
Processing child [classesDirectory]
Processing child [classPathElements]
[INFO] [scalate:precompile {execution: default}]
[INFO] Precompiling Scalate Templates into Scala classes...
[INFO]     processing <https://builds.apache.org/job/Camel/ws/camel-trunk/components/camel-web/src/main/webapp/WEB-INF/scalate/layouts/default.scaml>
[JENKINS] Archiving <https://builds.apache.org/job/Camel/ws/camel-trunk/components/camel-web/pom.xml>
to /home/hudson/hudson/jobs/Camel/modules/org.apache.camel$camel-web/builds/2011-07-11_02-40-24/archive/org.apache.camel/camel-web/2.8-SNAPSHOT/camel-web-2.8-SNAPSHOT.pom
[INFO] ------------------------------------------------------------------------
[ERROR] FATAL ERROR
[INFO] ------------------------------------------------------------------------
[INFO] assertion failed: List(object Byte, object Byte)
[INFO] ------------------------------------------------------------------------
[INFO] Trace
org.fusesource.scalate.TemplateException: assertion failed: List(object Byte, object Byte)
	at org.fusesource.scalate.TemplateEngine.compileAndLoad(TemplateEngine.scala:775)
	at org.fusesource.scalate.TemplateEngine.compileAndLoadEntry(TemplateEngine.scala:637)
	at org.fusesource.scalate.TemplateEngine.liftedTree1$1(TemplateEngine.scala:368)
	at org.fusesource.scalate.TemplateEngine.load(TemplateEngine.scala:362)
	at org.fusesource.scalate.TemplateEngine.load(TemplateEngine.scala:432)
	at org.fusesource.scalate.support.Precompiler$$anonfun$execute$3.apply(Precompiler.scala:92)
	at org.fusesource.scalate.support.Precompiler$$anonfun$execute$3.apply(Precompiler.scala:87)
	at scala.collection.LinearSeqOptimized$class.foreach(LinearSeqOptimized.scala:61)
	at scala.collection.immutable.List.foreach(List.scala:45)
	at org.fusesource.scalate.support.Precompiler.execute(Precompiler.scala:87)
	at sun.reflect.NativeMethodAccessorImpl.invoke0(Native Method)
	at sun.reflect.NativeMethodAccessorImpl.invoke(NativeMethodAccessorImpl.java:39)
	at sun.reflect.DelegatingMethodAccessorImpl.invoke(DelegatingMethodAccessorImpl.java:25)
	at java.lang.reflect.Method.invoke(Method.java:597)
	at org.fusesource.scalate.maven.PrecompileMojo.execute(PrecompileMojo.scala:125)
	at org.apache.maven.plugin.DefaultPluginManager.executeMojo(DefaultPluginManager.java:490)
	at hudson.maven.agent.PluginManagerInterceptor.executeMojo(PluginManagerInterceptor.java:182)
	at org.apache.maven.lifecycle.DefaultLifecycleExecutor.executeGoals(DefaultLifecycleExecutor.java:694)
	at org.apache.maven.lifecycle.DefaultLifecycleExecutor.executeGoalWithLifecycle(DefaultLifecycleExecutor.java:556)
	at org.apache.maven.lifecycle.DefaultLifecycleExecutor.executeGoal(DefaultLifecycleExecutor.java:535)
	at org.apache.maven.lifecycle.DefaultLifecycleExecutor.executeGoalAndHandleFailures(DefaultLifecycleExecutor.java:387)
	at org.apache.maven.lifecycle.DefaultLifecycleExecutor.executeTaskSegments(DefaultLifecycleExecutor.java:348)
	at org.apache.maven.lifecycle.DefaultLifecycleExecutor.execute(DefaultLifecycleExecutor.java:180)
	at org.apache.maven.lifecycle.LifecycleExecutorInterceptor.execute(LifecycleExecutorInterceptor.java:65)
	at org.apache.maven.DefaultMaven.doExecute(DefaultMaven.java:328)
	at org.apache.maven.DefaultMaven.execute(DefaultMaven.java:138)
	at org.apache.maven.cli.MavenCli.main(MavenCli.java:362)
	at sun.reflect.NativeMethodAccessorImpl.invoke0(Native Method)
	at sun.reflect.NativeMethodAccessorImpl.invoke(NativeMethodAccessorImpl.java:39)
	at sun.reflect.DelegatingMethodAccessorImpl.invoke(DelegatingMethodAccessorImpl.java:25)
	at java.lang.reflect.Method.invoke(Method.java:597)
	at org.codehaus.classworlds.Launcher.launchEnhanced(Launcher.java:315)
	at org.codehaus.classworlds.Launcher.launch(Launcher.java:255)
	at hudson.maven.agent.Main.launch(Main.java:185)
	at hudson.maven.MavenBuilder.call(MavenBuilder.java:164)
	at hudson.maven.MavenModuleSetBuild$Builder.call(MavenModuleSetBuild.java:987)
	at hudson.maven.MavenModuleSetBuild$Builder.call(MavenModuleSetBuild.java:918)
	at hudson.remoting.UserRequest.perform(UserRequest.java:118)
	at hudson.remoting.UserRequest.perform(UserRequest.java:48)
	at hudson.remoting.Request$2.run(Request.java:270)
	at java.util.concurrent.Executors$RunnableAdapter.call(Executors.java:441)
	at java.util.concurrent.FutureTask$Sync.innerRun(FutureTask.java:303)
	at java.util.concurrent.FutureTask.run(FutureTask.java:138)
	at java.util.concurrent.ThreadPoolExecutor$Worker.runTask(ThreadPoolExecutor.java:886)
	at java.util.concurrent.ThreadPoolExecutor$Worker.run(ThreadPoolExecutor.java:908)
	at java.lang.Thread.run(Thread.java:619)
Caused by: java.lang.AssertionError: assertion failed: List(object Byte, object Byte)
	at scala.tools.nsc.symtab.Symbols$Symbol.suchThat(Symbols.scala:1056)
	at scala.tools.nsc.symtab.Symbols$Symbol.companionModule0(Symbols.scala:1271)
	at scala.tools.nsc.symtab.Symbols$Symbol.companionModule(Symbols.scala:1281)
	at scala.tools.nsc.symtab.Symbols$Symbol.linkedClassOfClass(Symbols.scala:1302)
	at scala.tools.nsc.symtab.Definitions$definitions$.addModuleMethod$1(Definitions.scala:711)
	at scala.tools.nsc.symtab.Definitions$definitions$.initValueClasses(Definitions.scala:714)
	at scala.tools.nsc.symtab.Definitions$definitions$.init(Definitions.scala:791)
	at scala.tools.nsc.Global$Run.<init>(Global.scala:604)
	at org.fusesource.scalate.support.ScalaCompiler.compile(ScalaCompiler.scala:80)
	at org.fusesource.scalate.TemplateEngine.compileAndLoad(TemplateEngine.scala:691)
	... 45 more
[INFO] ------------------------------------------------------------------------
[INFO] Total time: 3 minutes 37 seconds
[INFO] Finished at: Sun Jul 10 19:44:28 PDT 2011
[INFO] Final Memory: 143M/360M
[INFO] ------------------------------------------------------------------------
Sending e-mails to: dev@camel.apache.org
channel stopped
[locks-and-latches] Releasing all the locks
[locks-and-latches] All the locks released


Mime
View raw message