camel-dev mailing list archives

Site index · List index
Message view « Date » · « Thread »
Top « Date » · « Thread »
From Apache Hudson Server <hud...@hudson.apache.org>
Subject Build failed in Hudson: Camel #1139
Date Tue, 08 Feb 2011 17:34:53 GMT
See <https://hudson.apache.org/hudson/job/Camel/1139/changes>

Changes:

[davsclaus] CAMEL-3584: Fixed concurrent writing the same file using file producer should
be synchronized.

[cschneider] CAMEL-3490

[cschneider] CAMEL-3490 Bugfixes, Added httpcontext so security can be handled

[cschneider] CAMEL-3638 Upgrade of maven bundle plugin to version 2.3.4

------------------------------------------
[...truncated 8600 lines...]
[WARNING] Warning building bundle org.apache.camel:camel-example-tracer:bundle:2.7-SNAPSHOT
: Did not find matching referal for org.apache.mina.*
[WARNING] Warning building bundle org.apache.camel:camel-example-tracer:bundle:2.7-SNAPSHOT
: Did not find matching referal for org.apache.qpid.*
[WARNING] Warning building bundle org.apache.camel:camel-example-tracer:bundle:2.7-SNAPSHOT
: Did not find matching referal for org.apache.velocity.*
[WARNING] Warning building bundle org.apache.camel:camel-example-tracer:bundle:2.7-SNAPSHOT
: Did not find matching referal for org.apache.xmlbeans.*
[WARNING] Warning building bundle org.apache.camel:camel-example-tracer:bundle:2.7-SNAPSHOT
: Did not find matching referal for org.ccil.cowan.tagsoup.*
[WARNING] Warning building bundle org.apache.camel:camel-example-tracer:bundle:2.7-SNAPSHOT
: Did not find matching referal for org.eclipse.jetty.*
[WARNING] Warning building bundle org.apache.camel:camel-example-tracer:bundle:2.7-SNAPSHOT
: Did not find matching referal for org.jivesoftware.smack.*
[WARNING] Warning building bundle org.apache.camel:camel-example-tracer:bundle:2.7-SNAPSHOT
: Did not find matching referal for org.mortbay.cometd.*
[INFO] [build-helper:attach-artifact {execution: attach-artifacts}]
[INFO] [ianal:verify-legal-files {execution: default}]
[INFO] Checking legal files in: camel-example-tracer-2.7-SNAPSHOT.jar
[INFO] [install:install {execution: default-install}]
[INFO] Installing <https://hudson.apache.org/hudson/job/Camel/ws/camel-trunk/examples/camel-example-tracer/target/camel-example-tracer-2.7-SNAPSHOT.jar>
to <https://hudson.apache.org/hudson/job/Camel/ws/.repository/org/apache/camel/camel-example-tracer/2.7-SNAPSHOT/camel-example-tracer-2.7-SNAPSHOT.jar>
[INFO] Installing <https://hudson.apache.org/hudson/job/Camel/ws/camel-trunk/examples/camel-example-tracer/target/classes/features.xml>
to <https://hudson.apache.org/hudson/job/Camel/ws/.repository/org/apache/camel/camel-example-tracer/2.7-SNAPSHOT/camel-example-tracer-2.7-SNAPSHOT-features.xml>
[INFO] [bundle:install {execution: default-install}]
[INFO] Parsing <https://hudson.apache.org/hudson/job/Camel/ws/.repository/repository.xml>
[INFO] Installing org/apache/camel/camel-example-tracer/2.7-SNAPSHOT/camel-example-tracer-2.7-SNAPSHOT.jar
[INFO] Writing OBR metadata
[HUDSON] Archiving <https://hudson.apache.org/hudson/job/Camel/ws/camel-trunk/examples/camel-example-tracer/pom.xml>
to /home/hudson/hudson/jobs/Camel/modules/org.apache.camel$camel-example-tracer/builds/2011-02-08_17-03-39/archive/org.apache.camel/camel-example-tracer/2.7-SNAPSHOT/pom.xml
[HUDSON] Archiving <https://hudson.apache.org/hudson/job/Camel/ws/camel-trunk/examples/camel-example-tracer/target/camel-example-tracer-2.7-SNAPSHOT.jar>
to /home/hudson/hudson/jobs/Camel/modules/org.apache.camel$camel-example-tracer/builds/2011-02-08_17-03-39/archive/org.apache.camel/camel-example-tracer/2.7-SNAPSHOT/camel-example-tracer-2.7-SNAPSHOT.jar
[HUDSON] Archiving <https://hudson.apache.org/hudson/job/Camel/ws/camel-trunk/examples/camel-example-tracer/target/classes/features.xml>
to /home/hudson/hudson/jobs/Camel/modules/org.apache.camel$camel-example-tracer/builds/2011-02-08_17-03-39/archive/org.apache.camel/camel-example-tracer/2.7-SNAPSHOT/features.xml
[INFO] ------------------------------------------------------------------------
[INFO] SKIPPING Camel :: Assembly
[INFO]    task-segment: [clean, install]
[INFO] This project has been banned from further executions due to previous failures.
[INFO] ------------------------------------------------------------------------
[INFO] 
[INFO] 
[INFO] ------------------------------------------------------------------------
[INFO] Reactor Summary:
[INFO] ------------------------------------------------------------------------
[INFO] Camel ................................................. SUCCESS [11.027s]
[INFO] Apache :: Camel Buildtools ............................ SUCCESS [2.825s]
[INFO] Camel :: Parent ....................................... SUCCESS [1.283s]
[INFO] Camel :: Core ......................................... SUCCESS [25.905s]
[INFO] Camel :: Core XML ..................................... SUCCESS [2.257s]
[INFO] Camel :: Core OSGi .................................... SUCCESS [2.962s]
[INFO] Camel :: Spring ....................................... SUCCESS [13.374s]
[INFO] Camel :: Test ......................................... SUCCESS [2.480s]
[INFO] Camel :: JMS .......................................... SUCCESS [6.384s]
[INFO] Camel :: AMQP ......................................... SUCCESS [3.076s]
[INFO] Camel :: Atom ......................................... SUCCESS [2.832s]
[INFO] Camel :: AWS .......................................... SUCCESS [4.292s]
[INFO] Camel :: JUEL ......................................... SUCCESS [2.402s]
[INFO] Camel :: BAM .......................................... SUCCESS [2.704s]
[INFO] Camel :: Bean validator ............................... SUCCESS [2.317s]
[INFO] Camel :: Bindy ........................................ SUCCESS [4.215s]
[INFO] Camel :: Blueprint .................................... SUCCESS [4.396s]
[INFO] Camel :: Stream ....................................... SUCCESS [1.998s]
[INFO] Camel :: Cometd ....................................... SUCCESS [2.626s]
[INFO] Camel :: Components ................................... SUCCESS [0.308s]
[INFO] Camel :: Cache ........................................ SUCCESS [2.312s]
[INFO] Camel :: Castor ....................................... SUCCESS [2.278s]
[INFO] Camel :: Crypto ....................................... SUCCESS [2.452s]
[INFO] Camel :: CSV .......................................... SUCCESS [2.086s]
[INFO] Camel :: HTTP ......................................... SUCCESS [2.480s]
[INFO] Camel :: Jetty ........................................ SUCCESS [5.318s]
[INFO] Camel :: CXF .......................................... SUCCESS [14.841s]
[INFO] Camel :: Dozer ........................................ SUCCESS [2.016s]
[INFO] Camel :: Eclipse ...................................... SUCCESS [2.655s]
[INFO] Camel :: EJB .......................................... SUCCESS [2.859s]
[INFO] Camel :: Event Admin .................................. SUCCESS [1.241s]
[INFO] Camel :: Exec ......................................... SUCCESS [2.277s]
[INFO] Camel :: FlatPack ..................................... SUCCESS [2.349s]
[INFO] Camel :: Freemarker ................................... SUCCESS [1.947s]
[INFO] Camel :: FTP .......................................... FAILED [1.879s]
[INFO] Camel :: Servlet ...................................... SUCCESS [5.504s]
[INFO] Camel :: GAE .......................................... SUCCESS [3.704s]
[INFO] Camel :: Guice ........................................ SUCCESS [2.138s]
[INFO] Camel :: Groovy ....................................... SUCCESS [7.398s]
[INFO] Camel :: HawtDB ....................................... SUCCESS [2.421s]
[INFO] Camel :: HTTP4 (HttpClient 4.x) ....................... SUCCESS [3.079s]
[INFO] Camel :: MINA ......................................... SUCCESS [3.631s]
[INFO] Camel :: HL7 .......................................... SUCCESS [2.693s]
[INFO] Camel :: iBatis ....................................... SUCCESS [4.223s]
[INFO] Camel :: IRC .......................................... SUCCESS [2.286s]
[INFO] Camel :: Jackson ...................................... SUCCESS [1.928s]
[INFO] Camel :: Javaspace .................................... SUCCESS [2.124s]
[INFO] Camel :: JAXB ......................................... SUCCESS [3.187s]
[INFO] Camel :: Jibx ......................................... SUCCESS [8.525s]
[INFO] Camel :: JDBC ......................................... SUCCESS [2.365s]
[INFO] Camel :: JDBC :: Aggregator ........................... SUCCESS [2.385s]
[INFO] Camel :: Jing ......................................... SUCCESS [2.139s]
[INFO] Camel :: JMX .......................................... SUCCESS [3.604s]
[INFO] Camel :: JoSQL ........................................ SUCCESS [2.145s]
[INFO] Camel :: Jasypt ....................................... SUCCESS [2.437s]
[INFO] Camel :: JCR .......................................... SUCCESS [2.769s]
[INFO] Camel :: JPA .......................................... SUCCESS [3.871s]
[INFO] Camel :: Java Toolbox for AS/400 ...................... SUCCESS [2.331s]
[INFO] Camel :: JXPath ....................................... SUCCESS [2.026s]
[INFO] Camel :: Kestrel ...................................... SUCCESS [2.015s]
[INFO] Camel :: LDAP ......................................... SUCCESS [2.980s]
[INFO] Camel :: Lucene ....................................... SUCCESS [2.027s]
[INFO] Camel :: Mail ......................................... SUCCESS [2.907s]
[INFO] Camel :: MSV .......................................... SUCCESS [2.112s]
[INFO] Camel :: MVEL ......................................... SUCCESS [1.762s]
[INFO] Camel :: Netty ........................................ SUCCESS [2.883s]
[INFO] Camel :: Nagios ....................................... SUCCESS [1.958s]
[INFO] Camel :: OGNL ......................................... SUCCESS [1.834s]
[INFO] Camel :: Pax Logging .................................. SUCCESS [1.758s]
[INFO] Camel :: Printer ...................................... SUCCESS [1.944s]
[INFO] Camel :: Protobuf ..................................... SUCCESS [2.307s]
[INFO] Camel :: Quartz ....................................... SUCCESS [2.331s]
[INFO] Camel :: QuickFIX/J ................................... SUCCESS [5.104s]
[INFO] Camel :: Restlet ...................................... SUCCESS [2.261s]
[INFO] Camel :: RMI .......................................... SUCCESS [1.944s]
[INFO] Camel :: Routebox ..................................... SUCCESS [2.170s]
[INFO] Camel :: Ruby ......................................... SUCCESS [2.337s]
[INFO] Camel :: RSS .......................................... SUCCESS [2.891s]
[INFO] Camel :: SAXON ........................................ SUCCESS [2.482s]
[INFO] Camel :: Velocity ..................................... SUCCESS [2.111s]
[INFO] Camel :: Scala ........................................ SUCCESS [30.458s]
[INFO] Camel :: Script ....................................... SUCCESS [2.843s]
[INFO] Camel :: SIP .......................................... SUCCESS [2.287s]
[INFO] Camel :: Shiro ........................................ SUCCESS [1.852s]
[INFO] Camel :: SMPP ......................................... SUCCESS [2.427s]
[INFO] Camel :: SNMP ......................................... SUCCESS [1.795s]
[INFO] Camel :: SOAP ......................................... SUCCESS [9.910s]
[INFO] Camel :: Spring Integration ........................... SUCCESS [2.120s]
[INFO] Camel :: Spring JavaConfig ............................ SUCCESS [2.141s]
[INFO] Camel :: Spring Security .............................. SUCCESS [2.050s]
[INFO] Camel :: Spring Web Services .......................... SUCCESS [2.512s]
[INFO] Camel :: SQL .......................................... SUCCESS [2.028s]
[INFO] Camel :: StringTemplate ............................... SUCCESS [1.980s]
[INFO] Camel :: Syslog ....................................... SUCCESS [2.797s]
[INFO] Camel :: TagSoup ...................................... SUCCESS [1.817s]
[INFO] Camel :: XMLBeans ..................................... SUCCESS [2.003s]
[INFO] Camel :: XML Security ................................. SUCCESS [2.177s]
[INFO] Camel :: XMPP ......................................... SUCCESS [1.966s]
[INFO] Camel :: XStream ...................................... SUCCESS [1.956s]
[INFO] Camel :: Web .......................................... SUCCESS [3:34.690s]
[INFO] Camel :: Web :: Standalone ............................ SUCCESS [10.246s]
[INFO] Camel :: Platforms .................................... SUCCESS [0.331s]
[INFO] Camel :: Platforms :: Apache Karaf .................... SUCCESS [0.345s]
[INFO] Camel :: Platforms :: Apache Karaf :: Features ........ SUCCESS [0.518s]
[INFO] Camel :: Maven Plugins ................................ SUCCESS [0.563s]
[INFO] Camel :: Maven Camel Plugin ........................... SUCCESS [4.462s]
[INFO] Camel :: Maven Guice Plugin ........................... SUCCESS [2.655s]
[INFO] Camel :: Html to Pdf Plugin ........................... SUCCESS [2.301s]
[INFO] Camel :: Archetypes :: Camel Router with ActiveMQ ..... SUCCESS [1.468s]
[INFO] Camel :: Archetypes :: Component ...................... SUCCESS [1.037s]
[INFO] Camel :: Archetypes :: Router ......................... SUCCESS [0.716s]
[INFO] Camel :: Archetypes :: Scala Router ................... SUCCESS [0.806s]
[INFO] Camel :: Archetypes :: Spring XML Based Router ........ SUCCESS [0.461s]
[INFO] Camel :: Archetypes :: Camel Router WAR ............... SUCCESS [0.436s]
[INFO] Camel :: Archetypes ................................... SUCCESS [0.295s]
[INFO] Camel :: Manual ....................................... SUCCESS [0.609s]
[INFO] Camel :: Tooling ...................................... SUCCESS [0.282s]
[INFO] Camel :: Tests Bundles ................................ SUCCESS [1.678s]
[INFO] Camel :: Test Bundles: mock-javamail-1.7 .............. SUCCESS [1.583s]
[INFO] Camel :: Integration Tests :: Standalone .............. SUCCESS [1.863s]
[INFO] Camel :: Integration Tests ............................ SKIPPED (dependency build failed
or was skipped)
[INFO] Camel :: Partial Classpath Tests ...................... SUCCESS [2.040s]
[INFO] Camel :: OSGi Integration Tests ....................... SUCCESS [14.707s]
[INFO] Camel :: Tests ........................................ SUCCESS [0.370s]
[INFO] Camel :: Examples ..................................... SUCCESS [0.333s]
[INFO] Camel :: Example :: Aggregate ......................... SUCCESS [1.235s]
[INFO] Camel :: Example :: Axis .............................. SUCCESS [4.931s]
[INFO] Camel :: Example :: BAM ............................... SUCCESS [1.913s]
[INFO] Camel :: Example :: Cafe .............................. SUCCESS [2.075s]
[INFO] Camel :: Example :: CXF ............................... SUCCESS [5.751s]
[INFO] Camel :: Example :: CXF Proxy ......................... SUCCESS [4.088s]
[INFO] Camel :: Example :: CXF Tomcat ........................ SUCCESS [3.940s]
[INFO] Camel :: Example :: Docs .............................. SUCCESS [2.472s]
[INFO] Camel :: Example :: ETL ............................... SUCCESS [9.013s]
[INFO] Camel :: Example :: GAE ............................... SUCCESS [6.092s]
[INFO] Camel :: Example :: GAuth ............................. SUCCESS [6.175s]
[INFO] Camel :: Example :: Guice :: JMS ...................... SUCCESS [2.298s]
[INFO] Camel :: Example :: JMX ............................... SUCCESS [1.563s]
[INFO] Camel :: Example :: JMS-File .......................... SUCCESS [1.907s]
[INFO] Camel :: Example :: Loadbalancer camel-mina ........... SUCCESS [1.731s]
[INFO] Camel :: Example :: Loan-Broker ....................... SUCCESS [3.015s]
[INFO] Camel :: Example :: Management ........................ SUCCESS [1.961s]
[INFO] Camel :: Example :: OSGi .............................. SUCCESS [1.290s]
[INFO] Camel :: Example :: POJO Messaging .................... SUCCESS [1.954s]
[INFO] Camel :: Example :: Report Incident ................... SUCCESS [7.027s]
[INFO] Camel :: Example :: Report Incident :: WS-Security .... SUCCESS [5.173s]
[INFO] Camel :: Example :: Route :: Throttling ............... SUCCESS [1.324s]
[INFO] Camel :: Example :: Simple Jira Bot ................... SUCCESS [0.479s]
[INFO] Camel :: Example :: Simple Jira Bot :: Java DSL ....... SUCCESS [1.301s]
[INFO] Camel :: Example :: Simple Jira Bot :: XML Configuration  SUCCESS [1.232s]
[INFO] Camel :: Example :: Spring ............................ SUCCESS [2.318s]
[INFO] Camel :: Example :: Spring :: JavaConfig .............. SUCCESS [2.081s]
[INFO] Camel :: Example :: Spring :: JMS ..................... SUCCESS [2.220s]
[INFO] Camel :: Example :: Spring Web Services ............... SUCCESS [3.959s]
[INFO] Camel :: Example :: Spring :: XQuery .................. SUCCESS [1.126s]
[INFO] Camel :: Example :: Spring Security ................... SUCCESS [2.828s]
[INFO] Camel :: Example :: Tracer ............................ SUCCESS [1.393s]
[INFO] Camel :: Assembly ..................................... SKIPPED (dependency build failed
or was skipped)
[INFO] ------------------------------------------------------------------------
[INFO] Error for project: Camel :: FTP (during install)
[INFO] ------------------------------------------------------------------------
[INFO] Compilation failure
<https://hudson.apache.org/hudson/job/Camel/ws/camel-trunk/components/camel-ftp/src/main/java/org/apache/camel/component/file/remote/RemoteFileProducer.java>:[49,8]
processExchange(org.apache.camel.Exchange,java.lang.String) in org.apache.camel.component.file.GenericFileProducer<T>
cannot be applied to (org.apache.camel.Exchange)

[INFO] ------------------------------------------------------------------------
[INFO] Trace
org.apache.maven.BuildFailureException: Compilation failure
<https://hudson.apache.org/hudson/job/Camel/ws/camel-trunk/components/camel-ftp/src/main/java/org/apache/camel/component/file/remote/RemoteFileProducer.java>:[49,8]
processExchange(org.apache.camel.Exchange,java.lang.String) in org.apache.camel.component.file.GenericFileProducer<T>
cannot be applied to (org.apache.camel.Exchange)

	at org.apache.maven.lifecycle.DefaultLifecycleExecutor.executeGoals(DefaultLifecycleExecutor.java:715)
	at org.apache.maven.lifecycle.DefaultLifecycleExecutor.executeGoalWithLifecycle(DefaultLifecycleExecutor.java:556)
	at org.apache.maven.lifecycle.DefaultLifecycleExecutor.executeGoal(DefaultLifecycleExecutor.java:535)
	at org.apache.maven.lifecycle.DefaultLifecycleExecutor.executeGoalAndHandleFailures(DefaultLifecycleExecutor.java:387)
	at org.apache.maven.lifecycle.DefaultLifecycleExecutor.executeTaskSegments(DefaultLifecycleExecutor.java:348)
	at org.apache.maven.lifecycle.DefaultLifecycleExecutor.execute(DefaultLifecycleExecutor.java:180)
	at org.apache.maven.lifecycle.LifecycleExecutorInterceptor.execute(LifecycleExecutorInterceptor.java:65)
	at org.apache.maven.DefaultMaven.doExecute(DefaultMaven.java:328)
	at org.apache.maven.DefaultMaven.execute(DefaultMaven.java:138)
	at org.apache.maven.cli.MavenCli.main(MavenCli.java:362)
	at sun.reflect.NativeMethodAccessorImpl.invoke0(Native Method)
	at sun.reflect.NativeMethodAccessorImpl.invoke(NativeMethodAccessorImpl.java:39)
	at sun.reflect.DelegatingMethodAccessorImpl.invoke(DelegatingMethodAccessorImpl.java:25)
	at java.lang.reflect.Method.invoke(Method.java:597)
	at org.codehaus.classworlds.Launcher.launchEnhanced(Launcher.java:315)
	at org.codehaus.classworlds.Launcher.launch(Launcher.java:255)
	at hudson.maven.agent.Main.launch(Main.java:173)
	at hudson.maven.MavenBuilder.call(MavenBuilder.java:164)
	at hudson.maven.MavenModuleSetBuild$Builder.call(MavenModuleSetBuild.java:868)
	at hudson.maven.MavenModuleSetBuild$Builder.call(MavenModuleSetBuild.java:799)
	at hudson.remoting.UserRequest.perform(UserRequest.java:114)
	at hudson.remoting.UserRequest.perform(UserRequest.java:48)
	at hudson.remoting.Request$2.run(Request.java:270)
	at java.util.concurrent.Executors$RunnableAdapter.call(Executors.java:441)
	at java.util.concurrent.FutureTask$Sync.innerRun(FutureTask.java:303)
	at java.util.concurrent.FutureTask.run(FutureTask.java:138)
	at java.util.concurrent.ThreadPoolExecutor$Worker.runTask(ThreadPoolExecutor.java:886)
	at java.util.concurrent.ThreadPoolExecutor$Worker.run(ThreadPoolExecutor.java:908)
	at java.lang.Thread.run(Thread.java:619)
Caused by: org.apache.maven.plugin.CompilationFailureException: Compilation failure
<https://hudson.apache.org/hudson/job/Camel/ws/camel-trunk/components/camel-ftp/src/main/java/org/apache/camel/component/file/remote/RemoteFileProducer.java>:[49,8]
processExchange(org.apache.camel.Exchange,java.lang.String) in org.apache.camel.component.file.GenericFileProducer<T>
cannot be applied to (org.apache.camel.Exchange)

	at org.apache.maven.plugin.AbstractCompilerMojo.execute(AbstractCompilerMojo.java:656)
	at org.apache.maven.plugin.CompilerMojo.execute(CompilerMojo.java:128)
	at org.apache.maven.plugin.DefaultPluginManager.executeMojo(DefaultPluginManager.java:490)
	at hudson.maven.agent.PluginManagerInterceptor.executeMojo(PluginManagerInterceptor.java:182)
	at org.apache.maven.lifecycle.DefaultLifecycleExecutor.executeGoals(DefaultLifecycleExecutor.java:694)
	... 28 more
[INFO] ------------------------------------------------------------------------
[INFO] BUILD ERRORS
[INFO] ------------------------------------------------------------------------
[INFO] Total time: 30 minutes 38 seconds
[INFO] Finished at: Tue Feb 08 17:35:09 UTC 2011
[INFO] Final Memory: 410M/707M
[INFO] ------------------------------------------------------------------------
Sending e-mails to: dev@camel.apache.org
channel stopped
[locks-and-latches] Releasing all the locks
[locks-and-latches] All the locks released


Mime
View raw message