camel-dev mailing list archives

Site index · List index
Message view « Date » · « Thread »
Top « Date » · « Thread »
From Apache Hudson Server <hud...@hudson.apache.org>
Subject Build failed in Hudson: Camel #1133
Date Thu, 03 Feb 2011 02:10:36 GMT
See <https://hudson.apache.org/hudson/job/Camel/1133/changes>

Changes:

[gnodet] [CAMEL-3614] When the OsgiTypeConverter looks for TypeConverterLoader services in
the OSGi registry, it should use its own BundleContext instead of the one from the client
bundle so that class space consistency can be fully enforced

[rajdavies] Fix for https://issues.apache.org/jira/browse/CAMEL-3616

------------------------------------------
[...truncated 1828 lines...]
[INFO]    task-segment: [clean, install]
[INFO] This project has been banned from further executions due to previous failures.
[INFO] ------------------------------------------------------------------------
[INFO] ------------------------------------------------------------------------
[INFO] SKIPPING Camel :: Example :: Spring Security
[INFO]    task-segment: [clean, install]
[INFO] This project has been banned from further executions due to previous failures.
[INFO] ------------------------------------------------------------------------
[INFO] ------------------------------------------------------------------------
[INFO] SKIPPING Camel :: Example :: Tracer
[INFO]    task-segment: [clean, install]
[INFO] This project has been banned from further executions due to previous failures.
[INFO] ------------------------------------------------------------------------
[INFO] ------------------------------------------------------------------------
[INFO] SKIPPING Camel :: Assembly
[INFO]    task-segment: [clean, install]
[INFO] This project has been banned from further executions due to previous failures.
[INFO] ------------------------------------------------------------------------
[INFO] 
[INFO] 
[INFO] ------------------------------------------------------------------------
[INFO] Reactor Summary:
[INFO] ------------------------------------------------------------------------
[INFO] Camel ................................................. SUCCESS [7.174s]
[INFO] Apache :: Camel Buildtools ............................ SUCCESS [1.977s]
[INFO] Camel :: Parent ....................................... SUCCESS [0.823s]
[INFO] Camel :: Core ......................................... SUCCESS [21.074s]
[INFO] Camel :: Core XML ..................................... SUCCESS [2.079s]
[INFO] Camel :: Core OSGi .................................... SUCCESS [2.361s]
[INFO] Camel :: Spring ....................................... FAILED [4.968s]
[INFO] Camel :: Test ......................................... SKIPPED (dependency build failed
or was skipped)
[INFO] Camel :: JMS .......................................... SKIPPED (dependency build failed
or was skipped)
[INFO] Camel :: AMQP ......................................... SKIPPED (dependency build failed
or was skipped)
[INFO] Camel :: Atom ......................................... SKIPPED (dependency build failed
or was skipped)
[INFO] Camel :: AWS .......................................... SKIPPED (dependency build failed
or was skipped)
[INFO] Camel :: JUEL ......................................... SUCCESS [2.412s]
[INFO] Camel :: BAM .......................................... SKIPPED (dependency build failed
or was skipped)
[INFO] Camel :: Bean validator ............................... SKIPPED (dependency build failed
or was skipped)
[INFO] Camel :: Bindy ........................................ SKIPPED (dependency build failed
or was skipped)
[INFO] Camel :: Blueprint .................................... SUCCESS [4.279s]
[INFO] Camel :: Stream ....................................... SKIPPED (dependency build failed
or was skipped)
[INFO] Camel :: Cometd ....................................... SKIPPED (dependency build failed
or was skipped)
[INFO] Camel :: Components ................................... SUCCESS [0.239s]
[INFO] Camel :: Cache ........................................ SKIPPED (dependency build failed
or was skipped)
[INFO] Camel :: Castor ....................................... SKIPPED (dependency build failed
or was skipped)
[INFO] Camel :: Crypto ....................................... SKIPPED (dependency build failed
or was skipped)
[INFO] Camel :: CSV .......................................... SKIPPED (dependency build failed
or was skipped)
[INFO] Camel :: HTTP ......................................... SKIPPED (dependency build failed
or was skipped)
[INFO] Camel :: Jetty ........................................ SKIPPED (dependency build failed
or was skipped)
[INFO] Camel :: CXF .......................................... SKIPPED (dependency build failed
or was skipped)
[INFO] Camel :: Dozer ........................................ SKIPPED (dependency build failed
or was skipped)
[INFO] Camel :: Eclipse ...................................... SKIPPED (dependency build failed
or was skipped)
[INFO] Camel :: EJB .......................................... SKIPPED (dependency build failed
or was skipped)
[INFO] Camel :: Event Admin .................................. SKIPPED (dependency build failed
or was skipped)
[INFO] Camel :: Exec ......................................... SKIPPED (dependency build failed
or was skipped)
[INFO] Camel :: FlatPack ..................................... SKIPPED (dependency build failed
or was skipped)
[INFO] Camel :: Freemarker ................................... SKIPPED (dependency build failed
or was skipped)
[INFO] Camel :: FTP .......................................... SKIPPED (dependency build failed
or was skipped)
[INFO] Camel :: Servlet ...................................... SKIPPED (dependency build failed
or was skipped)
[INFO] Camel :: GAE .......................................... SKIPPED (dependency build failed
or was skipped)
[INFO] Camel :: Guice ........................................ SUCCESS [1.968s]
[INFO] Camel :: Groovy ....................................... SKIPPED (dependency build failed
or was skipped)
[INFO] Camel :: HawtDB ....................................... SKIPPED (dependency build failed
or was skipped)
[INFO] Camel :: HTTP4 (HttpClient 4.x) ....................... SKIPPED (dependency build failed
or was skipped)
[INFO] Camel :: MINA ......................................... SKIPPED (dependency build failed
or was skipped)
[INFO] Camel :: HL7 .......................................... SKIPPED (dependency build failed
or was skipped)
[INFO] Camel :: iBatis ....................................... SKIPPED (dependency build failed
or was skipped)
[INFO] Camel :: IRC .......................................... SKIPPED (dependency build failed
or was skipped)
[INFO] Camel :: Jackson ...................................... SKIPPED (dependency build failed
or was skipped)
[INFO] Camel :: Javaspace .................................... SKIPPED (dependency build failed
or was skipped)
[INFO] Camel :: JAXB ......................................... SKIPPED (dependency build failed
or was skipped)
[INFO] Camel :: Jibx ......................................... SKIPPED (dependency build failed
or was skipped)
[INFO] Camel :: JDBC ......................................... SKIPPED (dependency build failed
or was skipped)
[INFO] Camel :: JDBC :: Aggregator ........................... SKIPPED (dependency build failed
or was skipped)
[INFO] Camel :: Jing ......................................... SKIPPED (dependency build failed
or was skipped)
[INFO] Camel :: JMX .......................................... SUCCESS [3.747s]
[INFO] Camel :: JoSQL ........................................ SKIPPED (dependency build failed
or was skipped)
[INFO] Camel :: Jasypt ....................................... SKIPPED (dependency build failed
or was skipped)
[INFO] Camel :: JCR .......................................... SKIPPED (dependency build failed
or was skipped)
[INFO] Camel :: JPA .......................................... SKIPPED (dependency build failed
or was skipped)
[INFO] Camel :: Java Toolbox for AS/400 ...................... SKIPPED (dependency build failed
or was skipped)
[INFO] Camel :: JXPath ....................................... SKIPPED (dependency build failed
or was skipped)
[INFO] Camel :: Kestrel ...................................... SKIPPED (dependency build failed
or was skipped)
[INFO] Camel :: LDAP ......................................... SKIPPED (dependency build failed
or was skipped)
[INFO] Camel :: Lucene ....................................... SKIPPED (dependency build failed
or was skipped)
[INFO] Camel :: Mail ......................................... SKIPPED (dependency build failed
or was skipped)
[INFO] Camel :: MSV .......................................... SKIPPED (dependency build failed
or was skipped)
[INFO] Camel :: MVEL ......................................... SKIPPED (dependency build failed
or was skipped)
[INFO] Camel :: Netty ........................................ SKIPPED (dependency build failed
or was skipped)
[INFO] Camel :: Nagios ....................................... SKIPPED (dependency build failed
or was skipped)
[INFO] Camel :: OGNL ......................................... SKIPPED (dependency build failed
or was skipped)
[INFO] Camel :: Pax Logging .................................. SKIPPED (dependency build failed
or was skipped)
[INFO] Camel :: Printer ...................................... SKIPPED (dependency build failed
or was skipped)
[INFO] Camel :: Protobuf ..................................... SKIPPED (dependency build failed
or was skipped)
[INFO] Camel :: Quartz ....................................... SKIPPED (dependency build failed
or was skipped)
[INFO] Camel :: QuickFIX/J ................................... SKIPPED (dependency build failed
or was skipped)
[INFO] Camel :: Restlet ...................................... SKIPPED (dependency build failed
or was skipped)
[INFO] Camel :: RMI .......................................... SKIPPED (dependency build failed
or was skipped)
[INFO] Camel :: Routebox ..................................... SKIPPED (dependency build failed
or was skipped)
[INFO] Camel :: Ruby ......................................... SKIPPED (dependency build failed
or was skipped)
[INFO] Camel :: RSS .......................................... SKIPPED (dependency build failed
or was skipped)
[INFO] Camel :: SAXON ........................................ SKIPPED (dependency build failed
or was skipped)
[INFO] Camel :: Velocity ..................................... SKIPPED (dependency build failed
or was skipped)
[INFO] Camel :: Scala ........................................ SKIPPED (dependency build failed
or was skipped)
[INFO] Camel :: Script ....................................... SKIPPED (dependency build failed
or was skipped)
[INFO] Camel :: SIP .......................................... SKIPPED (dependency build failed
or was skipped)
[INFO] Camel :: Shiro ........................................ SKIPPED (dependency build failed
or was skipped)
[INFO] Camel :: SMPP ......................................... SKIPPED (dependency build failed
or was skipped)
[INFO] Camel :: SNMP ......................................... SKIPPED (dependency build failed
or was skipped)
[INFO] Camel :: SOAP ......................................... SKIPPED (dependency build failed
or was skipped)
[INFO] Camel :: Spring Integration ........................... SKIPPED (dependency build failed
or was skipped)
[INFO] Camel :: Spring JavaConfig ............................ SKIPPED (dependency build failed
or was skipped)
[INFO] Camel :: Spring Security .............................. SKIPPED (dependency build failed
or was skipped)
[INFO] Camel :: Spring Web Services .......................... SKIPPED (dependency build failed
or was skipped)
[INFO] Camel :: SQL .......................................... SKIPPED (dependency build failed
or was skipped)
[INFO] Camel :: StringTemplate ............................... SKIPPED (dependency build failed
or was skipped)
[INFO] Camel :: Syslog ....................................... SKIPPED (dependency build failed
or was skipped)
[INFO] Camel :: TagSoup ...................................... SKIPPED (dependency build failed
or was skipped)
[INFO] Camel :: XMLBeans ..................................... SKIPPED (dependency build failed
or was skipped)
[INFO] Camel :: XML Security ................................. SKIPPED (dependency build failed
or was skipped)
[INFO] Camel :: XMPP ......................................... SKIPPED (dependency build failed
or was skipped)
[INFO] Camel :: XStream ...................................... SKIPPED (dependency build failed
or was skipped)
[INFO] Camel :: Web .......................................... SKIPPED (dependency build failed
or was skipped)
[INFO] Camel :: Web :: Standalone ............................ SKIPPED (dependency build failed
or was skipped)
[INFO] Camel :: Platforms .................................... SUCCESS [0.316s]
[INFO] Camel :: Platforms :: Apache Karaf .................... SUCCESS [0.263s]
[INFO] Camel :: Platforms :: Apache Karaf :: Features ........ SUCCESS [0.598s]
[INFO] Camel :: Maven Plugins ................................ SUCCESS [0.543s]
[INFO] Camel :: Maven Camel Plugin ........................... SKIPPED (dependency build failed
or was skipped)
[INFO] Camel :: Maven Guice Plugin ........................... SUCCESS [3.116s]
[INFO] Camel :: Html to Pdf Plugin ........................... SKIPPED (dependency build failed
or was skipped)
[INFO] Camel :: Archetypes :: Camel Router with ActiveMQ ..... SUCCESS [2.399s]
[INFO] Camel :: Archetypes :: Component ...................... SUCCESS [0.435s]
[INFO] Camel :: Archetypes :: Router ......................... SUCCESS [0.376s]
[INFO] Camel :: Archetypes :: Scala Router ................... SUCCESS [0.417s]
[INFO] Camel :: Archetypes :: Spring XML Based Router ........ SUCCESS [0.420s]
[INFO] Camel :: Archetypes :: Camel Router WAR ............... SUCCESS [0.895s]
[INFO] Camel :: Archetypes ................................... SUCCESS [0.657s]
[INFO] Camel :: Manual ....................................... SKIPPED (dependency build failed
or was skipped)
[INFO] Camel :: Tooling ...................................... SUCCESS [0.306s]
[INFO] Camel :: Tests Bundles ................................ SUCCESS [1.619s]
[INFO] Camel :: Test Bundles: mock-javamail-1.7 .............. SUCCESS [1.468s]
[INFO] Camel :: Integration Tests :: Standalone .............. SUCCESS [1.640s]
[INFO] Camel :: Integration Tests ............................ SKIPPED (dependency build failed
or was skipped)
[INFO] Camel :: ITest :: Spring 2.0 .......................... SKIPPED (dependency build failed
or was skipped)
[INFO] Camel :: ITest :: Spring 2.5 .......................... SKIPPED (dependency build failed
or was skipped)
[INFO] Camel :: Partial Classpath Tests ...................... SKIPPED (dependency build failed
or was skipped)
[INFO] Camel :: OSGi Integration Tests ....................... SKIPPED (dependency build failed
or was skipped)
[INFO] Camel :: Tests ........................................ SUCCESS [0.435s]
[INFO] Camel :: Examples ..................................... SUCCESS [0.318s]
[INFO] Camel :: Example :: Aggregate ......................... SKIPPED (dependency build failed
or was skipped)
[INFO] Camel :: Example :: Axis .............................. SKIPPED (dependency build failed
or was skipped)
[INFO] Camel :: Example :: BAM ............................... SKIPPED (dependency build failed
or was skipped)
[INFO] Camel :: Example :: Cafe .............................. SKIPPED (dependency build failed
or was skipped)
[INFO] Camel :: Example :: CXF ............................... SKIPPED (dependency build failed
or was skipped)
[INFO] Camel :: Example :: CXF Proxy ......................... SKIPPED (dependency build failed
or was skipped)
[INFO] Camel :: Example :: CXF Tomcat ........................ SKIPPED (dependency build failed
or was skipped)
[INFO] Camel :: Example :: Docs .............................. SKIPPED (dependency build failed
or was skipped)
[INFO] Camel :: Example :: ETL ............................... SKIPPED (dependency build failed
or was skipped)
[INFO] Camel :: Example :: GAE ............................... SKIPPED (dependency build failed
or was skipped)
[INFO] Camel :: Example :: GAuth ............................. SKIPPED (dependency build failed
or was skipped)
[INFO] Camel :: Example :: Guice :: JMS ...................... SKIPPED (dependency build failed
or was skipped)
[INFO] Camel :: Example :: JMX ............................... SKIPPED (dependency build failed
or was skipped)
[INFO] Camel :: Example :: JMS-File .......................... SKIPPED (dependency build failed
or was skipped)
[INFO] Camel :: Example :: Loadbalancer camel-mina ........... SKIPPED (dependency build failed
or was skipped)
[INFO] Camel :: Example :: Loan-Broker ....................... SKIPPED (dependency build failed
or was skipped)
[INFO] Camel :: Example :: Management ........................ SKIPPED (dependency build failed
or was skipped)
[INFO] Camel :: Example :: OSGi .............................. SKIPPED (dependency build failed
or was skipped)
[INFO] Camel :: Example :: POJO Messaging .................... SKIPPED (dependency build failed
or was skipped)
[INFO] Camel :: Example :: Report Incident ................... SKIPPED (dependency build failed
or was skipped)
[INFO] Camel :: Example :: Report Incident :: WS-Security .... SKIPPED (dependency build failed
or was skipped)
[INFO] Camel :: Example :: Route :: Throttling ............... SKIPPED (dependency build failed
or was skipped)
[INFO] Camel :: Example :: Simple Jira Bot ................... SKIPPED (dependency build failed
or was skipped)
[INFO] Camel :: Example :: Simple Jira Bot :: Java DSL ....... SKIPPED (dependency build failed
or was skipped)
[INFO] Camel :: Example :: Simple Jira Bot :: XML Configuration  SKIPPED (dependency build
failed or was skipped)
[INFO] Camel :: Example :: Spring ............................ SKIPPED (dependency build failed
or was skipped)
[INFO] Camel :: Example :: Spring :: JavaConfig .............. SKIPPED (dependency build failed
or was skipped)
[INFO] Camel :: Example :: Spring :: JMS ..................... SKIPPED (dependency build failed
or was skipped)
[INFO] Camel :: Example :: Spring Web Services ............... SKIPPED (dependency build failed
or was skipped)
[INFO] Camel :: Example :: Spring :: XQuery .................. SKIPPED (dependency build failed
or was skipped)
[INFO] Camel :: Example :: Spring Security ................... SKIPPED (dependency build failed
or was skipped)
[INFO] Camel :: Example :: Tracer ............................ SKIPPED (dependency build failed
or was skipped)
[INFO] Camel :: Assembly ..................................... SKIPPED (dependency build failed
or was skipped)
[INFO] ------------------------------------------------------------------------
[INFO] Error for project: Camel :: Spring (during install)
[INFO] ------------------------------------------------------------------------
[INFO] Compilation failure
<https://hudson.apache.org/hudson/job/Camel/ws/camel-trunk/components/camel-spring/src/main/java/org/apache/camel/osgi/OsgiSpringCamelContext.java>:[40,28]
cannot find symbol
symbol  : variable BundleContextUtils
location: class org.apache.camel.osgi.OsgiSpringCamelContext

[INFO] ------------------------------------------------------------------------
[INFO] Trace
org.apache.maven.BuildFailureException: Compilation failure
<https://hudson.apache.org/hudson/job/Camel/ws/camel-trunk/components/camel-spring/src/main/java/org/apache/camel/osgi/OsgiSpringCamelContext.java>:[40,28]
cannot find symbol
symbol  : variable BundleContextUtils
location: class org.apache.camel.osgi.OsgiSpringCamelContext

	at org.apache.maven.lifecycle.DefaultLifecycleExecutor.executeGoals(DefaultLifecycleExecutor.java:715)
	at org.apache.maven.lifecycle.DefaultLifecycleExecutor.executeGoalWithLifecycle(DefaultLifecycleExecutor.java:556)
	at org.apache.maven.lifecycle.DefaultLifecycleExecutor.executeGoal(DefaultLifecycleExecutor.java:535)
	at org.apache.maven.lifecycle.DefaultLifecycleExecutor.executeGoalAndHandleFailures(DefaultLifecycleExecutor.java:387)
	at org.apache.maven.lifecycle.DefaultLifecycleExecutor.executeTaskSegments(DefaultLifecycleExecutor.java:348)
	at org.apache.maven.lifecycle.DefaultLifecycleExecutor.execute(DefaultLifecycleExecutor.java:180)
	at org.apache.maven.lifecycle.LifecycleExecutorInterceptor.execute(LifecycleExecutorInterceptor.java:65)
	at org.apache.maven.DefaultMaven.doExecute(DefaultMaven.java:328)
	at org.apache.maven.DefaultMaven.execute(DefaultMaven.java:138)
	at org.apache.maven.cli.MavenCli.main(MavenCli.java:362)
	at sun.reflect.NativeMethodAccessorImpl.invoke0(Native Method)
	at sun.reflect.NativeMethodAccessorImpl.invoke(NativeMethodAccessorImpl.java:39)
	at sun.reflect.DelegatingMethodAccessorImpl.invoke(DelegatingMethodAccessorImpl.java:25)
	at java.lang.reflect.Method.invoke(Method.java:597)
	at org.codehaus.classworlds.Launcher.launchEnhanced(Launcher.java:315)
	at org.codehaus.classworlds.Launcher.launch(Launcher.java:255)
	at hudson.maven.agent.Main.launch(Main.java:173)
	at hudson.maven.MavenBuilder.call(MavenBuilder.java:164)
	at hudson.maven.MavenModuleSetBuild$Builder.call(MavenModuleSetBuild.java:868)
	at hudson.maven.MavenModuleSetBuild$Builder.call(MavenModuleSetBuild.java:799)
	at hudson.remoting.UserRequest.perform(UserRequest.java:114)
	at hudson.remoting.UserRequest.perform(UserRequest.java:48)
	at hudson.remoting.Request$2.run(Request.java:270)
	at java.util.concurrent.Executors$RunnableAdapter.call(Executors.java:441)
	at java.util.concurrent.FutureTask$Sync.innerRun(FutureTask.java:303)
	at java.util.concurrent.FutureTask.run(FutureTask.java:138)
	at java.util.concurrent.ThreadPoolExecutor$Worker.runTask(ThreadPoolExecutor.java:886)
	at java.util.concurrent.ThreadPoolExecutor$Worker.run(ThreadPoolExecutor.java:908)
	at java.lang.Thread.run(Thread.java:619)
Caused by: org.apache.maven.plugin.CompilationFailureException: Compilation failure
<https://hudson.apache.org/hudson/job/Camel/ws/camel-trunk/components/camel-spring/src/main/java/org/apache/camel/osgi/OsgiSpringCamelContext.java>:[40,28]
cannot find symbol
symbol  : variable BundleContextUtils
location: class org.apache.camel.osgi.OsgiSpringCamelContext

	at org.apache.maven.plugin.AbstractCompilerMojo.execute(AbstractCompilerMojo.java:656)
	at org.apache.maven.plugin.CompilerMojo.execute(CompilerMojo.java:128)
	at org.apache.maven.plugin.DefaultPluginManager.executeMojo(DefaultPluginManager.java:490)
	at hudson.maven.agent.PluginManagerInterceptor.executeMojo(PluginManagerInterceptor.java:182)
	at org.apache.maven.lifecycle.DefaultLifecycleExecutor.executeGoals(DefaultLifecycleExecutor.java:694)
	... 28 more
[INFO] ------------------------------------------------------------------------
[INFO] BUILD ERRORS
[INFO] ------------------------------------------------------------------------
[INFO] Total time: 2 minutes 40 seconds
[INFO] Finished at: Wed Feb 02 18:10:33 PST 2011
[INFO] Final Memory: 180M/380M
[INFO] ------------------------------------------------------------------------
Sending e-mails to: dev@camel.apache.org
channel stopped
[locks-and-latches] Releasing all the locks
[locks-and-latches] All the locks released


Mime
View raw message