camel-dev mailing list archives

Site index · List index
Message view « Date » · « Thread »
Top « Date » · « Thread »
From Apache Hudson Server <hud...@hudson.apache.org>
Subject Build failed in Hudson: Camel #1109
Date Mon, 10 Jan 2011 02:15:47 GMT
See <https://hudson.apache.org/hudson/job/Camel/1109/changes>

Changes:

[davsclaus] Upgraded to pax-exam 1.2.3

[davsclaus] CAMEL-3339: Added Main class to camel-core. Thanks to Ben for patch.

[davsclaus] CAMEL-3339: Added Main class to camel-core. Thanks to Ben for patch.

[davsclaus] CAMEL-3497: Fixed subtle issue with aggregation task blocking.

[davsclaus] CAMEL-3311: Polished code

------------------------------------------
[...truncated 16701 lines...]
[INFO] ------------------------------------------------------------------------
[INFO] ------------------------------------------------------------------------
[INFO] SKIPPING Camel :: Example :: Spring :: XQuery
[INFO]    task-segment: [clean, install]
[INFO] This project has been banned from further executions due to previous failures.
[INFO] ------------------------------------------------------------------------
[INFO] ------------------------------------------------------------------------
[INFO] SKIPPING Camel :: Example :: Spring Security
[INFO]    task-segment: [clean, install]
[INFO] This project has been banned from further executions due to previous failures.
[INFO] ------------------------------------------------------------------------
[INFO] ------------------------------------------------------------------------
[INFO] SKIPPING Camel :: Example :: Tracer
[INFO]    task-segment: [clean, install]
[INFO] This project has been banned from further executions due to previous failures.
[INFO] ------------------------------------------------------------------------
[INFO] ------------------------------------------------------------------------
[INFO] SKIPPING Camel :: Assembly
[INFO]    task-segment: [clean, install]
[INFO] This project has been banned from further executions due to previous failures.
[INFO] ------------------------------------------------------------------------
[INFO] 
[INFO] 
[INFO] ------------------------------------------------------------------------
[INFO] Reactor Summary:
[INFO] ------------------------------------------------------------------------
[INFO] Camel ................................................. SUCCESS [3:33.786s]
[INFO] Apache :: Camel Buildtools ............................ SUCCESS [36.813s]
[INFO] Camel :: Parent ....................................... SUCCESS [35.519s]
[INFO] Camel :: Core ......................................... FAILED [37.127s]
[INFO] Camel :: Core XML ..................................... SKIPPED (dependency build failed
or was skipped)
[INFO] Camel :: Core OSGi .................................... SKIPPED (dependency build failed
or was skipped)
[INFO] Camel :: Spring ....................................... SKIPPED (dependency build failed
or was skipped)
[INFO] Camel :: Test ......................................... SKIPPED (dependency build failed
or was skipped)
[INFO] Camel :: JMS .......................................... SKIPPED (dependency build failed
or was skipped)
[INFO] Camel :: AMQP ......................................... SKIPPED (dependency build failed
or was skipped)
[INFO] Camel :: Atom ......................................... SKIPPED (dependency build failed
or was skipped)
[INFO] Camel :: AWS .......................................... SKIPPED (dependency build failed
or was skipped)
[INFO] Camel :: JUEL ......................................... SKIPPED (dependency build failed
or was skipped)
[INFO] Camel :: BAM .......................................... SKIPPED (dependency build failed
or was skipped)
[INFO] Camel :: Bean validator ............................... SKIPPED (dependency build failed
or was skipped)
[INFO] Camel :: Bindy ........................................ SKIPPED (dependency build failed
or was skipped)
[INFO] Camel :: Blueprint .................................... SKIPPED (dependency build failed
or was skipped)
[INFO] Camel :: Stream ....................................... SKIPPED (dependency build failed
or was skipped)
[INFO] Camel :: Cometd ....................................... SKIPPED (dependency build failed
or was skipped)
[INFO] Camel :: Components ................................... SUCCESS [2.490s]
[INFO] Camel :: Cache ........................................ SKIPPED (dependency build failed
or was skipped)
[INFO] Camel :: Castor ....................................... SKIPPED (dependency build failed
or was skipped)
[INFO] Camel :: Crypto ....................................... SKIPPED (dependency build failed
or was skipped)
[INFO] Camel :: CSV .......................................... SKIPPED (dependency build failed
or was skipped)
[INFO] Camel :: HTTP ......................................... SKIPPED (dependency build failed
or was skipped)
[INFO] Camel :: Jetty ........................................ SKIPPED (dependency build failed
or was skipped)
[INFO] Camel :: CXF .......................................... SKIPPED (dependency build failed
or was skipped)
[INFO] Camel :: Dozer ........................................ SKIPPED (dependency build failed
or was skipped)
[INFO] Camel :: Eclipse ...................................... SKIPPED (dependency build failed
or was skipped)
[INFO] Camel :: EJB .......................................... SKIPPED (dependency build failed
or was skipped)
[INFO] Camel :: Event Admin .................................. SKIPPED (dependency build failed
or was skipped)
[INFO] Camel :: Exec ......................................... SKIPPED (dependency build failed
or was skipped)
[INFO] Camel :: FlatPack ..................................... SKIPPED (dependency build failed
or was skipped)
[INFO] Camel :: Freemarker ................................... SKIPPED (dependency build failed
or was skipped)
[INFO] Camel :: FTP .......................................... SKIPPED (dependency build failed
or was skipped)
[INFO] Camel :: Servlet ...................................... SKIPPED (dependency build failed
or was skipped)
[INFO] Camel :: GAE .......................................... SKIPPED (dependency build failed
or was skipped)
[INFO] Camel :: Guice ........................................ SKIPPED (dependency build failed
or was skipped)
[INFO] Camel :: Groovy ....................................... SKIPPED (dependency build failed
or was skipped)
[INFO] Camel :: HawtDB ....................................... SKIPPED (dependency build failed
or was skipped)
[INFO] Camel :: HTTP4 (HttpClient 4.x) ....................... SKIPPED (dependency build failed
or was skipped)
[INFO] Camel :: MINA ......................................... SKIPPED (dependency build failed
or was skipped)
[INFO] Camel :: HL7 .......................................... SKIPPED (dependency build failed
or was skipped)
[INFO] Camel :: iBatis ....................................... SKIPPED (dependency build failed
or was skipped)
[INFO] Camel :: IRC .......................................... SKIPPED (dependency build failed
or was skipped)
[INFO] Camel :: Jackson ...................................... SKIPPED (dependency build failed
or was skipped)
[INFO] Camel :: Javaspace .................................... SKIPPED (dependency build failed
or was skipped)
[INFO] Camel :: JAXB ......................................... SKIPPED (dependency build failed
or was skipped)
[INFO] Camel :: Jibx ......................................... SKIPPED (dependency build failed
or was skipped)
[INFO] Camel :: JDBC ......................................... SKIPPED (dependency build failed
or was skipped)
[INFO] Camel :: JDBC :: Aggregator ........................... SKIPPED (dependency build failed
or was skipped)
[INFO] Camel :: Jing ......................................... SKIPPED (dependency build failed
or was skipped)
[INFO] Camel :: JMX .......................................... SKIPPED (dependency build failed
or was skipped)
[INFO] Camel :: JoSQL ........................................ SKIPPED (dependency build failed
or was skipped)
[INFO] Camel :: Jasypt ....................................... SKIPPED (dependency build failed
or was skipped)
[INFO] Camel :: JCR .......................................... SKIPPED (dependency build failed
or was skipped)
[INFO] Camel :: JPA .......................................... SKIPPED (dependency build failed
or was skipped)
[INFO] Camel :: Java Toolbox for AS/400 ...................... SKIPPED (dependency build failed
or was skipped)
[INFO] Camel :: JXPath ....................................... SKIPPED (dependency build failed
or was skipped)
[INFO] Camel :: LDAP ......................................... SKIPPED (dependency build failed
or was skipped)
[INFO] Camel :: Lucene ....................................... SKIPPED (dependency build failed
or was skipped)
[INFO] Camel :: Mail ......................................... SKIPPED (dependency build failed
or was skipped)
[INFO] Camel :: MSV .......................................... SKIPPED (dependency build failed
or was skipped)
[INFO] Camel :: MVEL ......................................... SKIPPED (dependency build failed
or was skipped)
[INFO] Camel :: Netty ........................................ SKIPPED (dependency build failed
or was skipped)
[INFO] Camel :: Nagios ....................................... SKIPPED (dependency build failed
or was skipped)
[INFO] Camel :: OGNL ......................................... SKIPPED (dependency build failed
or was skipped)
[INFO] Camel :: Pax Logging .................................. SKIPPED (dependency build failed
or was skipped)
[INFO] Camel :: Printer ...................................... SKIPPED (dependency build failed
or was skipped)
[INFO] Camel :: Protobuf ..................................... SKIPPED (dependency build failed
or was skipped)
[INFO] Camel :: Quartz ....................................... SKIPPED (dependency build failed
or was skipped)
[INFO] Camel :: QuickFIX/J ................................... SKIPPED (dependency build failed
or was skipped)
[INFO] Camel :: Restlet ...................................... SKIPPED (dependency build failed
or was skipped)
[INFO] Camel :: RMI .......................................... SKIPPED (dependency build failed
or was skipped)
[INFO] Camel :: Routebox ..................................... SKIPPED (dependency build failed
or was skipped)
[INFO] Camel :: Ruby ......................................... SKIPPED (dependency build failed
or was skipped)
[INFO] Camel :: RSS .......................................... SKIPPED (dependency build failed
or was skipped)
[INFO] Camel :: SAXON ........................................ SKIPPED (dependency build failed
or was skipped)
[INFO] Camel :: Velocity ..................................... SKIPPED (dependency build failed
or was skipped)
[INFO] Camel :: Scala ........................................ SKIPPED (dependency build failed
or was skipped)
[INFO] Camel :: Script ....................................... SKIPPED (dependency build failed
or was skipped)
[INFO] Camel :: SIP .......................................... SKIPPED (dependency build failed
or was skipped)
[INFO] Camel :: Shiro ........................................ SKIPPED (dependency build failed
or was skipped)
[INFO] Camel :: SMPP ......................................... SKIPPED (dependency build failed
or was skipped)
[INFO] Camel :: SNMP ......................................... SKIPPED (dependency build failed
or was skipped)
[INFO] Camel :: SOAP ......................................... SKIPPED (dependency build failed
or was skipped)
[INFO] Camel :: Spring Integration ........................... SKIPPED (dependency build failed
or was skipped)
[INFO] Camel :: Spring JavaConfig ............................ SKIPPED (dependency build failed
or was skipped)
[INFO] Camel :: Spring Security .............................. SKIPPED (dependency build failed
or was skipped)
[INFO] Camel :: Spring Web Services .......................... SKIPPED (dependency build failed
or was skipped)
[INFO] Camel :: SQL .......................................... SKIPPED (dependency build failed
or was skipped)
[INFO] Camel :: StringTemplate ............................... SKIPPED (dependency build failed
or was skipped)
[INFO] Camel :: Syslog ....................................... SKIPPED (dependency build failed
or was skipped)
[INFO] Camel :: TagSoup ...................................... SKIPPED (dependency build failed
or was skipped)
[INFO] Camel :: XMLBeans ..................................... SKIPPED (dependency build failed
or was skipped)
[INFO] Camel :: XML Security ................................. SKIPPED (dependency build failed
or was skipped)
[INFO] Camel :: XMPP ......................................... SKIPPED (dependency build failed
or was skipped)
[INFO] Camel :: XStream ...................................... SKIPPED (dependency build failed
or was skipped)
[INFO] Camel :: Platforms .................................... SUCCESS [2.112s]
[INFO] Camel :: Platforms :: Apache Karaf .................... SUCCESS [2.040s]
[INFO] Camel :: Platforms :: Apache Karaf :: Features ........ SUCCESS [50.255s]
[INFO] Camel :: Maven Plugins ................................ SUCCESS [2.517s]
[INFO] Camel :: Maven Camel Plugin ........................... SKIPPED (dependency build failed
or was skipped)
[INFO] Camel :: Maven Guice Plugin ........................... SKIPPED (dependency build failed
or was skipped)
[INFO] Camel :: Html to Pdf Plugin ........................... SKIPPED (dependency build failed
or was skipped)
[INFO] Camel :: Archetypes :: Camel Router with ActiveMQ ..... SUCCESS [36.051s]
[INFO] Camel :: Archetypes :: Component ...................... SUCCESS [3.428s]
[INFO] Camel :: Archetypes :: Router ......................... SUCCESS [3.854s]
[INFO] Camel :: Archetypes :: Scala Router ................... SUCCESS [3.296s]
[INFO] Camel :: Archetypes :: Spring XML Based Router ........ SUCCESS [3.839s]
[INFO] Camel :: Archetypes :: Camel Router WAR ............... SUCCESS [3.557s]
[INFO] Camel :: Archetypes ................................... SUCCESS [1.990s]
[INFO] Camel :: Manual ....................................... SKIPPED (dependency build failed
or was skipped)
[INFO] Camel :: Tooling ...................................... SUCCESS [1.882s]
[INFO] Camel :: Tests Bundles ................................ SUCCESS [49.954s]
[INFO] Camel :: Test Bundles: mock-javamail-1.7 .............. SUCCESS [17.566s]
[INFO] Camel :: Integration Tests :: Standalone .............. SKIPPED (dependency build failed
or was skipped)
[INFO] Camel :: Integration Tests ............................ SKIPPED (dependency build failed
or was skipped)
[INFO] Camel :: ITest :: Spring 2.0 .......................... SKIPPED (dependency build failed
or was skipped)
[INFO] Camel :: ITest :: Spring 2.5 .......................... SKIPPED (dependency build failed
or was skipped)
[INFO] Camel :: Partial Classpath Tests ...................... SKIPPED (dependency build failed
or was skipped)
[INFO] Camel :: OSGi Integration Tests ....................... SKIPPED (dependency build failed
or was skipped)
[INFO] Camel :: Tests ........................................ SUCCESS [1.955s]
[INFO] Camel :: Examples ..................................... SUCCESS [1.908s]
[INFO] Camel :: Example :: Aggregate ......................... SKIPPED (dependency build failed
or was skipped)
[INFO] Camel :: Example :: Axis .............................. SKIPPED (dependency build failed
or was skipped)
[INFO] Camel :: Example :: BAM ............................... SKIPPED (dependency build failed
or was skipped)
[INFO] Camel :: Example :: Cafe .............................. SKIPPED (dependency build failed
or was skipped)
[INFO] Camel :: Example :: CXF ............................... SKIPPED (dependency build failed
or was skipped)
[INFO] Camel :: Example :: CXF Proxy ......................... SKIPPED (dependency build failed
or was skipped)
[INFO] Camel :: Example :: CXF Tomcat ........................ SKIPPED (dependency build failed
or was skipped)
[INFO] Camel :: Example :: Docs .............................. SKIPPED (dependency build failed
or was skipped)
[INFO] Camel :: Example :: ETL ............................... SKIPPED (dependency build failed
or was skipped)
[INFO] Camel :: Example :: GAE ............................... SKIPPED (dependency build failed
or was skipped)
[INFO] Camel :: Example :: GAuth ............................. SKIPPED (dependency build failed
or was skipped)
[INFO] Camel :: Example :: Guice :: JMS ...................... SKIPPED (dependency build failed
or was skipped)
[INFO] Camel :: Example :: JMX ............................... SKIPPED (dependency build failed
or was skipped)
[INFO] Camel :: Example :: JMS-File .......................... SKIPPED (dependency build failed
or was skipped)
[INFO] Camel :: Example :: Loadbalancer camel-mina ........... SKIPPED (dependency build failed
or was skipped)
[INFO] Camel :: Example :: Loan-Broker ....................... SKIPPED (dependency build failed
or was skipped)
[INFO] Camel :: Example :: Management ........................ SKIPPED (dependency build failed
or was skipped)
[INFO] Camel :: Example :: OSGi .............................. SKIPPED (dependency build failed
or was skipped)
[INFO] Camel :: Example :: POJO Messaging .................... SKIPPED (dependency build failed
or was skipped)
[INFO] Camel :: Example :: Report Incident ................... SKIPPED (dependency build failed
or was skipped)
[INFO] Camel :: Example :: Report Incident :: WS-Security .... SKIPPED (dependency build failed
or was skipped)
[INFO] Camel :: Example :: Route :: Throttling ............... SKIPPED (dependency build failed
or was skipped)
[INFO] Camel :: Example :: Simple Jira Bot ................... SKIPPED (dependency build failed
or was skipped)
[INFO] Camel :: Example :: Simple Jira Bot :: Java DSL ....... SKIPPED (dependency build failed
or was skipped)
[INFO] Camel :: Example :: Simple Jira Bot :: XML Configuration  SKIPPED (dependency build
failed or was skipped)
[INFO] Camel :: Example :: Spring ............................ SKIPPED (dependency build failed
or was skipped)
[INFO] Camel :: Example :: Spring :: JavaConfig .............. SKIPPED (dependency build failed
or was skipped)
[INFO] Camel :: Example :: Spring :: JMS ..................... SKIPPED (dependency build failed
or was skipped)
[INFO] Camel :: Example :: Spring Web Services ............... SKIPPED (dependency build failed
or was skipped)
[INFO] Camel :: Example :: Spring :: XQuery .................. SKIPPED (dependency build failed
or was skipped)
[INFO] Camel :: Example :: Spring Security ................... SKIPPED (dependency build failed
or was skipped)
[INFO] Camel :: Example :: Tracer ............................ SKIPPED (dependency build failed
or was skipped)
[INFO] Camel :: Assembly ..................................... SKIPPED (dependency build failed
or was skipped)
[INFO] ------------------------------------------------------------------------
[INFO] Error for project: Camel :: Core (during install)
[INFO] ------------------------------------------------------------------------
[INFO] Compilation failure
<https://hudson.apache.org/hudson/job/Camel/ws/camel-trunk/camel-core/src/test/java/org/apache/camel/MainTest.java>:[25,29]
cannot find symbol
symbol  : class Main
location: package org.apache.camel.util

[INFO] ------------------------------------------------------------------------
[INFO] Trace
org.apache.maven.BuildFailureException: Compilation failure
<https://hudson.apache.org/hudson/job/Camel/ws/camel-trunk/camel-core/src/test/java/org/apache/camel/MainTest.java>:[25,29]
cannot find symbol
symbol  : class Main
location: package org.apache.camel.util

	at org.apache.maven.lifecycle.DefaultLifecycleExecutor.executeGoals(DefaultLifecycleExecutor.java:715)
	at org.apache.maven.lifecycle.DefaultLifecycleExecutor.executeGoalWithLifecycle(DefaultLifecycleExecutor.java:556)
	at org.apache.maven.lifecycle.DefaultLifecycleExecutor.executeGoal(DefaultLifecycleExecutor.java:535)
	at org.apache.maven.lifecycle.DefaultLifecycleExecutor.executeGoalAndHandleFailures(DefaultLifecycleExecutor.java:387)
	at org.apache.maven.lifecycle.DefaultLifecycleExecutor.executeTaskSegments(DefaultLifecycleExecutor.java:348)
	at org.apache.maven.lifecycle.DefaultLifecycleExecutor.execute(DefaultLifecycleExecutor.java:180)
	at org.apache.maven.lifecycle.LifecycleExecutorInterceptor.execute(LifecycleExecutorInterceptor.java:65)
	at org.apache.maven.DefaultMaven.doExecute(DefaultMaven.java:328)
	at org.apache.maven.DefaultMaven.execute(DefaultMaven.java:138)
	at org.apache.maven.cli.MavenCli.main(MavenCli.java:362)
	at sun.reflect.NativeMethodAccessorImpl.invoke0(Native Method)
	at sun.reflect.NativeMethodAccessorImpl.invoke(NativeMethodAccessorImpl.java:39)
	at sun.reflect.DelegatingMethodAccessorImpl.invoke(DelegatingMethodAccessorImpl.java:25)
	at java.lang.reflect.Method.invoke(Method.java:592)
	at org.codehaus.classworlds.Launcher.launchEnhanced(Launcher.java:315)
	at org.codehaus.classworlds.Launcher.launch(Launcher.java:255)
	at hudson.maven.agent.Main.launch(Main.java:165)
	at hudson.maven.MavenBuilder.call(MavenBuilder.java:165)
	at hudson.maven.MavenModuleSetBuild$Builder.call(MavenModuleSetBuild.java:750)
	at hudson.maven.MavenModuleSetBuild$Builder.call(MavenModuleSetBuild.java:694)
	at hudson.remoting.UserRequest.perform(UserRequest.java:114)
	at hudson.remoting.UserRequest.perform(UserRequest.java:48)
	at hudson.remoting.Request$2.run(Request.java:270)
	at java.util.concurrent.Executors$RunnableAdapter.call(Executors.java:417)
	at java.util.concurrent.FutureTask$Sync.innerRun(FutureTask.java:269)
	at java.util.concurrent.FutureTask.run(FutureTask.java:123)
	at java.util.concurrent.ThreadPoolExecutor$Worker.runTask(ThreadPoolExecutor.java:651)
	at java.util.concurrent.ThreadPoolExecutor$Worker.run(ThreadPoolExecutor.java:676)
	at java.lang.Thread.run(Thread.java:595)
Caused by: org.apache.maven.plugin.CompilationFailureException: Compilation failure
<https://hudson.apache.org/hudson/job/Camel/ws/camel-trunk/camel-core/src/test/java/org/apache/camel/MainTest.java>:[25,29]
cannot find symbol
symbol  : class Main
location: package org.apache.camel.util

	at org.apache.maven.plugin.AbstractCompilerMojo.execute(AbstractCompilerMojo.java:656)
	at org.apache.maven.plugin.TestCompilerMojo.execute(TestCompilerMojo.java:161)
	at org.apache.maven.plugin.DefaultPluginManager.executeMojo(DefaultPluginManager.java:490)
	at hudson.maven.agent.PluginManagerInterceptor.executeMojo(PluginManagerInterceptor.java:182)
	at org.apache.maven.lifecycle.DefaultLifecycleExecutor.executeGoals(DefaultLifecycleExecutor.java:694)
	... 28 more
[INFO] ------------------------------------------------------------------------
[INFO] BUILD ERRORS
[INFO] ------------------------------------------------------------------------
[INFO] Total time: 10 minutes 4 seconds
[INFO] Finished at: Mon Jan 10 02:15:46 UTC 2011
[INFO] Final Memory: 115M/249M
[INFO] ------------------------------------------------------------------------
Sending e-mails to: dev@camel.apache.org
channel stopped
[locks-and-latches] Releasing all the locks
[locks-and-latches] All the locks released


Mime
View raw message