camel-dev mailing list archives

Site index · List index
Message view « Date » · « Thread »
Top « Date » · « Thread »
From Apache Hudson Server <hud...@hudson.apache.org>
Subject Build failed in Hudson: Camel.trunk.fulltest #68
Date Wed, 08 Dec 2010 23:18:58 GMT
See <https://hudson.apache.org/hudson/job/Camel.trunk.fulltest/68/changes>

Changes:

[hadrian] CAMEL-3410. Patch applied with thanks to Jean Baptiste

[davsclaus] Added a bit more trace logging in hawtdb

[gnodet] [CAMEL-3186] @EndpointInject not working in bean created by blueprint

[ningjiang] CAMEL-3409 Upgraded CXF version to 2.3.1

[ningjiang] CAMEL-3402 Use ServiceMix guice bundle

[davsclaus] CAMEL-3317: Added unit test to test issue with hawtdb.

[davsclaus] Added test based on user forum issue.

[davsclaus] Added exec test using quoted arguments.

[davsclaus] CAMEL-3403: Fixed interceptSendToEndpoint not checking stop DSL to prevent sending
to intercepted endpoint. Fixed MockEndpoint assertions when interceptSendToEndpoint being
used.

[ningjiang] CAMEL-3228 Upgraded dozer to 5.3.1 which still does not support OSGi

[ningjiang] Fixed the warning of camel-web

[ningjiang] CAMEL-3351 applied patch with thanks to Tracy

------------------------------------------
[...truncated 19348 lines...]
[INFO] Compiling 1 source file to <https://hudson.apache.org/hudson/job/Camel.trunk.fulltest/ws/camel-trunk/examples/camel-example-management/target/classes>
[INFO] [resources:testResources {execution: default-testResources}]
[INFO] Using 'UTF-8' encoding to copy filtered resources.
[INFO] Copying 1 resource
[INFO] Copying 3 resources
[INFO] [compiler:testCompile {execution: default-testCompile}]
[INFO] Compiling 1 source file to <https://hudson.apache.org/hudson/job/Camel.trunk.fulltest/ws/camel-trunk/examples/camel-example-management/target/test-classes>
[INFO] [surefire:test {execution: default-test}]
[INFO] Surefire report directory: <https://hudson.apache.org/hudson/job/Camel.trunk.fulltest/ws/camel-trunk/examples/camel-example-management/target/surefire-reports>

-------------------------------------------------------
 T E S T S
-------------------------------------------------------
Running org.apache.camel.example.management.ManagementExampleTest
Tests run: 1, Failures: 0, Errors: 1, Skipped: 0, Time elapsed: 2.546 sec <<< FAILURE!

Results :

Tests in error: 
  testManagementExample(org.apache.camel.example.management.ManagementExampleTest)

Tests run: 1, Failures: 0, Errors: 1, Skipped: 0

[ERROR] There are test failures.

Please refer to <https://hudson.apache.org/hudson/job/Camel.trunk.fulltest/ws/camel-trunk/examples/camel-example-management/target/surefire-reports>
for the individual test results.
[HUDSON] Recording test results
[INFO] [bundle:bundle {execution: default-bundle}]
[WARNING] Warning building bundle org.apache.camel:camel-example-management:bundle:2.6-SNAPSHOT
: Did not find matching referal for com.thoughtworks.xstream.*
[WARNING] Warning building bundle org.apache.camel:camel-example-management:bundle:2.6-SNAPSHOT
: Did not find matching referal for freemarker.*
[WARNING] Warning building bundle org.apache.camel:camel-example-management:bundle:2.6-SNAPSHOT
: Did not find matching referal for javax.persistence.*
[WARNING] Warning building bundle org.apache.camel:camel-example-management:bundle:2.6-SNAPSHOT
: Did not find matching referal for net.sf.flatpack.*
[WARNING] Warning building bundle org.apache.camel:camel-example-management:bundle:2.6-SNAPSHOT
: Did not find matching referal for org.antlr.stringtemplate.*
[WARNING] Warning building bundle org.apache.camel:camel-example-management:bundle:2.6-SNAPSHOT
: Did not find matching referal for org.apache.abdera.*
[WARNING] Warning building bundle org.apache.camel:camel-example-management:bundle:2.6-SNAPSHOT
: Did not find matching referal for org.apache.commons.httpclient.*
[WARNING] Warning building bundle org.apache.camel:camel-example-management:bundle:2.6-SNAPSHOT
: Did not find matching referal for org.apache.commons.logging.*
[WARNING] Warning building bundle org.apache.camel:camel-example-management:bundle:2.6-SNAPSHOT
: Did not find matching referal for org.apache.cxf.*
[WARNING] Warning building bundle org.apache.camel:camel-example-management:bundle:2.6-SNAPSHOT
: Did not find matching referal for org.apache.mina.*
[WARNING] Warning building bundle org.apache.camel:camel-example-management:bundle:2.6-SNAPSHOT
: Did not find matching referal for org.apache.qpid.*
[WARNING] Warning building bundle org.apache.camel:camel-example-management:bundle:2.6-SNAPSHOT
: Did not find matching referal for org.apache.velocity.*
[WARNING] Warning building bundle org.apache.camel:camel-example-management:bundle:2.6-SNAPSHOT
: Did not find matching referal for org.apache.xmlbeans.*
[WARNING] Warning building bundle org.apache.camel:camel-example-management:bundle:2.6-SNAPSHOT
: Did not find matching referal for org.ccil.cowan.tagsoup.*
[WARNING] Warning building bundle org.apache.camel:camel-example-management:bundle:2.6-SNAPSHOT
: Did not find matching referal for org.eclipse.jetty.*
[WARNING] Warning building bundle org.apache.camel:camel-example-management:bundle:2.6-SNAPSHOT
: Did not find matching referal for org.jivesoftware.smack.*
[WARNING] Warning building bundle org.apache.camel:camel-example-management:bundle:2.6-SNAPSHOT
: Did not find matching referal for org.mortbay.cometd.*
[WARNING] Warning building bundle org.apache.camel:camel-example-management:bundle:2.6-SNAPSHOT
: Did not find matching referal for org.springframework.*
[INFO] [build-helper:attach-artifact {execution: attach-artifacts}]
[INFO] [ianal:verify-legal-files {execution: default}]
[INFO] Checking legal files in: camel-example-management-2.6-SNAPSHOT.jar
[INFO] [install:install {execution: default-install}]
[INFO] Installing <https://hudson.apache.org/hudson/job/Camel.trunk.fulltest/ws/camel-trunk/examples/camel-example-management/target/camel-example-management-2.6-SNAPSHOT.jar>
to <https://hudson.apache.org/hudson/job/Camel.trunk.fulltest/ws/.repository/org/apache/camel/camel-example-management/2.6-SNAPSHOT/camel-example-management-2.6-SNAPSHOT.jar>
[INFO] Installing <https://hudson.apache.org/hudson/job/Camel.trunk.fulltest/ws/camel-trunk/examples/camel-example-management/target/classes/features.xml>
to <https://hudson.apache.org/hudson/job/Camel.trunk.fulltest/ws/.repository/org/apache/camel/camel-example-management/2.6-SNAPSHOT/camel-example-management-2.6-SNAPSHOT-features.xml>
[INFO] [bundle:install {execution: default-install}]
[INFO] Parsing <https://hudson.apache.org/hudson/job/Camel.trunk.fulltest/ws/.repository/repository.xml>
[INFO] Installing org/apache/camel/camel-example-management/2.6-SNAPSHOT/camel-example-management-2.6-SNAPSHOT.jar
[INFO] Writing OBR metadata
[HUDSON] Archiving <https://hudson.apache.org/hudson/job/Camel.trunk.fulltest/ws/camel-trunk/examples/camel-example-management/pom.xml>
to /home/hudson/hudson/jobs/Camel.trunk.fulltest/modules/org.apache.camel$camel-example-management/builds/2010-12-08_18-27-11/archive/org.apache.camel/camel-example-management/2.6-SNAPSHOT/pom.xml
[HUDSON] Archiving <https://hudson.apache.org/hudson/job/Camel.trunk.fulltest/ws/camel-trunk/examples/camel-example-management/target/camel-example-management-2.6-SNAPSHOT.jar>
to /home/hudson/hudson/jobs/Camel.trunk.fulltest/modules/org.apache.camel$camel-example-management/builds/2010-12-08_18-27-11/archive/org.apache.camel/camel-example-management/2.6-SNAPSHOT/camel-example-management-2.6-SNAPSHOT.jar
[HUDSON] Archiving <https://hudson.apache.org/hudson/job/Camel.trunk.fulltest/ws/camel-trunk/examples/camel-example-management/target/classes/features.xml>
to /home/hudson/hudson/jobs/Camel.trunk.fulltest/modules/org.apache.camel$camel-example-management/builds/2010-12-08_18-27-11/archive/org.apache.camel/camel-example-management/2.6-SNAPSHOT/features.xml
[INFO] ------------------------------------------------------------------------
[INFO] Building Camel :: Example :: OSGi
[INFO]    task-segment: [clean, install]
[INFO] ------------------------------------------------------------------------
[INFO] [clean:clean {execution: default-clean}]
[INFO] Deleting <https://hudson.apache.org/hudson/job/Camel.trunk.fulltest/ws/camel-trunk/examples/camel-example-osgi/target>
[INFO] [antrun:run {execution: create-prop}]
[INFO] Executing tasks
     [echo] Maven version: 2.6-SNAPSHOT
     [echo] OSGi version: 2.6.0.SNAPSHOT
    [mkdir] Created dir: <https://hudson.apache.org/hudson/job/Camel.trunk.fulltest/ws/camel-trunk/examples/camel-example-osgi/target>
[INFO] Executed tasks
[INFO] [properties:read-project-properties {execution: default}]
[INFO] [remote-resources:process {execution: default}]
[INFO] [resources:resources {execution: default-resources}]
[INFO] Using 'UTF-8' encoding to copy filtered resources.
[INFO] Copying 5 resources
[INFO] Copying 3 resources
[INFO] [resources:resources {execution: default}]
[INFO] Using 'UTF-8' encoding to copy filtered resources.
[INFO] Copying 5 resources
[INFO] Copying 3 resources
[INFO] [compiler:compile {execution: default-compile}]
[INFO] Compiling 2 source files to <https://hudson.apache.org/hudson/job/Camel.trunk.fulltest/ws/camel-trunk/examples/camel-example-osgi/target/classes>
[INFO] [resources:testResources {execution: default-testResources}]
[INFO] Using 'UTF-8' encoding to copy filtered resources.
[INFO] skip non existing resourceDirectory <https://hudson.apache.org/hudson/job/Camel.trunk.fulltest/ws/camel-trunk/examples/camel-example-osgi/src/test/resources>
[INFO] Copying 3 resources
[INFO] [compiler:testCompile {execution: default-testCompile}]
[INFO] No sources to compile
[INFO] [surefire:test {execution: default-test}]
[INFO] Surefire report directory: <https://hudson.apache.org/hudson/job/Camel.trunk.fulltest/ws/camel-trunk/examples/camel-example-osgi/target/surefire-reports>

-------------------------------------------------------
 T E S T S
-------------------------------------------------------
There are no tests to run.

Results :

Tests run: 0, Failures: 0, Errors: 0, Skipped: 0

[HUDSON] Recording test results[INFO] [bundle:bundle {execution: default-bundle}]

[WARNING] Warning building bundle org.apache.camel:camel-example-osgi:bundle:2.6-SNAPSHOT
: Did not find matching referal for com.thoughtworks.xstream.*
[WARNING] Warning building bundle org.apache.camel:camel-example-osgi:bundle:2.6-SNAPSHOT
: Did not find matching referal for freemarker.*
[WARNING] Warning building bundle org.apache.camel:camel-example-osgi:bundle:2.6-SNAPSHOT
: Did not find matching referal for javax.persistence.*
[WARNING] Warning building bundle org.apache.camel:camel-example-osgi:bundle:2.6-SNAPSHOT
: Did not find matching referal for net.sf.flatpack.*
[WARNING] Warning building bundle org.apache.camel:camel-example-osgi:bundle:2.6-SNAPSHOT
: Did not find matching referal for org.antlr.stringtemplate.*
[WARNING] Warning building bundle org.apache.camel:camel-example-osgi:bundle:2.6-SNAPSHOT
: Did not find matching referal for org.apache.abdera.*
[WARNING] Warning building bundle org.apache.camel:camel-example-osgi:bundle:2.6-SNAPSHOT
: Did not find matching referal for org.apache.commons.httpclient.*
[WARNING] Warning building bundle org.apache.camel:camel-example-osgi:bundle:2.6-SNAPSHOT
: Did not find matching referal for org.apache.cxf.*
[WARNING] Warning building bundle org.apache.camel:camel-example-osgi:bundle:2.6-SNAPSHOT
: Did not find matching referal for org.apache.mina.*
[WARNING] Warning building bundle org.apache.camel:camel-example-osgi:bundle:2.6-SNAPSHOT
: Did not find matching referal for org.apache.qpid.*
[WARNING] Warning building bundle org.apache.camel:camel-example-osgi:bundle:2.6-SNAPSHOT
: Did not find matching referal for org.apache.velocity.*
[WARNING] Warning building bundle org.apache.camel:camel-example-osgi:bundle:2.6-SNAPSHOT
: Did not find matching referal for org.apache.xmlbeans.*
[WARNING] Warning building bundle org.apache.camel:camel-example-osgi:bundle:2.6-SNAPSHOT
: Did not find matching referal for org.ccil.cowan.tagsoup.*
[WARNING] Warning building bundle org.apache.camel:camel-example-osgi:bundle:2.6-SNAPSHOT
: Did not find matching referal for org.eclipse.jetty.*
[WARNING] Warning building bundle org.apache.camel:camel-example-osgi:bundle:2.6-SNAPSHOT
: Did not find matching referal for org.jivesoftware.smack.*
[WARNING] Warning building bundle org.apache.camel:camel-example-osgi:bundle:2.6-SNAPSHOT
: Did not find matching referal for org.mortbay.cometd.*
[WARNING] Warning building bundle org.apache.camel:camel-example-osgi:bundle:2.6-SNAPSHOT
: Did not find matching referal for org.springframework.*
[INFO] [build-helper:attach-artifact {execution: attach-artifacts}]
[INFO] [ianal:verify-legal-files {execution: default}]
[INFO] Checking legal files in: camel-example-osgi-2.6-SNAPSHOT.jar
[INFO] [install:install {execution: default-install}]
[INFO] Installing <https://hudson.apache.org/hudson/job/Camel.trunk.fulltest/ws/camel-trunk/examples/camel-example-osgi/target/camel-example-osgi-2.6-SNAPSHOT.jar>
to <https://hudson.apache.org/hudson/job/Camel.trunk.fulltest/ws/.repository/org/apache/camel/camel-example-osgi/2.6-SNAPSHOT/camel-example-osgi-2.6-SNAPSHOT.jar>
[INFO] Installing <https://hudson.apache.org/hudson/job/Camel.trunk.fulltest/ws/camel-trunk/examples/camel-example-osgi/target/classes/features.xml>
to <https://hudson.apache.org/hudson/job/Camel.trunk.fulltest/ws/.repository/org/apache/camel/camel-example-osgi/2.6-SNAPSHOT/camel-example-osgi-2.6-SNAPSHOT-features.xml>
[INFO] [bundle:install {execution: default-install}]
[INFO] Parsing <https://hudson.apache.org/hudson/job/Camel.trunk.fulltest/ws/.repository/repository.xml>
[INFO] Installing org/apache/camel/camel-example-osgi/2.6-SNAPSHOT/camel-example-osgi-2.6-SNAPSHOT.jar
[INFO] Writing OBR metadata
[HUDSON] Archiving <https://hudson.apache.org/hudson/job/Camel.trunk.fulltest/ws/camel-trunk/examples/camel-example-osgi/pom.xml>
to /home/hudson/hudson/jobs/Camel.trunk.fulltest/modules/org.apache.camel$camel-example-osgi/builds/2010-12-08_18-27-11/archive/org.apache.camel/camel-example-osgi/2.6-SNAPSHOT/pom.xml
[HUDSON] Archiving <https://hudson.apache.org/hudson/job/Camel.trunk.fulltest/ws/camel-trunk/examples/camel-example-osgi/target/camel-example-osgi-2.6-SNAPSHOT.jar>
to /home/hudson/hudson/jobs/Camel.trunk.fulltest/modules/org.apache.camel$camel-example-osgi/builds/2010-12-08_18-27-11/archive/org.apache.camel/camel-example-osgi/2.6-SNAPSHOT/camel-example-osgi-2.6-SNAPSHOT.jar
[HUDSON] Archiving <https://hudson.apache.org/hudson/job/Camel.trunk.fulltest/ws/camel-trunk/examples/camel-example-osgi/target/classes/features.xml>
to /home/hudson/hudson/jobs/Camel.trunk.fulltest/modules/org.apache.camel$camel-example-osgi/builds/2010-12-08_18-27-11/archive/org.apache.camel/camel-example-osgi/2.6-SNAPSHOT/features.xml
[INFO] ------------------------------------------------------------------------
[INFO] Building Camel :: Example :: POJO Messaging
[INFO]    task-segment: [clean, install]
[INFO] ------------------------------------------------------------------------
[INFO] [clean:clean {execution: default-clean}]
[INFO] Deleting <https://hudson.apache.org/hudson/job/Camel.trunk.fulltest/ws/camel-trunk/examples/camel-example-pojo-messaging/target>
[INFO] [antrun:run {execution: create-prop}]
[INFO] Executing tasks
     [echo] Maven version: 2.6-SNAPSHOT
     [echo] OSGi version: 2.6.0.SNAPSHOT
    [mkdir] Created dir: <https://hudson.apache.org/hudson/job/Camel.trunk.fulltest/ws/camel-trunk/examples/camel-example-pojo-messaging/target>
[INFO] Executed tasks
[INFO] [properties:read-project-properties {execution: default}]
[INFO] [remote-resources:process {execution: default}]
[INFO] [resources:resources {execution: default-resources}]
[INFO] Using 'UTF-8' encoding to copy filtered resources.
[INFO] Copying 5 resources
[INFO] Copying 3 resources
[INFO] [resources:resources {execution: default}]
[INFO] Using 'UTF-8' encoding to copy filtered resources.
[INFO] Copying 5 resources
[INFO] Copying 3 resources
[INFO] [compiler:compile {execution: default-compile}]
[INFO] Compiling 2 source files to <https://hudson.apache.org/hudson/job/Camel.trunk.fulltest/ws/camel-trunk/examples/camel-example-pojo-messaging/target/classes>
[INFO] [resources:testResources {execution: default-testResources}]
[INFO] Using 'UTF-8' encoding to copy filtered resources.
[INFO] Copying 1 resource
[INFO] Copying 3 resources
[INFO] [compiler:testCompile {execution: default-testCompile}]
[INFO] Compiling 1 source file to <https://hudson.apache.org/hudson/job/Camel.trunk.fulltest/ws/camel-trunk/examples/camel-example-pojo-messaging/target/test-classes>
[INFO] [surefire:test {execution: default-test}]
[INFO] Surefire report directory: <https://hudson.apache.org/hudson/job/Camel.trunk.fulltest/ws/camel-trunk/examples/camel-example-pojo-messaging/target/surefire-reports>

-------------------------------------------------------
 T E S T S
-------------------------------------------------------
Running org.apache.camel.example.pojo_messaging.CamelContextTest
Build timed out. Aborting
Sending e-mails to: dev@camel.apache.org
killed.
[HUDSON] Recording test results
Sending e-mails to: dev@camel.apache.org
Sending e-mails to: dev@camel.apache.org
Sending e-mails to: dev@camel.apache.org
[INFO] ------------------------------------------------------------------------
[ERROR] FATAL ERROR
[INFO] ------------------------------------------------------------------------
Sending e-mails to: dev@camel.apache.org
Sending e-mails to: dev@camel.apache.org
[INFO] Unable to call isArchivingDisabled. Invalid object ID 62
Sending e-mails to: dev@camel.apache.org
[INFO] ------------------------------------------------------------------------
[INFO] Trace
java.lang.IllegalStateException: Unable to call isArchivingDisabled. Invalid object ID 62
Sending e-mails to: dev@camel.apache.org
	at hudson.remoting.RemoteInvocationHandler$RPCRequest.perform(RemoteInvocationHandler.java:268)
	at hudson.remoting.RemoteInvocationHandler$RPCRequest.call(RemoteInvocationHandler.java:255)
	at hudson.remoting.RemoteInvocationHandler$RPCRequest.call(RemoteInvocationHandler.java:215)
	at hudson.remoting.UserRequest.perform(UserRequest.java:114)
	at hudson.remoting.UserRequest.perform(UserRequest.java:48)
	at hudson.remoting.Request$2.run(Request.java:270)
	at java.util.concurrent.Executors$RunnableAdapter.call(Executors.java:441)
	at java.util.concurrent.FutureTask$Sync.innerRun(FutureTask.java:303)
	at java.util.concurrent.FutureTask.run(FutureTask.java:138)
	at java.util.concurrent.ThreadPoolExecutor$Worker.runTask(ThreadPoolExecutor.java:886)
	at java.util.concurrent.ThreadPoolExecutor$Worker.run(ThreadPoolExecutor.java:908)
	at java.lang.Thread.run(Thread.java:662)
[INFO] ------------------------------------------------------------------------
[INFO] Total time: 291 minutes 31 seconds
[INFO] Finished at: Wed Dec 08 23:18:52 UTC 2010
Sending e-mails to: dev@camel.apache.org
Sending e-mails to: dev@camel.apache.org
Sending e-mails to: dev@camel.apache.org
Sending e-mails to: dev@camel.apache.org
Sending e-mails to: dev@camel.apache.org
Sending e-mails to: dev@camel.apache.org
Sending e-mails to: dev@camel.apache.org
Sending e-mails to: dev@camel.apache.org
Sending e-mails to: dev@camel.apache.org
Sending e-mails to: dev@camel.apache.org
Sending e-mails to: dev@camel.apache.org
Sending e-mails to: dev@camel.apache.org
Sending e-mails to: dev@camel.apache.org
Sending e-mails to: dev@camel.apache.org
Sending e-mails to: dev@camel.apache.org
Sending e-mails to: dev@camel.apache.org
Sending e-mails to: dev@camel.apache.org
Sending e-mails to: dev@camel.apache.org
Sending e-mails to: dev@camel.apache.org
Sending e-mails to: dev@camel.apache.org
Sending e-mails to: dev@camel.apache.org
Sending e-mails to: dev@camel.apache.org
Sending e-mails to: dev@camel.apache.org
Sending e-mails to: dev@camel.apache.org
Sending e-mails to: dev@camel.apache.org
Sending e-mails to: dev@camel.apache.org
Sending e-mails to: dev@camel.apache.org
Sending e-mails to: dev@camel.apache.org
Sending e-mails to: dev@camel.apache.org
Sending e-mails to: dev@camel.apache.org
Sending e-mails to: dev@camel.apache.org
Sending e-mails to: dev@camel.apache.org
Sending e-mails to: dev@camel.apache.org
Sending e-mails to: dev@camel.apache.org
Sending e-mails to: dev@camel.apache.org
Sending e-mails to: dev@camel.apache.org
Sending e-mails to: dev@camel.apache.org
Sending e-mails to: dev@camel.apache.org
Sending e-mails to: dev@camel.apache.org
Sending e-mails to: dev@camel.apache.org
Sending e-mails to: dev@camel.apache.org
[INFO] Final Memory: 199M/301M
[INFO] ------------------------------------------------------------------------
channel stopped
[locks-and-latches] Releasing all the locks
[locks-and-latches] All the locks released


Mime
View raw message