camel-dev mailing list archives

Site index · List index
Message view « Date » · « Thread »
Top « Date » · « Thread »
From Apache Hudson Server <hud...@hudson.apache.org>
Subject Build failed in Hudson: Camel.trunk.fulltest #30
Date Sat, 06 Nov 2010 20:28:13 GMT
See <https://hudson.apache.org/hudson/job/Camel.trunk.fulltest/30/changes>

Changes:

[davsclaus] CAMEL-2737: Added contentCache to xslt component. Thanks to Richard for patch.

[davsclaus] CAMEL-3318: Applied patch with thanks to Steve Bate.

[davsclaus] CAMEL-3309: Added manual tests for ftp

[davsclaus] CAMEL-3316: Using relative path in pom.xml. Thanks to Dan Kulp for patch.

[davsclaus] CAMEL-3105: spring-ws component now tests under JDK 1.5 as well.

------------------------------------------
[...truncated 19030 lines...]
[INFO] Camel :: Exec ......................................... SUCCESS [23.756s]
[INFO] Camel :: FlatPack ..................................... SUCCESS [18.663s]
[INFO] Camel :: Freemarker ................................... SUCCESS [10.565s]
[INFO] Camel :: FTP .......................................... SUCCESS [5:39.534s]
[INFO] Camel :: Servlet ...................................... SUCCESS [9.967s]
[INFO] Camel :: GAE .......................................... SUCCESS [41.590s]
[INFO] Camel :: Guice ........................................ SUCCESS [12.782s]
[INFO] Camel :: Groovy ....................................... SUCCESS [15.457s]
[INFO] Camel :: HawtDB ....................................... SUCCESS [2:48.111s]
[INFO] Camel :: HTTP4 (HttpClient 4.x) ....................... SUCCESS [1:02.928s]
[INFO] Camel :: MINA ......................................... SUCCESS [2:39.012s]
[INFO] Camel :: HL7 .......................................... SUCCESS [8.195s]
[INFO] Camel :: iBatis ....................................... SUCCESS [32.003s]
[INFO] Camel :: IRC .......................................... SUCCESS [4.645s]
[INFO] Camel :: Jackson ...................................... SUCCESS [7.796s]
[INFO] Camel :: Javaspace .................................... SUCCESS [1.998s]
[INFO] Camel :: JAXB ......................................... SUCCESS [1:05.915s]
[INFO] Camel :: JDBC ......................................... SUCCESS [18.694s]
[INFO] Camel :: Jing ......................................... SUCCESS [10.344s]
[INFO] Camel :: JMX .......................................... FAILED [40.791s]
[INFO] Camel :: JoSQL ........................................ SUCCESS [5.938s]
[INFO] Camel :: Jasypt ....................................... SUCCESS [7.788s]
[INFO] Camel :: JCR .......................................... SUCCESS [54.556s]
[INFO] Camel :: JPA .......................................... SUCCESS [1:01.337s]
[INFO] Camel :: Java Toolbox for AS/400 ...................... SUCCESS [3.550s]
[INFO] Camel :: JXPath ....................................... SUCCESS [12.233s]
[INFO] Camel :: LDAP ......................................... SUCCESS [11.499s]
[INFO] Camel :: Lucene ....................................... SUCCESS [8.283s]
[INFO] Camel :: Mail ......................................... SUCCESS [1:37.180s]
[INFO] Camel :: MSV .......................................... SUCCESS [8.135s]
[INFO] Camel :: MVEL ......................................... SUCCESS [7.195s]
[INFO] Camel :: Netty ........................................ SUCCESS [19.816s]
[INFO] Camel :: Nagios ....................................... SUCCESS [26.165s]
[INFO] Camel :: OGNL ......................................... SUCCESS [7.341s]
[INFO] Camel :: Printer ...................................... SUCCESS [2.545s]
[INFO] Camel :: Protobuf ..................................... SUCCESS [5.762s]
[INFO] Camel :: Quartz ....................................... SUCCESS [2:24.626s]
[INFO] Camel :: QuickFIX/J ................................... SUCCESS [12.129s]
[INFO] Camel :: Restlet ...................................... SUCCESS [19.149s]
[INFO] Camel :: RMI .......................................... SUCCESS [5.227s]
[INFO] Camel :: Ruby ......................................... SUCCESS [8.984s]
[INFO] Camel :: RSS .......................................... SUCCESS [31.545s]
[INFO] Camel :: SAXON ........................................ SUCCESS [29.719s]
[INFO] Camel :: Velocity ..................................... SUCCESS [11.765s]
[INFO] Camel :: Scala ........................................ SUCCESS [2:32.309s]
[INFO] Camel :: Script ....................................... SUCCESS [42.936s]
[INFO] Camel :: SIP .......................................... SUCCESS [8.286s]
[INFO] Camel :: Shiro ........................................ SUCCESS [5.195s]
[INFO] Camel :: SMPP ......................................... SUCCESS [4.471s]
[INFO] Camel :: SNMP ......................................... SUCCESS [3.823s]
[INFO] Camel :: SOAP ......................................... SUCCESS [44.675s]
[INFO] Camel :: Spring Integration ........................... SUCCESS [11.498s]
[INFO] Camel :: Spring JavaConfig ............................ SUCCESS [5.966s]
[INFO] Camel :: Spring Security .............................. SUCCESS [7.967s]
[INFO] Camel :: Spring Web Services .......................... SUCCESS [26.412s]
[INFO] Camel :: SQL .......................................... SUCCESS [7.987s]
[INFO] Camel :: StringTemplate ............................... SUCCESS [6.195s]
[INFO] Camel :: TagSoup ...................................... SUCCESS [5.391s]
[INFO] Camel :: XMLBeans ..................................... SUCCESS [4.896s]
[INFO] Camel :: XML Security ................................. SUCCESS [7.119s]
[INFO] Camel :: XMPP ......................................... SUCCESS [4.405s]
[INFO] Camel :: XStream ...................................... SUCCESS [16.879s]
[INFO] Camel :: Platforms .................................... SUCCESS [0.238s]
[INFO] Camel :: Platforms :: Apache Karaf .................... SUCCESS [0.280s]
[INFO] Camel :: Platforms :: Apache Karaf :: Features ........ SUCCESS [0.488s]
[INFO] Camel :: Maven Plugins ................................ SUCCESS [0.295s]
[INFO] Camel :: Maven Camel Plugin ........................... SUCCESS [4.402s]
[INFO] Camel :: Maven Guice Plugin ........................... SUCCESS [2.490s]
[INFO] Camel :: Html to Pdf Plugin ........................... SUCCESS [2.040s]
[INFO] Camel :: Archetypes :: Camel Router with ActiveMQ ..... SUCCESS [2.652s]
[INFO] Camel :: Archetypes :: Component ...................... SUCCESS [1.305s]
[INFO] Camel :: Archetypes :: Router ......................... SUCCESS [1.138s]
[INFO] Camel :: Archetypes :: Scala Router ................... SUCCESS [1.109s]
[INFO] Camel :: Archetypes :: Spring XML Based Router ........ SUCCESS [1.103s]
[INFO] Camel :: Archetypes :: Camel Router WAR ............... SUCCESS [1.111s]
[INFO] Camel :: Archetypes ................................... SUCCESS [0.226s]
[INFO] Camel :: Manual ....................................... SUCCESS [1:03.858s]
[INFO] Camel :: Tooling ...................................... SUCCESS [0.247s]
[INFO] Camel :: Tests Bundles ................................ SUCCESS [2.116s]
[INFO] Camel :: Test Bundles: mock-javamail-1.7 .............. FAILED [0.887s]
[INFO] Camel :: Integration Tests ............................ SUCCESS [5:56.565s]
[INFO] Camel :: ITest :: Spring 2.0 .......................... SUCCESS [5.891s]
[INFO] Camel :: ITest :: Spring 2.5 .......................... SUCCESS [8.768s]
[INFO] Camel :: Partial Classpath Tests ...................... SUCCESS [3.803s]
[INFO] Camel :: OSGi Integration Tests ....................... SKIPPED (dependency build failed
or was skipped)
[INFO] Camel :: Tests ........................................ SUCCESS [0.281s]
[INFO] Camel :: Examples ..................................... SUCCESS [0.293s]
[INFO] Camel :: Example :: Aggregate ......................... SUCCESS [2.167s]
[INFO] Camel :: Example :: Axis .............................. SUCCESS [9.947s]
[INFO] Camel :: Example :: BAM ............................... SUCCESS [2.293s]
[INFO] Camel :: Example :: Cafe .............................. SUCCESS [35.594s]
[INFO] Camel :: Example :: CXF ............................... SUCCESS [18.121s]
[INFO] Camel :: Example :: CXF Proxy ......................... SUCCESS [12.197s]
[INFO] Camel :: Example :: CXF Tomcat ........................ SUCCESS [4.395s]
[INFO] Camel :: Example :: Docs .............................. SUCCESS [8.263s]
[INFO] Camel :: Example :: ETL ............................... SUCCESS [12.083s]
[INFO] Camel :: Example :: GAE ............................... SUCCESS [7.024s]
[INFO] Camel :: Example :: GAuth ............................. SUCCESS [5.365s]
[INFO] Camel :: Example :: Guice :: JMS ...................... SUCCESS [10.923s]
[INFO] Camel :: Example :: JMS-File .......................... SUCCESS [10.239s]
[INFO] Camel :: Example :: Loadbalancer camel-mina ........... SUCCESS [1.736s]
[INFO] Camel :: Example :: Loan-Broker ....................... SUCCESS [5:33.927s]
[INFO] Camel :: Example :: Management ........................ SUCCESS [18.040s]
[INFO] Camel :: Example :: OSGi .............................. SUCCESS [1.618s]
[INFO] Camel :: Example :: POJO Messaging .................... SUCCESS [16.006s]
[INFO] Camel :: Example :: Report Incident ................... SUCCESS [14.548s]
[INFO] Camel :: Example :: Report Incident :: WS-Security .... SUCCESS [13.276s]
[INFO] Camel :: Example :: Route :: Throttling ............... SUCCESS [1.679s]
[INFO] Camel :: Example :: Spring ............................ SUCCESS [9.246s]
[INFO] Camel :: Example :: Spring :: JavaConfig .............. SUCCESS [10.536s]
[INFO] Camel :: Example :: Spring :: JMS ..................... SUCCESS [28.199s]
[INFO] Camel :: Example :: Spring :: XQuery .................. SUCCESS [1.782s]
[INFO] Camel :: Example :: Spring Security ................... SUCCESS [3.085s]
[INFO] Camel :: Example :: Tracer ............................ SUCCESS [1.750s]
[INFO] Camel :: Assembly ..................................... SKIPPED (dependency build failed
or was skipped)
[INFO] ------------------------------------------------------------------------
[INFO] Error for project: Camel :: JMX (during install)
[INFO] ------------------------------------------------------------------------
[INFO] Compilation failure

<https://hudson.apache.org/hudson/job/Camel.trunk.fulltest/ws/camel-trunk/components/camel-jmx/src/test/java/org/apache/camel/component/jmx/SimpleBeanFixture.java>:[27,24]
cannot find symbol
symbol  : class JMX
location: package javax.management
<https://hudson.apache.org/hudson/job/Camel.trunk.fulltest/ws/camel-trunk/components/camel-jmx/src/test/java/org/apache/camel/component/jmx/SimpleBeanFixture.java>:[131,35]
cannot find symbol
symbol  : variable JMX
location: class org.apache.camel.component.jmx.SimpleBeanFixture

[INFO] ------------------------------------------------------------------------
[INFO] Trace
org.apache.maven.BuildFailureException: Compilation failure
	at org.apache.maven.lifecycle.DefaultLifecycleExecutor.executeGoals(DefaultLifecycleExecutor.java:715)
	at org.apache.maven.lifecycle.DefaultLifecycleExecutor.executeGoalWithLifecycle(DefaultLifecycleExecutor.java:556)
	at org.apache.maven.lifecycle.DefaultLifecycleExecutor.executeGoal(DefaultLifecycleExecutor.java:535)
	at org.apache.maven.lifecycle.DefaultLifecycleExecutor.executeGoalAndHandleFailures(DefaultLifecycleExecutor.java:387)
	at org.apache.maven.lifecycle.DefaultLifecycleExecutor.executeTaskSegments(DefaultLifecycleExecutor.java:348)
	at org.apache.maven.lifecycle.DefaultLifecycleExecutor.execute(DefaultLifecycleExecutor.java:180)
	at org.apache.maven.lifecycle.LifecycleExecutorInterceptor.execute(LifecycleExecutorInterceptor.java:65)
	at org.apache.maven.DefaultMaven.doExecute(DefaultMaven.java:328)
	at org.apache.maven.DefaultMaven.execute(DefaultMaven.java:138)
	at org.apache.maven.cli.MavenCli.main(MavenCli.java:362)
	at sun.reflect.NativeMethodAccessorImpl.invoke0(Native Method)
	at sun.reflect.NativeMethodAccessorImpl.invoke(NativeMethodAccessorImpl.java:39)
	at sun.reflect.DelegatingMethodAccessorImpl.invoke(DelegatingMethodAccessorImpl.java:25)
	at java.lang.reflect.Method.invoke(Method.java:592)
	at org.codehaus.classworlds.Launcher.launchEnhanced(Launcher.java:315)
	at org.codehaus.classworlds.Launcher.launch(Launcher.java:255)
	at hudson.maven.agent.Main.launch(Main.java:165)
	at hudson.maven.MavenBuilder.call(MavenBuilder.java:165)
	at hudson.maven.MavenModuleSetBuild$Builder.call(MavenModuleSetBuild.java:750)
	at hudson.maven.MavenModuleSetBuild$Builder.call(MavenModuleSetBuild.java:694)
	at hudson.remoting.UserRequest.perform(UserRequest.java:114)
	at hudson.remoting.UserRequest.perform(UserRequest.java:48)
	at hudson.remoting.Request$2.run(Request.java:270)
	at java.util.concurrent.Executors$RunnableAdapter.call(Executors.java:417)
	at java.util.concurrent.FutureTask$Sync.innerRun(FutureTask.java:269)
	at java.util.concurrent.FutureTask.run(FutureTask.java:123)
	at java.util.concurrent.ThreadPoolExecutor$Worker.runTask(ThreadPoolExecutor.java:651)
	at java.util.concurrent.ThreadPoolExecutor$Worker.run(ThreadPoolExecutor.java:676)
	at java.lang.Thread.run(Thread.java:595)
Caused by: org.apache.maven.plugin.CompilationFailureException: Compilation failure
	at org.apache.maven.plugin.AbstractCompilerMojo.execute(AbstractCompilerMojo.java:656)
	at org.apache.maven.plugin.TestCompilerMojo.execute(TestCompilerMojo.java:161)
	at org.apache.maven.plugin.DefaultPluginManager.executeMojo(DefaultPluginManager.java:490)
	at hudson.maven.agent.PluginManagerInterceptor.executeMojo(PluginManagerInterceptor.java:182)
	at org.apache.maven.lifecycle.DefaultLifecycleExecutor.executeGoals(DefaultLifecycleExecutor.java:694)
	... 28 more
[INFO] ------------------------------------------------------------------------
[INFO] Error for project: Camel :: Test Bundles: mock-javamail-1.7 (during install)
[INFO] ------------------------------------------------------------------------
[INFO] Compilation failure

error: error reading <https://hudson.apache.org/hudson/job/Camel.trunk.fulltest/ws/.repository/javax/mail/mail/1.4/mail-1.4.jar;>
error in opening zip file
<https://hudson.apache.org/hudson/job/Camel.trunk.fulltest/ws/camel-trunk/tests/test-bundles/mock-javamail_1.7/src/main/java/org/jvnet/mock_javamail/provider/IMAPProvider.java>:[19,18]
package javax.mail does not exist
<https://hudson.apache.org/hudson/job/Camel.trunk.fulltest/ws/camel-trunk/tests/test-bundles/mock-javamail_1.7/src/main/java/org/jvnet/mock_javamail/provider/IMAPProvider.java>:[21,34]
cannot find symbol
symbol: class Provider
public class IMAPProvider extends Provider {
<https://hudson.apache.org/hudson/job/Camel.trunk.fulltest/ws/camel-trunk/tests/test-bundles/mock-javamail_1.7/src/main/java/org/jvnet/mock_javamail/provider/POP3Provider.java>:[19,18]
package javax.mail does not exist
<https://hudson.apache.org/hudson/job/Camel.trunk.fulltest/ws/camel-trunk/tests/test-bundles/mock-javamail_1.7/src/main/java/org/jvnet/mock_javamail/provider/POP3Provider.java>:[21,34]
cannot find symbol
symbol: class Provider
public class POP3Provider extends Provider {
<https://hudson.apache.org/hudson/job/Camel.trunk.fulltest/ws/camel-trunk/tests/test-bundles/mock-javamail_1.7/src/main/java/org/jvnet/mock_javamail/provider/SMTPProvider.java>:[19,18]
package javax.mail does not exist
<https://hudson.apache.org/hudson/job/Camel.trunk.fulltest/ws/camel-trunk/tests/test-bundles/mock-javamail_1.7/src/main/java/org/jvnet/mock_javamail/provider/SMTPProvider.java>:[21,34]
cannot find symbol
symbol: class Provider
public class SMTPProvider extends Provider {
<https://hudson.apache.org/hudson/job/Camel.trunk.fulltest/ws/camel-trunk/tests/test-bundles/mock-javamail_1.7/src/main/java/org/jvnet/mock_javamail/provider/IMAPProvider.java>:[24,14]
cannot find symbol
symbol  : variable Type
location: class org.jvnet.mock_javamail.provider.IMAPProvider
<https://hudson.apache.org/hudson/job/Camel.trunk.fulltest/ws/camel-trunk/tests/test-bundles/mock-javamail_1.7/src/main/java/org/jvnet/mock_javamail/provider/POP3Provider.java>:[24,14]
cannot find symbol
symbol  : variable Type
location: class org.jvnet.mock_javamail.provider.POP3Provider
<https://hudson.apache.org/hudson/job/Camel.trunk.fulltest/ws/camel-trunk/tests/test-bundles/mock-javamail_1.7/src/main/java/org/jvnet/mock_javamail/provider/SMTPProvider.java>:[24,14]
cannot find symbol
symbol  : variable Type
location: class org.jvnet.mock_javamail.provider.SMTPProvider

[INFO] ------------------------------------------------------------------------
[INFO] Trace
org.apache.maven.BuildFailureException: Compilation failure
	at org.apache.maven.lifecycle.DefaultLifecycleExecutor.executeGoals(DefaultLifecycleExecutor.java:715)
	at org.apache.maven.lifecycle.DefaultLifecycleExecutor.executeGoalWithLifecycle(DefaultLifecycleExecutor.java:556)
	at org.apache.maven.lifecycle.DefaultLifecycleExecutor.executeGoal(DefaultLifecycleExecutor.java:535)
	at org.apache.maven.lifecycle.DefaultLifecycleExecutor.executeGoalAndHandleFailures(DefaultLifecycleExecutor.java:387)
	at org.apache.maven.lifecycle.DefaultLifecycleExecutor.executeTaskSegments(DefaultLifecycleExecutor.java:348)
	at org.apache.maven.lifecycle.DefaultLifecycleExecutor.execute(DefaultLifecycleExecutor.java:180)
	at org.apache.maven.lifecycle.LifecycleExecutorInterceptor.execute(LifecycleExecutorInterceptor.java:65)
	at org.apache.maven.DefaultMaven.doExecute(DefaultMaven.java:328)
	at org.apache.maven.DefaultMaven.execute(DefaultMaven.java:138)
	at org.apache.maven.cli.MavenCli.main(MavenCli.java:362)
	at sun.reflect.NativeMethodAccessorImpl.invoke0(Native Method)
	at sun.reflect.NativeMethodAccessorImpl.invoke(NativeMethodAccessorImpl.java:39)
	at sun.reflect.DelegatingMethodAccessorImpl.invoke(DelegatingMethodAccessorImpl.java:25)
	at java.lang.reflect.Method.invoke(Method.java:592)
	at org.codehaus.classworlds.Launcher.launchEnhanced(Launcher.java:315)
	at org.codehaus.classworlds.Launcher.launch(Launcher.java:255)
	at hudson.maven.agent.Main.launch(Main.java:165)
	at hudson.maven.MavenBuilder.call(MavenBuilder.java:165)
	at hudson.maven.MavenModuleSetBuild$Builder.call(MavenModuleSetBuild.java:750)
	at hudson.maven.MavenModuleSetBuild$Builder.call(MavenModuleSetBuild.java:694)
	at hudson.remoting.UserRequest.perform(UserRequest.java:114)
	at hudson.remoting.UserRequest.perform(UserRequest.java:48)
	at hudson.remoting.Request$2.run(Request.java:270)
	at java.util.concurrent.Executors$RunnableAdapter.call(Executors.java:417)
	at java.util.concurrent.FutureTask$Sync.innerRun(FutureTask.java:269)
	at java.util.concurrent.FutureTask.run(FutureTask.java:123)
	at java.util.concurrent.ThreadPoolExecutor$Worker.runTask(ThreadPoolExecutor.java:651)
	at java.util.concurrent.ThreadPoolExecutor$Worker.run(ThreadPoolExecutor.java:676)
	at java.lang.Thread.run(Thread.java:595)
Caused by: org.apache.maven.plugin.CompilationFailureException: Compilation failure
	at org.apache.maven.plugin.AbstractCompilerMojo.execute(AbstractCompilerMojo.java:656)
	at org.apache.maven.plugin.CompilerMojo.execute(CompilerMojo.java:128)
	at org.apache.maven.plugin.DefaultPluginManager.executeMojo(DefaultPluginManager.java:490)
	at hudson.maven.agent.PluginManagerInterceptor.executeMojo(PluginManagerInterceptor.java:182)
	at org.apache.maven.lifecycle.DefaultLifecycleExecutor.executeGoals(DefaultLifecycleExecutor.java:694)
	... 28 more
[INFO] ------------------------------------------------------------------------
[INFO] BUILD ERRORS
[INFO] ------------------------------------------------------------------------
[INFO] Total time: 135 minutes 48 seconds
[INFO] Finished at: Sat Nov 06 20:28:10 UTC 2010
[INFO] Final Memory: 182M/283M
[INFO] ------------------------------------------------------------------------
Sending e-mails to: dev@camel.apache.org
Sending e-mails to: dev@camel.apache.org
Sending e-mails to: dev@camel.apache.org
Sending e-mails to: dev@camel.apache.org
Sending e-mails to: dev@camel.apache.org
Sending e-mails to: dev@camel.apache.org
channel stopped
[locks-and-latches] Releasing all the locks
[locks-and-latches] All the locks released


Mime
View raw message