camel-dev mailing list archives

Site index · List index
Message view « Date » · « Thread »
Top « Date » · « Thread »
From Apache Hudson Server <hud...@hudson.apache.org>
Subject Build failed in Hudson: Camel.trunk.fulltest #26
Date Wed, 03 Nov 2010 20:38:02 GMT
See <https://hudson.apache.org/hudson/job/Camel.trunk.fulltest/26/changes>

Changes:

[davsclaus] Added test based on user forum issue

[davsclaus] Fixed readme.txt

[ningjiang] CAMEL-3302 OsgiPackageScanClassResolver should have Non-OSGi classloader check
fallback

------------------------------------------
[...truncated 18035 lines...]
[INFO] Reading assembly descriptor: src/main/descriptors/windows-src.xml
[INFO] Building zip: <https://hudson.apache.org/hudson/job/Camel.trunk.fulltest/ws/camel-trunk/apache-camel/target/apache-camel-2.6-SNAPSHOT-src.zip>
[INFO] [ianal:verify-legal-files {execution: default}]
[INFO] Checking legal files in: apache-camel-2.6-SNAPSHOT.zip
[INFO] Checking legal files in: apache-camel-2.6-SNAPSHOT-src.zip
[INFO] [install:install {execution: default-install}]
[INFO] Installing <https://hudson.apache.org/hudson/job/Camel.trunk.fulltest/ws/camel-trunk/apache-camel/pom.xml>
to <https://hudson.apache.org/hudson/job/Camel.trunk.fulltest/ws/.repository/org/apache/camel/apache-camel/2.6-SNAPSHOT/apache-camel-2.6-SNAPSHOT.pom>
[INFO] Installing <https://hudson.apache.org/hudson/job/Camel.trunk.fulltest/ws/camel-trunk/apache-camel/target/apache-camel-2.6-SNAPSHOT.tar.gz>
to <https://hudson.apache.org/hudson/job/Camel.trunk.fulltest/ws/.repository/org/apache/camel/apache-camel/2.6-SNAPSHOT/apache-camel-2.6-SNAPSHOT.tar.gz>
[INFO] Installing <https://hudson.apache.org/hudson/job/Camel.trunk.fulltest/ws/camel-trunk/apache-camel/target/apache-camel-2.6-SNAPSHOT.zip>
to <https://hudson.apache.org/hudson/job/Camel.trunk.fulltest/ws/.repository/org/apache/camel/apache-camel/2.6-SNAPSHOT/apache-camel-2.6-SNAPSHOT.zip>
[INFO] Installing <https://hudson.apache.org/hudson/job/Camel.trunk.fulltest/ws/camel-trunk/apache-camel/target/apache-camel-2.6-SNAPSHOT-src.tar.gz>
to <https://hudson.apache.org/hudson/job/Camel.trunk.fulltest/ws/.repository/org/apache/camel/apache-camel/2.6-SNAPSHOT/apache-camel-2.6-SNAPSHOT-src.tar.gz>
[INFO] Installing <https://hudson.apache.org/hudson/job/Camel.trunk.fulltest/ws/camel-trunk/apache-camel/target/apache-camel-2.6-SNAPSHOT-src.zip>
to <https://hudson.apache.org/hudson/job/Camel.trunk.fulltest/ws/.repository/org/apache/camel/apache-camel/2.6-SNAPSHOT/apache-camel-2.6-SNAPSHOT-src.zip>
[HUDSON] Archiving <https://hudson.apache.org/hudson/job/Camel.trunk.fulltest/ws/camel-trunk/apache-camel/pom.xml>
to /home/hudson/hudson/jobs/Camel.trunk.fulltest/modules/org.apache.camel$apache-camel/builds/2010-11-03_18-04-59/archive/org.apache.camel/apache-camel/2.6-SNAPSHOT/pom.xml
[HUDSON] Archiving <https://hudson.apache.org/hudson/job/Camel.trunk.fulltest/ws/.repository/org/apache/camel/apache-camel/2.6-SNAPSHOT/apache-camel-2.6-SNAPSHOT.pom>
to /home/hudson/hudson/jobs/Camel.trunk.fulltest/modules/org.apache.camel$apache-camel/builds/2010-11-03_18-04-59/archive/org.apache.camel/apache-camel/2.6-SNAPSHOT/apache-camel-2.6-SNAPSHOT.pom
[HUDSON] Archiving <https://hudson.apache.org/hudson/job/Camel.trunk.fulltest/ws/camel-trunk/apache-camel/target/apache-camel-2.6-SNAPSHOT.tar.gz>
to /home/hudson/hudson/jobs/Camel.trunk.fulltest/modules/org.apache.camel$apache-camel/builds/2010-11-03_18-04-59/archive/org.apache.camel/apache-camel/2.6-SNAPSHOT/apache-camel-2.6-SNAPSHOT.tar.gz
[HUDSON] Archiving <https://hudson.apache.org/hudson/job/Camel.trunk.fulltest/ws/camel-trunk/apache-camel/target/apache-camel-2.6-SNAPSHOT.zip>
to /home/hudson/hudson/jobs/Camel.trunk.fulltest/modules/org.apache.camel$apache-camel/builds/2010-11-03_18-04-59/archive/org.apache.camel/apache-camel/2.6-SNAPSHOT/apache-camel-2.6-SNAPSHOT.zip
[HUDSON] Archiving <https://hudson.apache.org/hudson/job/Camel.trunk.fulltest/ws/camel-trunk/apache-camel/target/apache-camel-2.6-SNAPSHOT-src.tar.gz>
to /home/hudson/hudson/jobs/Camel.trunk.fulltest/modules/org.apache.camel$apache-camel/builds/2010-11-03_18-04-59/archive/org.apache.camel/apache-camel/2.6-SNAPSHOT/apache-camel-2.6-SNAPSHOT-src.tar.gz
[HUDSON] Archiving <https://hudson.apache.org/hudson/job/Camel.trunk.fulltest/ws/camel-trunk/apache-camel/target/apache-camel-2.6-SNAPSHOT-src.zip>
to /home/hudson/hudson/jobs/Camel.trunk.fulltest/modules/org.apache.camel$apache-camel/builds/2010-11-03_18-04-59/archive/org.apache.camel/apache-camel/2.6-SNAPSHOT/apache-camel-2.6-SNAPSHOT-src.zip
[INFO] 
[INFO] 
[INFO] ------------------------------------------------------------------------
[INFO] Reactor Summary:
[INFO] ------------------------------------------------------------------------
[INFO] Camel ................................................. SUCCESS [12.378s]
[INFO] Apache :: Camel Buildtools ............................ SUCCESS [2.807s]
[INFO] Camel :: Parent ....................................... SUCCESS [1.280s]
[INFO] Camel :: Core ......................................... SUCCESS [17:42.494s]
[INFO] Camel :: Core XML ..................................... SUCCESS [2.537s]
[INFO] Camel :: Core OSGi .................................... SUCCESS [5.565s]
[INFO] Camel :: Spring ....................................... SUCCESS [14:04.777s]
[INFO] Camel :: Test ......................................... SUCCESS [6.096s]
[INFO] Camel :: JMS .......................................... SUCCESS [24:01.209s]
[INFO] Camel :: AMQP ......................................... SUCCESS [4.797s]
[INFO] Camel :: Atom ......................................... SUCCESS [34.509s]
[INFO] Camel :: JUEL ......................................... SUCCESS [8.383s]
[INFO] Camel :: BAM .......................................... SUCCESS [40.208s]
[INFO] Camel :: Bean validator ............................... SUCCESS [9.003s]
[INFO] Camel :: Bindy ........................................ SUCCESS [33.488s]
[INFO] Camel :: Blueprint .................................... SUCCESS [5.783s]
[INFO] Camel :: Stream ....................................... SUCCESS [20.102s]
[INFO] Camel :: Cometd ....................................... SUCCESS [11.874s]
[INFO] Camel :: Components ................................... SUCCESS [0.287s]
[INFO] Camel :: Cache ........................................ SUCCESS [9.088s]
[INFO] Camel :: Castor ....................................... SUCCESS [8.244s]
[INFO] Camel :: Crypto ....................................... SUCCESS [30.702s]
[INFO] Camel :: CSV .......................................... SUCCESS [9.089s]
[INFO] Camel :: HTTP ......................................... SUCCESS [11.393s]
[INFO] Camel :: Jetty ........................................ SUCCESS [5:32.964s]
[INFO] Camel :: CXF .......................................... SUCCESS [7:42.666s]
[INFO] Camel :: Dozer ........................................ SUCCESS [6.838s]
[INFO] Camel :: Eclipse ...................................... SUCCESS [1.363s]
[INFO] Camel :: EJB .......................................... SUCCESS [8.539s]
[INFO] Camel :: Exec ......................................... SUCCESS [23.888s]
[INFO] Camel :: FlatPack ..................................... SUCCESS [17.990s]
[INFO] Camel :: Freemarker ................................... SUCCESS [10.684s]
[INFO] Camel :: FTP .......................................... SUCCESS [5:43.076s]
[INFO] Camel :: Servlet ...................................... SUCCESS [11.083s]
[INFO] Camel :: GAE .......................................... SUCCESS [40.920s]
[INFO] Camel :: Guice ........................................ SUCCESS [12.933s]
[INFO] Camel :: Groovy ....................................... SUCCESS [15.676s]
[INFO] Camel :: HawtDB ....................................... SUCCESS [2:44.105s]
[INFO] Camel :: HTTP4 (HttpClient 4.x) ....................... SUCCESS [1:03.489s]
[INFO] Camel :: MINA ......................................... SUCCESS [2:35.417s]
[INFO] Camel :: HL7 .......................................... SUCCESS [8.433s]
[INFO] Camel :: iBatis ....................................... SUCCESS [31.091s]
[INFO] Camel :: IRC .......................................... SUCCESS [4.786s]
[INFO] Camel :: Jackson ...................................... SUCCESS [7.731s]
[INFO] Camel :: Javaspace .................................... SUCCESS [2.029s]
[INFO] Camel :: JAXB ......................................... SUCCESS [1:05.380s]
[INFO] Camel :: JDBC ......................................... SUCCESS [18.667s]
[INFO] Camel :: Jing ......................................... SUCCESS [10.227s]
[INFO] Camel :: JoSQL ........................................ SUCCESS [5.790s]
[INFO] Camel :: Jasypt ....................................... SUCCESS [7.229s]
[INFO] Camel :: JCR .......................................... SUCCESS [56.766s]
[INFO] Camel :: JPA .......................................... SUCCESS [1:00.603s]
[INFO] Camel :: Java Toolbox for AS/400 ...................... SUCCESS [3.644s]
[INFO] Camel :: JXPath ....................................... SUCCESS [12.385s]
[INFO] Camel :: LDAP ......................................... SUCCESS [12.223s]
[INFO] Camel :: Lucene ....................................... SUCCESS [8.582s]
[INFO] Camel :: Mail ......................................... SUCCESS [1:36.940s]
[INFO] Camel :: MSV .......................................... SUCCESS [7.910s]
[INFO] Camel :: MVEL ......................................... SUCCESS [5.473s]
[INFO] Camel :: Netty ........................................ SUCCESS [19.672s]
[INFO] Camel :: Nagios ....................................... SUCCESS [22.853s]
[INFO] Camel :: OGNL ......................................... SUCCESS [7.289s]
[INFO] Camel :: Printer ...................................... SUCCESS [2.479s]
[INFO] Camel :: Protobuf ..................................... SUCCESS [6.258s]
[INFO] Camel :: Quartz ....................................... SUCCESS [2:26.800s]
[INFO] Camel :: QuickFIX/J ................................... SUCCESS [11.898s]
[INFO] Camel :: Restlet ...................................... SUCCESS [18.970s]
[INFO] Camel :: RMI .......................................... SUCCESS [5.200s]
[INFO] Camel :: Ruby ......................................... SUCCESS [7.855s]
[INFO] Camel :: RSS .......................................... SUCCESS [31.758s]
[INFO] Camel :: SAXON ........................................ SUCCESS [29.579s]
[INFO] Camel :: Velocity ..................................... SUCCESS [11.771s]
[INFO] Camel :: Scala ........................................ SUCCESS [2:33.322s]
[INFO] Camel :: Script ....................................... SUCCESS [42.940s]
[INFO] Camel :: SIP .......................................... SUCCESS [8.294s]
[INFO] Camel :: Shiro ........................................ SUCCESS [11.407s]
[INFO] Camel :: SMPP ......................................... SUCCESS [4.873s]
[INFO] Camel :: SNMP ......................................... SUCCESS [3.716s]
[INFO] Camel :: SOAP ......................................... SUCCESS [34.061s]
[INFO] Camel :: Spring Integration ........................... SUCCESS [12.054s]
[INFO] Camel :: Spring JavaConfig ............................ SUCCESS [6.430s]
[INFO] Camel :: Spring Security .............................. SUCCESS [7.887s]
[INFO] Camel :: SQL .......................................... SUCCESS [7.914s]
[INFO] Camel :: StringTemplate ............................... SUCCESS [6.236s]
[INFO] Camel :: TagSoup ...................................... SUCCESS [4.904s]
[INFO] Camel :: XMLBeans ..................................... SUCCESS [4.854s]
[INFO] Camel :: XML Security ................................. SUCCESS [7.403s]
[INFO] Camel :: XMPP ......................................... SUCCESS [4.811s]
[INFO] Camel :: XStream ...................................... SUCCESS [17.164s]
[INFO] Camel :: Platforms .................................... SUCCESS [0.271s]
[INFO] Camel :: Platforms :: Apache Karaf .................... SUCCESS [0.299s]
[INFO] Camel :: Platforms :: Apache Karaf :: Features ........ SUCCESS [0.578s]
[INFO] Camel :: Maven Plugins ................................ SUCCESS [0.273s]
[INFO] Camel :: Maven Camel Plugin ........................... SUCCESS [4.517s]
[INFO] Camel :: Maven Guice Plugin ........................... SUCCESS [2.723s]
[INFO] Camel :: Html to Pdf Plugin ........................... SUCCESS [2.190s]
[INFO] Camel :: Archetypes :: Camel Router with ActiveMQ ..... SUCCESS [1.381s]
[INFO] Camel :: Archetypes :: Component ...................... SUCCESS [1.225s]
[INFO] Camel :: Archetypes :: Router ......................... SUCCESS [1.230s]
[INFO] Camel :: Archetypes :: Scala Router ................... SUCCESS [1.276s]
[INFO] Camel :: Archetypes :: Spring XML Based Router ........ SUCCESS [1.153s]
[INFO] Camel :: Archetypes :: Camel Router WAR ............... SUCCESS [1.269s]
[INFO] Camel :: Archetypes ................................... SUCCESS [0.230s]
[INFO] Camel :: Manual ....................................... SUCCESS [1:29.742s]
[INFO] Camel :: Tooling ...................................... SUCCESS [0.348s]
[INFO] Camel :: Tests Bundles ................................ SUCCESS [2.288s]
[INFO] Camel :: Test Bundles: mock-javamail-1.7 .............. FAILED [0.836s]
[INFO] Camel :: Integration Tests ............................ SUCCESS [5:40.374s]
[INFO] Camel :: ITest :: Spring 2.0 .......................... SUCCESS [5.898s]
[INFO] Camel :: ITest :: Spring 2.5 .......................... SUCCESS [9.115s]
[INFO] Camel :: Partial Classpath Tests ...................... SUCCESS [4.138s]
[INFO] Camel :: OSGi Integration Tests ....................... SKIPPED (dependency build failed
or was skipped)
[INFO] Camel :: Tests ........................................ SUCCESS [0.259s]
[INFO] Camel :: Examples ..................................... SUCCESS [0.234s]
[INFO] Camel :: Example :: Aggregate ......................... SUCCESS [1.952s]
[INFO] Camel :: Example :: Axis .............................. SUCCESS [9.832s]
[INFO] Camel :: Example :: BAM ............................... SUCCESS [2.115s]
[INFO] Camel :: Example :: Cafe .............................. SUCCESS [35.703s]
[INFO] Camel :: Example :: CXF ............................... SUCCESS [26.984s]
[INFO] Camel :: Example :: CXF Proxy ......................... SUCCESS [8.121s]
[INFO] Camel :: Example :: CXF Tomcat ........................ SUCCESS [4.356s]
[INFO] Camel :: Example :: Docs .............................. SUCCESS [8.174s]
[INFO] Camel :: Example :: ETL ............................... SUCCESS [14.226s]
[INFO] Camel :: Example :: GAE ............................... SUCCESS [7.141s]
[INFO] Camel :: Example :: GAuth ............................. SUCCESS [7.424s]
[INFO] Camel :: Example :: Guice :: JMS ...................... SUCCESS [10.798s]
[INFO] Camel :: Example :: JMS-File .......................... SUCCESS [10.114s]
[INFO] Camel :: Example :: Loadbalancer camel-mina ........... SUCCESS [1.640s]
[INFO] Camel :: Example :: Loan-Broker ....................... SUCCESS [33.552s]
[INFO] Camel :: Example :: Management ........................ SUCCESS [18.035s]
[INFO] Camel :: Example :: OSGi .............................. SUCCESS [1.585s]
[INFO] Camel :: Example :: POJO Messaging .................... SUCCESS [16.308s]
[INFO] Camel :: Example :: Report Incident ................... SUCCESS [14.873s]
[INFO] Camel :: Example :: Report Incident :: WS-Security .... SUCCESS [13.336s]
[INFO] Camel :: Example :: Route :: Throttling ............... SUCCESS [1.667s]
[INFO] Camel :: Example :: Spring ............................ SUCCESS [9.094s]
[INFO] Camel :: Example :: Spring :: JavaConfig .............. SUCCESS [10.414s]
[INFO] Camel :: Example :: Spring :: JMS ..................... SUCCESS [28.052s]
[INFO] Camel :: Example :: Spring :: XQuery .................. SUCCESS [1.760s]
[INFO] Camel :: Example :: Spring Security ................... SUCCESS [2.738s]
[INFO] Camel :: Example :: Tracer ............................ SUCCESS [1.688s]
[INFO] Camel :: Assembly ..................................... SUCCESS [18:07.454s]
[INFO] ------------------------------------------------------------------------
[INFO] Error for project: Camel :: Test Bundles: mock-javamail-1.7 (during install)
[INFO] ------------------------------------------------------------------------
[INFO] Compilation failure

error: error reading <https://hudson.apache.org/hudson/job/Camel.trunk.fulltest/ws/.repository/javax/mail/mail/1.4/mail-1.4.jar;>
error in opening zip file
<https://hudson.apache.org/hudson/job/Camel.trunk.fulltest/ws/camel-trunk/tests/test-bundles/mock-javamail_1.7/src/main/java/org/jvnet/mock_javamail/provider/IMAPProvider.java>:[19,18]
package javax.mail does not exist
<https://hudson.apache.org/hudson/job/Camel.trunk.fulltest/ws/camel-trunk/tests/test-bundles/mock-javamail_1.7/src/main/java/org/jvnet/mock_javamail/provider/IMAPProvider.java>:[21,34]
cannot find symbol
symbol: class Provider
public class IMAPProvider extends Provider {
<https://hudson.apache.org/hudson/job/Camel.trunk.fulltest/ws/camel-trunk/tests/test-bundles/mock-javamail_1.7/src/main/java/org/jvnet/mock_javamail/provider/POP3Provider.java>:[19,18]
package javax.mail does not exist
<https://hudson.apache.org/hudson/job/Camel.trunk.fulltest/ws/camel-trunk/tests/test-bundles/mock-javamail_1.7/src/main/java/org/jvnet/mock_javamail/provider/POP3Provider.java>:[21,34]
cannot find symbol
symbol: class Provider
public class POP3Provider extends Provider {
<https://hudson.apache.org/hudson/job/Camel.trunk.fulltest/ws/camel-trunk/tests/test-bundles/mock-javamail_1.7/src/main/java/org/jvnet/mock_javamail/provider/SMTPProvider.java>:[19,18]
package javax.mail does not exist
<https://hudson.apache.org/hudson/job/Camel.trunk.fulltest/ws/camel-trunk/tests/test-bundles/mock-javamail_1.7/src/main/java/org/jvnet/mock_javamail/provider/SMTPProvider.java>:[21,34]
cannot find symbol
symbol: class Provider
public class SMTPProvider extends Provider {
<https://hudson.apache.org/hudson/job/Camel.trunk.fulltest/ws/camel-trunk/tests/test-bundles/mock-javamail_1.7/src/main/java/org/jvnet/mock_javamail/provider/IMAPProvider.java>:[24,14]
cannot find symbol
symbol  : variable Type
location: class org.jvnet.mock_javamail.provider.IMAPProvider
<https://hudson.apache.org/hudson/job/Camel.trunk.fulltest/ws/camel-trunk/tests/test-bundles/mock-javamail_1.7/src/main/java/org/jvnet/mock_javamail/provider/POP3Provider.java>:[24,14]
cannot find symbol
symbol  : variable Type
location: class org.jvnet.mock_javamail.provider.POP3Provider
<https://hudson.apache.org/hudson/job/Camel.trunk.fulltest/ws/camel-trunk/tests/test-bundles/mock-javamail_1.7/src/main/java/org/jvnet/mock_javamail/provider/SMTPProvider.java>:[24,14]
cannot find symbol
symbol  : variable Type
location: class org.jvnet.mock_javamail.provider.SMTPProvider

[INFO] ------------------------------------------------------------------------
[INFO] Trace
org.apache.maven.BuildFailureException: Compilation failure
	at org.apache.maven.lifecycle.DefaultLifecycleExecutor.executeGoals(DefaultLifecycleExecutor.java:715)
	at org.apache.maven.lifecycle.DefaultLifecycleExecutor.executeGoalWithLifecycle(DefaultLifecycleExecutor.java:556)
	at org.apache.maven.lifecycle.DefaultLifecycleExecutor.executeGoal(DefaultLifecycleExecutor.java:535)
	at org.apache.maven.lifecycle.DefaultLifecycleExecutor.executeGoalAndHandleFailures(DefaultLifecycleExecutor.java:387)
	at org.apache.maven.lifecycle.DefaultLifecycleExecutor.executeTaskSegments(DefaultLifecycleExecutor.java:348)
	at org.apache.maven.lifecycle.DefaultLifecycleExecutor.execute(DefaultLifecycleExecutor.java:180)
	at org.apache.maven.lifecycle.LifecycleExecutorInterceptor.execute(LifecycleExecutorInterceptor.java:65)
	at org.apache.maven.DefaultMaven.doExecute(DefaultMaven.java:328)
	at org.apache.maven.DefaultMaven.execute(DefaultMaven.java:138)
	at org.apache.maven.cli.MavenCli.main(MavenCli.java:362)
	at sun.reflect.NativeMethodAccessorImpl.invoke0(Native Method)
	at sun.reflect.NativeMethodAccessorImpl.invoke(NativeMethodAccessorImpl.java:39)
	at sun.reflect.DelegatingMethodAccessorImpl.invoke(DelegatingMethodAccessorImpl.java:25)
	at java.lang.reflect.Method.invoke(Method.java:592)
	at org.codehaus.classworlds.Launcher.launchEnhanced(Launcher.java:315)
	at org.codehaus.classworlds.Launcher.launch(Launcher.java:255)
	at hudson.maven.agent.Main.launch(Main.java:165)
	at hudson.maven.MavenBuilder.call(MavenBuilder.java:165)
	at hudson.maven.MavenModuleSetBuild$Builder.call(MavenModuleSetBuild.java:750)
	at hudson.maven.MavenModuleSetBuild$Builder.call(MavenModuleSetBuild.java:694)
	at hudson.remoting.UserRequest.perform(UserRequest.java:114)
	at hudson.remoting.UserRequest.perform(UserRequest.java:48)
	at hudson.remoting.Request$2.run(Request.java:270)
	at java.util.concurrent.Executors$RunnableAdapter.call(Executors.java:417)
	at java.util.concurrent.FutureTask$Sync.innerRun(FutureTask.java:269)
	at java.util.concurrent.FutureTask.run(FutureTask.java:123)
	at java.util.concurrent.ThreadPoolExecutor$Worker.runTask(ThreadPoolExecutor.java:651)
	at java.util.concurrent.ThreadPoolExecutor$Worker.run(ThreadPoolExecutor.java:676)
	at java.lang.Thread.run(Thread.java:595)
Caused by: org.apache.maven.plugin.CompilationFailureException: Compilation failure
	at org.apache.maven.plugin.AbstractCompilerMojo.execute(AbstractCompilerMojo.java:656)
	at org.apache.maven.plugin.CompilerMojo.execute(CompilerMojo.java:128)
	at org.apache.maven.plugin.DefaultPluginManager.executeMojo(DefaultPluginManager.java:490)
	at hudson.maven.agent.PluginManagerInterceptor.executeMojo(PluginManagerInterceptor.java:182)
	at org.apache.maven.lifecycle.DefaultLifecycleExecutor.executeGoals(DefaultLifecycleExecutor.java:694)
	... 28 more
[INFO] ------------------------------------------------------------------------
[INFO] BUILD ERRORS
[INFO] ------------------------------------------------------------------------
[INFO] Total time: 152 minutes 50 seconds
[INFO] Finished at: Wed Nov 03 20:37:59 UTC 2010
[INFO] Final Memory: 170M/514M
[INFO] ------------------------------------------------------------------------
Sending e-mails to: dev@camel.apache.org
Sending e-mails to: dev@camel.apache.org
Sending e-mails to: dev@camel.apache.org
Sending e-mails to: dev@camel.apache.org
Sending e-mails to: dev@camel.apache.org
Sending e-mails to: dev@camel.apache.org
Sending e-mails to: dev@camel.apache.org
Sending e-mails to: dev@camel.apache.org
channel stopped
[locks-and-latches] Releasing all the locks
[locks-and-latches] All the locks released


Mime
View raw message