camel-dev mailing list archives

Site index · List index
Message view « Date » · « Thread »
Top « Date » · « Thread »
From Apache Hudson Server <hud...@hudson.apache.org>
Subject Build failed in Hudson: Camel #1048
Date Wed, 03 Nov 2010 05:28:26 GMT
See <https://hudson.apache.org/hudson/job/Camel/1048/changes>

Changes:

[ningjiang] CAMEL-3303 Exporting the package META-INF.cxf.camel instead of META-INF.cxf in
camel-cxf bundle

[ningjiang] CAMEL-3269 also updated the method of getCxfOutMessage

[ningjiang] Clean up the code of DefaultCxfBinding

[davsclaus] Skipping test which doesnt work well on all boxes.

[davsclaus] CAMEL-3300: Applied patch from Freeman. To let mvn eclipse:eclipse work.

------------------------------------------
[...truncated 16889 lines...]
[WARNING] Cannot include project artifact: org.apache.camel:apache-camel:pom:2.6-SNAPSHOT;
it doesn't have an associated file or directory.
[WARNING] Cannot include project artifact: org.apache.camel:apache-camel:pom:2.6-SNAPSHOT;
it doesn't have an associated file or directory.
[WARNING] Cannot include project artifact: org.apache.camel:apache-camel:pom:2.6-SNAPSHOT;
it doesn't have an associated file or directory.
[INFO] Building zip: <https://hudson.apache.org/hudson/job/Camel/ws/camel-trunk/apache-camel/target/apache-camel-2.6-SNAPSHOT.zip>
[INFO] [assembly:single {execution: unix-src}]
[INFO] Reading assembly descriptor: src/main/descriptors/unix-src.xml
[INFO] Building tar : <https://hudson.apache.org/hudson/job/Camel/ws/camel-trunk/apache-camel/target/apache-camel-2.6-SNAPSHOT-src.tar.gz>
[INFO] [assembly:single {execution: windows-src}]
[INFO] Reading assembly descriptor: src/main/descriptors/windows-src.xml
[INFO] Building zip: <https://hudson.apache.org/hudson/job/Camel/ws/camel-trunk/apache-camel/target/apache-camel-2.6-SNAPSHOT-src.zip>
[INFO] [ianal:verify-legal-files {execution: default}]
[INFO] Checking legal files in: apache-camel-2.6-SNAPSHOT.zip
[INFO] Checking legal files in: apache-camel-2.6-SNAPSHOT-src.zip
[INFO] [install:install {execution: default-install}]
[INFO] Installing <https://hudson.apache.org/hudson/job/Camel/ws/camel-trunk/apache-camel/pom.xml>
to <https://hudson.apache.org/hudson/job/Camel/ws/.repository/org/apache/camel/apache-camel/2.6-SNAPSHOT/apache-camel-2.6-SNAPSHOT.pom>
[INFO] Installing <https://hudson.apache.org/hudson/job/Camel/ws/camel-trunk/apache-camel/target/apache-camel-2.6-SNAPSHOT.tar.gz>
to <https://hudson.apache.org/hudson/job/Camel/ws/.repository/org/apache/camel/apache-camel/2.6-SNAPSHOT/apache-camel-2.6-SNAPSHOT.tar.gz>
[INFO] Installing <https://hudson.apache.org/hudson/job/Camel/ws/camel-trunk/apache-camel/target/apache-camel-2.6-SNAPSHOT.zip>
to <https://hudson.apache.org/hudson/job/Camel/ws/.repository/org/apache/camel/apache-camel/2.6-SNAPSHOT/apache-camel-2.6-SNAPSHOT.zip>
[INFO] Installing <https://hudson.apache.org/hudson/job/Camel/ws/camel-trunk/apache-camel/target/apache-camel-2.6-SNAPSHOT-src.tar.gz>
to <https://hudson.apache.org/hudson/job/Camel/ws/.repository/org/apache/camel/apache-camel/2.6-SNAPSHOT/apache-camel-2.6-SNAPSHOT-src.tar.gz>
[INFO] Installing <https://hudson.apache.org/hudson/job/Camel/ws/camel-trunk/apache-camel/target/apache-camel-2.6-SNAPSHOT-src.zip>
to <https://hudson.apache.org/hudson/job/Camel/ws/.repository/org/apache/camel/apache-camel/2.6-SNAPSHOT/apache-camel-2.6-SNAPSHOT-src.zip>
[HUDSON] Archiving <https://hudson.apache.org/hudson/job/Camel/ws/.repository/org/apache/camel/apache-camel/2.6-SNAPSHOT/apache-camel-2.6-SNAPSHOT.pom>
to /home/hudson/hudson/jobs/Camel/modules/org.apache.camel$apache-camel/builds/2010-11-03_04-25-09/archive/org.apache.camel/apache-camel/2.6-SNAPSHOT/apache-camel-2.6-SNAPSHOT.pom
[HUDSON] Archiving <https://hudson.apache.org/hudson/job/Camel/ws/camel-trunk/apache-camel/target/apache-camel-2.6-SNAPSHOT.tar.gz>
to /home/hudson/hudson/jobs/Camel/modules/org.apache.camel$apache-camel/builds/2010-11-03_04-25-09/archive/org.apache.camel/apache-camel/2.6-SNAPSHOT/apache-camel-2.6-SNAPSHOT.tar.gz
[HUDSON] Archiving <https://hudson.apache.org/hudson/job/Camel/ws/camel-trunk/apache-camel/target/apache-camel-2.6-SNAPSHOT.zip>
to /home/hudson/hudson/jobs/Camel/modules/org.apache.camel$apache-camel/builds/2010-11-03_04-25-09/archive/org.apache.camel/apache-camel/2.6-SNAPSHOT/apache-camel-2.6-SNAPSHOT.zip
[HUDSON] Archiving <https://hudson.apache.org/hudson/job/Camel/ws/camel-trunk/apache-camel/target/apache-camel-2.6-SNAPSHOT-src.tar.gz>
to /home/hudson/hudson/jobs/Camel/modules/org.apache.camel$apache-camel/builds/2010-11-03_04-25-09/archive/org.apache.camel/apache-camel/2.6-SNAPSHOT/apache-camel-2.6-SNAPSHOT-src.tar.gz
[HUDSON] Archiving <https://hudson.apache.org/hudson/job/Camel/ws/camel-trunk/apache-camel/target/apache-camel-2.6-SNAPSHOT-src.zip>
to /home/hudson/hudson/jobs/Camel/modules/org.apache.camel$apache-camel/builds/2010-11-03_04-25-09/archive/org.apache.camel/apache-camel/2.6-SNAPSHOT/apache-camel-2.6-SNAPSHOT-src.zip
[INFO] 
[INFO] 
[INFO] ------------------------------------------------------------------------
[INFO] Reactor Summary:
[INFO] ------------------------------------------------------------------------
[INFO] Camel ................................................. SUCCESS [40.915s]
[INFO] Apache :: Camel Buildtools ............................ SUCCESS [36.056s]
[INFO] Camel :: Parent ....................................... SUCCESS [43.871s]
[INFO] Camel :: Core ......................................... SUCCESS [1:51.185s]
[INFO] Camel :: Core XML ..................................... SUCCESS [5.128s]
[INFO] Camel :: Core OSGi .................................... SUCCESS [10.460s]
[INFO] Camel :: Spring ....................................... SUCCESS [1:19.667s]
[INFO] Camel :: Test ......................................... SUCCESS [9.236s]
[INFO] Camel :: JMS .......................................... SUCCESS [48.446s]
[INFO] Camel :: AMQP ......................................... SUCCESS [36.830s]
[INFO] Camel :: Atom ......................................... SUCCESS [29.518s]
[INFO] Camel :: JUEL ......................................... SUCCESS [8.701s]
[INFO] Camel :: BAM .......................................... SUCCESS [30.331s]
[INFO] Camel :: Bean validator ............................... SUCCESS [9.102s]
[INFO] Camel :: Bindy ........................................ SUCCESS [7.007s]
[INFO] Camel :: Blueprint .................................... SUCCESS [15.507s]
[INFO] Camel :: Stream ....................................... SUCCESS [5.026s]
[INFO] Camel :: Cometd ....................................... SUCCESS [35.050s]
[INFO] Camel :: Components ................................... SUCCESS [1.871s]
[INFO] Camel :: Cache ........................................ SUCCESS [12.322s]
[INFO] Camel :: Castor ....................................... SUCCESS [10.014s]
[INFO] Camel :: Crypto ....................................... SUCCESS [7.856s]
[INFO] Camel :: CSV .......................................... SUCCESS [9.298s]
[INFO] Camel :: HTTP ......................................... SUCCESS [7.078s]
[INFO] Camel :: Jetty ........................................ SUCCESS [15.794s]
[INFO] Camel :: CXF .......................................... SUCCESS [2:25.481s]
[INFO] Camel :: Dozer ........................................ SUCCESS [8.541s]
[INFO] Camel :: Eclipse ...................................... SUCCESS [5.560s]
[INFO] Camel :: EJB .......................................... SUCCESS [1:11.349s]
[INFO] Camel :: Exec ......................................... SUCCESS [6.658s]
[INFO] Camel :: FlatPack ..................................... SUCCESS [11.178s]
[INFO] Camel :: Freemarker ................................... SUCCESS [6.966s]
[INFO] Camel :: FTP .......................................... SUCCESS [21.341s]
[INFO] Camel :: Servlet ...................................... SUCCESS [10.152s]
[INFO] Camel :: GAE .......................................... SUCCESS [1:56.366s]
[INFO] Camel :: Guice ........................................ SUCCESS [11.703s]
[INFO] Camel :: Groovy ....................................... SUCCESS [11.753s]
[INFO] Camel :: HawtDB ....................................... SUCCESS [10.426s]
[INFO] Camel :: HTTP4 (HttpClient 4.x) ....................... SUCCESS [6.718s]
[INFO] Camel :: MINA ......................................... SUCCESS [6.401s]
[INFO] Camel :: HL7 .......................................... SUCCESS [18.865s]
[INFO] Camel :: iBatis ....................................... SUCCESS [6.765s]
[INFO] Camel :: IRC .......................................... SUCCESS [6.611s]
[INFO] Camel :: Jackson ...................................... SUCCESS [8.727s]
[INFO] Camel :: Javaspace .................................... SUCCESS [9.409s]
[INFO] Camel :: JAXB ......................................... SUCCESS [14.364s]
[INFO] Camel :: JDBC ......................................... SUCCESS [6.299s]
[INFO] Camel :: Jing ......................................... SUCCESS [6.617s]
[INFO] Camel :: JoSQL ........................................ SUCCESS [6.596s]
[INFO] Camel :: Jasypt ....................................... SUCCESS [12.986s]
[INFO] Camel :: JCR .......................................... SUCCESS [31.898s]
[INFO] Camel :: JPA .......................................... SUCCESS [22.983s]
[INFO] Camel :: Java Toolbox for AS/400 ...................... SUCCESS [10.124s]
[INFO] Camel :: JXPath ....................................... SUCCESS [6.823s]
[INFO] Camel :: LDAP ......................................... SUCCESS [1:35.487s]
[INFO] Camel :: Lucene ....................................... SUCCESS [12.086s]
[INFO] Camel :: Mail ......................................... SUCCESS [8.847s]
[INFO] Camel :: MSV .......................................... SUCCESS [13.240s]
[INFO] Camel :: MVEL ......................................... SUCCESS [6.752s]
[INFO] Camel :: Netty ........................................ SUCCESS [7.999s]
[INFO] Camel :: Nagios ....................................... SUCCESS [6.518s]
[INFO] Camel :: OGNL ......................................... SUCCESS [7.132s]
[INFO] Camel :: Printer ...................................... SUCCESS [6.559s]
[INFO] Camel :: Protobuf ..................................... SUCCESS [8.520s]
[INFO] Camel :: Quartz ....................................... SUCCESS [10.157s]
[INFO] Camel :: QuickFIX/J ................................... SUCCESS [9.876s]
[INFO] Camel :: Restlet ...................................... SUCCESS [8.730s]
[INFO] Camel :: RMI .......................................... SUCCESS [5.195s]
[INFO] Camel :: Ruby ......................................... SUCCESS [22.392s]
[INFO] Camel :: RSS .......................................... SUCCESS [7.241s]
[INFO] Camel :: SAXON ........................................ SUCCESS [33.346s]
[INFO] Camel :: Velocity ..................................... SUCCESS [5.437s]
[INFO] Camel :: Scala ........................................ SUCCESS [2:12.195s]
[INFO] Camel :: Script ....................................... SUCCESS [16.481s]
[INFO] Camel :: SIP .......................................... SUCCESS [8.927s]
[INFO] Camel :: Shiro ........................................ SUCCESS [7.160s]
[INFO] Camel :: SMPP ......................................... SUCCESS [7.276s]
[INFO] Camel :: SNMP ......................................... SUCCESS [6.893s]
[INFO] Camel :: SOAP ......................................... SUCCESS [14.980s]
[INFO] Camel :: Spring Integration ........................... SUCCESS [7.208s]
[INFO] Camel :: Spring JavaConfig ............................ SUCCESS [20.471s]
[INFO] Camel :: Spring Security .............................. SUCCESS [13.079s]
[INFO] Camel :: SQL .......................................... SUCCESS [5.328s]
[INFO] Camel :: StringTemplate ............................... SUCCESS [6.454s]
[INFO] Camel :: TagSoup ...................................... SUCCESS [6.590s]
[INFO] Camel :: XMLBeans ..................................... SUCCESS [7.565s]
[INFO] Camel :: XML Security ................................. SUCCESS [7.619s]
[INFO] Camel :: XMPP ......................................... SUCCESS [9.155s]
[INFO] Camel :: XStream ...................................... SUCCESS [9.819s]
[INFO] Camel :: Platforms .................................... SUCCESS [1.912s]
[INFO] Camel :: Platforms :: Apache Karaf .................... SUCCESS [1.883s]
[INFO] Camel :: Platforms :: Apache Karaf :: Features ........ SUCCESS [45.700s]
[INFO] Camel :: Maven Plugins ................................ SUCCESS [2.665s]
[INFO] Camel :: Maven Camel Plugin ........................... SUCCESS [1:23.353s]
[INFO] Camel :: Maven Guice Plugin ........................... SUCCESS [9.696s]
[INFO] Camel :: Html to Pdf Plugin ........................... SUCCESS [8.855s]
[INFO] Camel :: Archetypes :: Camel Router with ActiveMQ ..... SUCCESS [4.117s]
[INFO] Camel :: Archetypes :: Component ...................... SUCCESS [5.587s]
[INFO] Camel :: Archetypes :: Router ......................... SUCCESS [4.144s]
[INFO] Camel :: Archetypes :: Scala Router ................... SUCCESS [4.424s]
[INFO] Camel :: Archetypes :: Spring XML Based Router ........ SUCCESS [4.362s]
[INFO] Camel :: Archetypes :: Camel Router WAR ............... SUCCESS [4.129s]
[INFO] Camel :: Archetypes ................................... SUCCESS [1.944s]
[INFO] Camel :: Manual ....................................... SUCCESS [2:29.051s]
[INFO] Camel :: Tooling ...................................... SUCCESS [1.948s]
[INFO] Camel :: Tests Bundles ................................ SUCCESS [49.859s]
[INFO] Camel :: Test Bundles: mock-javamail-1.7 .............. FAILED [2.984s]
[INFO] Camel :: Integration Tests ............................ SUCCESS [42.406s]
[INFO] Camel :: ITest :: Spring 2.0 .......................... SUCCESS [8.214s]
[INFO] Camel :: ITest :: Spring 2.5 .......................... SUCCESS [8.603s]
[INFO] Camel :: Partial Classpath Tests ...................... SUCCESS [4.895s]
[INFO] Camel :: OSGi Integration Tests ....................... SKIPPED (dependency build failed
or was skipped)
[INFO] Camel :: Tests ........................................ SUCCESS [1.878s]
[INFO] Camel :: Examples ..................................... SUCCESS [1.928s]
[INFO] Camel :: Example :: Aggregate ......................... SUCCESS [10.083s]
[INFO] Camel :: Example :: Axis .............................. SUCCESS [1:16.532s]
[INFO] Camel :: Example :: BAM ............................... SUCCESS [10.804s]
[INFO] Camel :: Example :: Cafe .............................. SUCCESS [5.303s]
[INFO] Camel :: Example :: CXF ............................... SUCCESS [16.009s]
[INFO] Camel :: Example :: CXF Proxy ......................... SUCCESS [8.282s]
[INFO] Camel :: Example :: CXF Tomcat ........................ SUCCESS [1:28.373s]
[INFO] Camel :: Example :: Docs .............................. SUCCESS [5.252s]
[INFO] Camel :: Example :: ETL ............................... SUCCESS [36.613s]
[INFO] Camel :: Example :: GAE ............................... SUCCESS [1:32.699s]
[INFO] Camel :: Example :: GAuth ............................. SUCCESS [1:54.316s]
[INFO] Camel :: Example :: Guice :: JMS ...................... SUCCESS [12.280s]
[INFO] Camel :: Example :: JMS-File .......................... SUCCESS [5.315s]
[INFO] Camel :: Example :: Loadbalancer camel-mina ........... SUCCESS [5.280s]
[INFO] Camel :: Example :: Loan-Broker ....................... SUCCESS [8.204s]
[INFO] Camel :: Example :: Management ........................ SUCCESS [5.287s]
[INFO] Camel :: Example :: OSGi .............................. SUCCESS [4.612s]
[INFO] Camel :: Example :: POJO Messaging .................... SUCCESS [5.349s]
[INFO] Camel :: Example :: Report Incident ................... SUCCESS [1:57.023s]
[INFO] Camel :: Example :: Report Incident :: WS-Security .... SUCCESS [10.725s]
[INFO] Camel :: Example :: Route :: Throttling ............... SUCCESS [5.863s]
[INFO] Camel :: Example :: Spring ............................ SUCCESS [5.255s]
[INFO] Camel :: Example :: Spring :: JavaConfig .............. SUCCESS [9.239s]
[INFO] Camel :: Example :: Spring :: JMS ..................... SUCCESS [7.924s]
[INFO] Camel :: Example :: Spring :: XQuery .................. SUCCESS [5.035s]
[INFO] Camel :: Example :: Spring Security ................... SUCCESS [47.490s]
[INFO] Camel :: Example :: Tracer ............................ SUCCESS [5.300s]
[INFO] Camel :: Assembly ..................................... SUCCESS [5:35.130s]
[INFO] ------------------------------------------------------------------------
[INFO] Error for project: Camel :: Test Bundles: mock-javamail-1.7 (during install)
[INFO] ------------------------------------------------------------------------
[INFO] Compilation failure

error: error reading <https://hudson.apache.org/hudson/job/Camel/ws/.repository/javax/mail/mail/1.4/mail-1.4.jar;>
error in opening zip file
<https://hudson.apache.org/hudson/job/Camel/ws/camel-trunk/tests/test-bundles/mock-javamail_1.7/src/main/java/org/jvnet/mock_javamail/provider/POP3Provider.java>:[19,18]
package javax.mail does not exist
<https://hudson.apache.org/hudson/job/Camel/ws/camel-trunk/tests/test-bundles/mock-javamail_1.7/src/main/java/org/jvnet/mock_javamail/provider/POP3Provider.java>:[21,34]
cannot find symbol
symbol: class Provider
public class POP3Provider extends Provider {
<https://hudson.apache.org/hudson/job/Camel/ws/camel-trunk/tests/test-bundles/mock-javamail_1.7/src/main/java/org/jvnet/mock_javamail/provider/IMAPProvider.java>:[19,18]
package javax.mail does not exist
<https://hudson.apache.org/hudson/job/Camel/ws/camel-trunk/tests/test-bundles/mock-javamail_1.7/src/main/java/org/jvnet/mock_javamail/provider/IMAPProvider.java>:[21,34]
cannot find symbol
symbol: class Provider
public class IMAPProvider extends Provider {
<https://hudson.apache.org/hudson/job/Camel/ws/camel-trunk/tests/test-bundles/mock-javamail_1.7/src/main/java/org/jvnet/mock_javamail/provider/SMTPProvider.java>:[19,18]
package javax.mail does not exist
<https://hudson.apache.org/hudson/job/Camel/ws/camel-trunk/tests/test-bundles/mock-javamail_1.7/src/main/java/org/jvnet/mock_javamail/provider/SMTPProvider.java>:[21,34]
cannot find symbol
symbol: class Provider
public class SMTPProvider extends Provider {
<https://hudson.apache.org/hudson/job/Camel/ws/camel-trunk/tests/test-bundles/mock-javamail_1.7/src/main/java/org/jvnet/mock_javamail/provider/POP3Provider.java>:[24,14]
cannot find symbol
symbol  : variable Type
location: class org.jvnet.mock_javamail.provider.POP3Provider
<https://hudson.apache.org/hudson/job/Camel/ws/camel-trunk/tests/test-bundles/mock-javamail_1.7/src/main/java/org/jvnet/mock_javamail/provider/IMAPProvider.java>:[24,14]
cannot find symbol
symbol  : variable Type
location: class org.jvnet.mock_javamail.provider.IMAPProvider
<https://hudson.apache.org/hudson/job/Camel/ws/camel-trunk/tests/test-bundles/mock-javamail_1.7/src/main/java/org/jvnet/mock_javamail/provider/SMTPProvider.java>:[24,14]
cannot find symbol
symbol  : variable Type
location: class org.jvnet.mock_javamail.provider.SMTPProvider

[INFO] ------------------------------------------------------------------------
[INFO] Trace
org.apache.maven.BuildFailureException: Compilation failure
	at org.apache.maven.lifecycle.DefaultLifecycleExecutor.executeGoals(DefaultLifecycleExecutor.java:715)
	at org.apache.maven.lifecycle.DefaultLifecycleExecutor.executeGoalWithLifecycle(DefaultLifecycleExecutor.java:556)
	at org.apache.maven.lifecycle.DefaultLifecycleExecutor.executeGoal(DefaultLifecycleExecutor.java:535)
	at org.apache.maven.lifecycle.DefaultLifecycleExecutor.executeGoalAndHandleFailures(DefaultLifecycleExecutor.java:387)
	at org.apache.maven.lifecycle.DefaultLifecycleExecutor.executeTaskSegments(DefaultLifecycleExecutor.java:348)
	at org.apache.maven.lifecycle.DefaultLifecycleExecutor.execute(DefaultLifecycleExecutor.java:180)
	at org.apache.maven.lifecycle.LifecycleExecutorInterceptor.execute(LifecycleExecutorInterceptor.java:65)
	at org.apache.maven.DefaultMaven.doExecute(DefaultMaven.java:328)
	at org.apache.maven.DefaultMaven.execute(DefaultMaven.java:138)
	at org.apache.maven.cli.MavenCli.main(MavenCli.java:362)
	at sun.reflect.NativeMethodAccessorImpl.invoke0(Native Method)
	at sun.reflect.NativeMethodAccessorImpl.invoke(NativeMethodAccessorImpl.java:39)
	at sun.reflect.DelegatingMethodAccessorImpl.invoke(DelegatingMethodAccessorImpl.java:25)
	at java.lang.reflect.Method.invoke(Method.java:592)
	at org.codehaus.classworlds.Launcher.launchEnhanced(Launcher.java:315)
	at org.codehaus.classworlds.Launcher.launch(Launcher.java:255)
	at hudson.maven.agent.Main.launch(Main.java:165)
	at hudson.maven.MavenBuilder.call(MavenBuilder.java:165)
	at hudson.maven.MavenModuleSetBuild$Builder.call(MavenModuleSetBuild.java:750)
	at hudson.maven.MavenModuleSetBuild$Builder.call(MavenModuleSetBuild.java:694)
	at hudson.remoting.UserRequest.perform(UserRequest.java:114)
	at hudson.remoting.UserRequest.perform(UserRequest.java:48)
	at hudson.remoting.Request$2.run(Request.java:270)
	at java.util.concurrent.Executors$RunnableAdapter.call(Executors.java:417)
	at java.util.concurrent.FutureTask$Sync.innerRun(FutureTask.java:269)
	at java.util.concurrent.FutureTask.run(FutureTask.java:123)
	at java.util.concurrent.ThreadPoolExecutor$Worker.runTask(ThreadPoolExecutor.java:651)
	at java.util.concurrent.ThreadPoolExecutor$Worker.run(ThreadPoolExecutor.java:676)
	at java.lang.Thread.run(Thread.java:595)
Caused by: org.apache.maven.plugin.CompilationFailureException: Compilation failure
	at org.apache.maven.plugin.AbstractCompilerMojo.execute(AbstractCompilerMojo.java:656)
	at org.apache.maven.plugin.CompilerMojo.execute(CompilerMojo.java:128)
	at org.apache.maven.plugin.DefaultPluginManager.executeMojo(DefaultPluginManager.java:490)
	at hudson.maven.agent.PluginManagerInterceptor.executeMojo(PluginManagerInterceptor.java:182)
	at org.apache.maven.lifecycle.DefaultLifecycleExecutor.executeGoals(DefaultLifecycleExecutor.java:694)
	... 28 more
[INFO] ------------------------------------------------------------------------
[INFO] BUILD ERRORS
[INFO] ------------------------------------------------------------------------
[INFO] Total time: 63 minutes 4 seconds
[INFO] Finished at: Wed Nov 03 05:28:22 UTC 2010
[INFO] Final Memory: 192M/591M
[INFO] ------------------------------------------------------------------------
Sending e-mails to: dev@camel.apache.org
channel stopped
[locks-and-latches] Releasing all the locks
[locks-and-latches] All the locks released


Mime
View raw message