camel-dev mailing list archives

Site index · List index
Message view « Date » · « Thread »
Top « Date » · « Thread »
From Apache Hudson Server <hud...@hudson.apache.org>
Subject Build failed in Hudson: Camel.trunk.fulltest » Camel :: Test Bundles: mock-javamail-1.7 #27
Date Fri, 05 Nov 2010 08:33:12 GMT
See <https://hudson.apache.org/hudson/job/Camel.trunk.fulltest/org.apache.camel.tests$org.apache.camel.tests.mock-javamail_1.7/27/>

------------------------------------------
[INFO] ------------------------------------------------------------------------
[INFO] Building Camel :: Test Bundles: mock-javamail-1.7
[INFO]    task-segment: [clean, install]
[INFO] ------------------------------------------------------------------------
[INFO] [clean:clean {execution: default-clean}]
[INFO] Deleting <https://hudson.apache.org/hudson/job/Camel.trunk.fulltest/org.apache.camel.tests$org.apache.camel.tests.mock-javamail_1.7/ws/target>
[WARNING] POM for 'javax.mail:mail:pom:1.4:compile' is invalid.

Its dependencies (if any) will NOT be available to the current build.
[INFO] [antrun:run {execution: create-prop}]
[INFO] Executing tasks
     [echo] Maven version: 2.6-SNAPSHOT
     [echo] OSGi version: 2.6.0.SNAPSHOT
    [mkdir] Created dir: <https://hudson.apache.org/hudson/job/Camel.trunk.fulltest/org.apache.camel.tests$org.apache.camel.tests.mock-javamail_1.7/ws/target>
[INFO] Executed tasks
[INFO] [properties:read-project-properties {execution: default}]
[INFO] [dependency:copy {execution: copy-legal}]
[INFO] Configured Artifact: org.apache.servicemix.legal:legal:1.0:xml
[INFO] Copying legal-1.0.xml to <https://hudson.apache.org/hudson/job/Camel.trunk.fulltest/org.apache.camel.tests$org.apache.camel.tests.mock-javamail_1.7/ws/target/legal/legal.xml>
[INFO] [remote-resources:process {execution: default}]
[WARNING] POM for 'javax.mail:mail:pom:1.4:compile' is invalid.

Its dependencies (if any) will NOT be available to the current build.
[WARNING] Invalid project model for artifact [mail:javax.mail:1.4]. It will be ignored by
the remote resources Mojo.
[INFO] [resources:resources {execution: default-resources}]
[INFO] Using 'UTF-8' encoding to copy filtered resources.
[INFO] Copying 8 resources
[INFO] Copying 3 resources
[INFO] [compiler:compile {execution: default-compile}]
[INFO] Compiling 3 source files to <https://hudson.apache.org/hudson/job/Camel.trunk.fulltest/org.apache.camel.tests$org.apache.camel.tests.mock-javamail_1.7/ws/target/classes>
[INFO] -------------------------------------------------------------
[ERROR] COMPILATION ERROR : 
[INFO] -------------------------------------------------------------
[ERROR] error: error reading /home/hudson/hudson-slave/workspace/Camel.trunk.fulltest/.repository/javax/mail/mail/1.4/mail-1.4.jar;
error in opening zip file
[ERROR] <https://hudson.apache.org/hudson/job/Camel.trunk.fulltest/org.apache.camel.tests$org.apache.camel.tests.mock-javamail_1.7/ws/src/main/java/org/jvnet/mock_javamail/provider/IMAPProvider.java>:[19,18]
package javax.mail does not exist
[ERROR] <https://hudson.apache.org/hudson/job/Camel.trunk.fulltest/org.apache.camel.tests$org.apache.camel.tests.mock-javamail_1.7/ws/src/main/java/org/jvnet/mock_javamail/provider/IMAPProvider.java>:[21,34]
cannot find symbol
symbol: class Provider
public class IMAPProvider extends Provider {
[ERROR] <https://hudson.apache.org/hudson/job/Camel.trunk.fulltest/org.apache.camel.tests$org.apache.camel.tests.mock-javamail_1.7/ws/src/main/java/org/jvnet/mock_javamail/provider/POP3Provider.java>:[19,18]
package javax.mail does not exist
[ERROR] <https://hudson.apache.org/hudson/job/Camel.trunk.fulltest/org.apache.camel.tests$org.apache.camel.tests.mock-javamail_1.7/ws/src/main/java/org/jvnet/mock_javamail/provider/POP3Provider.java>:[21,34]
cannot find symbol
symbol: class Provider
public class POP3Provider extends Provider {
[ERROR] <https://hudson.apache.org/hudson/job/Camel.trunk.fulltest/org.apache.camel.tests$org.apache.camel.tests.mock-javamail_1.7/ws/src/main/java/org/jvnet/mock_javamail/provider/SMTPProvider.java>:[19,18]
package javax.mail does not exist
[ERROR] <https://hudson.apache.org/hudson/job/Camel.trunk.fulltest/org.apache.camel.tests$org.apache.camel.tests.mock-javamail_1.7/ws/src/main/java/org/jvnet/mock_javamail/provider/SMTPProvider.java>:[21,34]
cannot find symbol
symbol: class Provider
public class SMTPProvider extends Provider {
[ERROR] <https://hudson.apache.org/hudson/job/Camel.trunk.fulltest/org.apache.camel.tests$org.apache.camel.tests.mock-javamail_1.7/ws/src/main/java/org/jvnet/mock_javamail/provider/IMAPProvider.java>:[24,14]
cannot find symbol
symbol  : variable Type
location: class org.jvnet.mock_javamail.provider.IMAPProvider
[ERROR] <https://hudson.apache.org/hudson/job/Camel.trunk.fulltest/org.apache.camel.tests$org.apache.camel.tests.mock-javamail_1.7/ws/src/main/java/org/jvnet/mock_javamail/provider/POP3Provider.java>:[24,14]
cannot find symbol
symbol  : variable Type
location: class org.jvnet.mock_javamail.provider.POP3Provider
[ERROR] <https://hudson.apache.org/hudson/job/Camel.trunk.fulltest/org.apache.camel.tests$org.apache.camel.tests.mock-javamail_1.7/ws/src/main/java/org/jvnet/mock_javamail/provider/SMTPProvider.java>:[24,14]
cannot find symbol
symbol  : variable Type
location: class org.jvnet.mock_javamail.provider.SMTPProvider
[INFO] 10 errors 
[INFO] -------------------------------------------------------------
[HUDSON] Archiving <https://hudson.apache.org/hudson/job/Camel.trunk.fulltest/org.apache.camel.tests$org.apache.camel.tests.mock-javamail_1.7/ws/pom.xml>
to /home/hudson/hudson/jobs/Camel.trunk.fulltest/modules/org.apache.camel.tests$org.apache.camel.tests.mock-javamail_1.7/builds/2010-11-05_06-20-23/archive/org.apache.camel.tests/org.apache.camel.tests.mock-javamail_1.7/2.6-SNAPSHOT/pom.xml


Mime
View raw message