camel-dev mailing list archives

Site index · List index
Message view « Date » · « Thread »
Top « Date » · « Thread »
From Apache Hudson Server <hud...@hudson.apache.org>
Subject Build failed in Hudson: Camel.trunk.fulltest #39
Date Fri, 12 Nov 2010 14:42:23 GMT
See <https://hudson.apache.org/hudson/job/Camel.trunk.fulltest/39/changes>

Changes:

[davsclaus] CAMEL-3336: Added support for older versions of quartz. Thanks to Savas for patch.

[davsclaus] CAMEL-3335: Fixed NPE in JpaConsumer.

[davsclaus] CAMEL-3332: CamelSpringTestSupport now accepts a more generic spring application
context.

[davsclaus] CAMEL-3334: Fixed beanshell language. Thanks to Aaron Mulder for patch.

[hadrian] don't build the distro for fastinstall

[hadrian] not running the release profile anymore, apache-release is used instead

[hadrian] Added fastinstall profile for faster builds (does not run tests nor builds camel-manual)

------------------------------------------
[...truncated 18038 lines...]
[WARNING] Warning building bundle org.apache.camel:camel-example-tracer:bundle:2.6-SNAPSHOT
: Did not find matching referal for org.apache.abdera.*
[WARNING] Warning building bundle org.apache.camel:camel-example-tracer:bundle:2.6-SNAPSHOT
: Did not find matching referal for org.apache.commons.httpclient.*
[WARNING] Warning building bundle org.apache.camel:camel-example-tracer:bundle:2.6-SNAPSHOT
: Did not find matching referal for org.apache.commons.logging.*
[WARNING] Warning building bundle org.apache.camel:camel-example-tracer:bundle:2.6-SNAPSHOT
: Did not find matching referal for org.apache.cxf.*
[WARNING] Warning building bundle org.apache.camel:camel-example-tracer:bundle:2.6-SNAPSHOT
: Did not find matching referal for org.apache.mina.*
[WARNING] Warning building bundle org.apache.camel:camel-example-tracer:bundle:2.6-SNAPSHOT
: Did not find matching referal for org.apache.qpid.*
[WARNING] Warning building bundle org.apache.camel:camel-example-tracer:bundle:2.6-SNAPSHOT
: Did not find matching referal for org.apache.velocity.*
[WARNING] Warning building bundle org.apache.camel:camel-example-tracer:bundle:2.6-SNAPSHOT
: Did not find matching referal for org.apache.xmlbeans.*
[WARNING] Warning building bundle org.apache.camel:camel-example-tracer:bundle:2.6-SNAPSHOT
: Did not find matching referal for org.ccil.cowan.tagsoup.*
[WARNING] Warning building bundle org.apache.camel:camel-example-tracer:bundle:2.6-SNAPSHOT
: Did not find matching referal for org.eclipse.jetty.*
[WARNING] Warning building bundle org.apache.camel:camel-example-tracer:bundle:2.6-SNAPSHOT
: Did not find matching referal for org.jivesoftware.smack.*
[WARNING] Warning building bundle org.apache.camel:camel-example-tracer:bundle:2.6-SNAPSHOT
: Did not find matching referal for org.mortbay.cometd.*
[INFO] [build-helper:attach-artifact {execution: attach-artifacts}]
[INFO] [ianal:verify-legal-files {execution: default}]
[INFO] Checking legal files in: camel-example-tracer-2.6-SNAPSHOT.jar
[INFO] [install:install {execution: default-install}]
[INFO] Installing <https://hudson.apache.org/hudson/job/Camel.trunk.fulltest/ws/camel-trunk/examples/camel-example-tracer/target/camel-example-tracer-2.6-SNAPSHOT.jar>
to <https://hudson.apache.org/hudson/job/Camel.trunk.fulltest/ws/.repository/org/apache/camel/camel-example-tracer/2.6-SNAPSHOT/camel-example-tracer-2.6-SNAPSHOT.jar>
[INFO] Installing <https://hudson.apache.org/hudson/job/Camel.trunk.fulltest/ws/camel-trunk/examples/camel-example-tracer/target/classes/features.xml>
to <https://hudson.apache.org/hudson/job/Camel.trunk.fulltest/ws/.repository/org/apache/camel/camel-example-tracer/2.6-SNAPSHOT/camel-example-tracer-2.6-SNAPSHOT-features.xml>
[INFO] [bundle:install {execution: default-install}]
[INFO] Parsing <https://hudson.apache.org/hudson/job/Camel.trunk.fulltest/ws/.repository/repository.xml>
[INFO] Installing org/apache/camel/camel-example-tracer/2.6-SNAPSHOT/camel-example-tracer-2.6-SNAPSHOT.jar
[INFO] Writing OBR metadata
[HUDSON] Archiving <https://hudson.apache.org/hudson/job/Camel.trunk.fulltest/ws/camel-trunk/examples/camel-example-tracer/pom.xml>
to /home/hudson/hudson/jobs/Camel.trunk.fulltest/modules/org.apache.camel$camel-example-tracer/builds/2010-11-12_12-26-07/archive/org.apache.camel/camel-example-tracer/2.6-SNAPSHOT/pom.xml
[HUDSON] Archiving <https://hudson.apache.org/hudson/job/Camel.trunk.fulltest/ws/camel-trunk/examples/camel-example-tracer/target/camel-example-tracer-2.6-SNAPSHOT.jar>
to /home/hudson/hudson/jobs/Camel.trunk.fulltest/modules/org.apache.camel$camel-example-tracer/builds/2010-11-12_12-26-07/archive/org.apache.camel/camel-example-tracer/2.6-SNAPSHOT/camel-example-tracer-2.6-SNAPSHOT.jar
[HUDSON] Archiving <https://hudson.apache.org/hudson/job/Camel.trunk.fulltest/ws/camel-trunk/examples/camel-example-tracer/target/classes/features.xml>
to /home/hudson/hudson/jobs/Camel.trunk.fulltest/modules/org.apache.camel$camel-example-tracer/builds/2010-11-12_12-26-07/archive/org.apache.camel/camel-example-tracer/2.6-SNAPSHOT/features.xml
[INFO] ------------------------------------------------------------------------
[INFO] SKIPPING Camel :: Assembly
[INFO]    task-segment: [clean, install]
[INFO] This project has been banned from further executions due to previous failures.
[INFO] ------------------------------------------------------------------------
[INFO] 
[INFO] 
[INFO] ------------------------------------------------------------------------
[INFO] Reactor Summary:
[INFO] ------------------------------------------------------------------------
[INFO] Camel ................................................. SUCCESS [12.802s]
[INFO] Apache :: Camel Buildtools ............................ SUCCESS [2.823s]
[INFO] Camel :: Parent ....................................... SUCCESS [1.441s]
[INFO] Camel :: Core ......................................... SUCCESS [17:52.034s]
[INFO] Camel :: Core XML ..................................... SUCCESS [2.568s]
[INFO] Camel :: Core OSGi .................................... SUCCESS [5.575s]
[INFO] Camel :: Spring ....................................... SUCCESS [14:08.513s]
[INFO] Camel :: Test ......................................... SUCCESS [5.840s]
[INFO] Camel :: JMS .......................................... SUCCESS [24:00.118s]
[INFO] Camel :: AMQP ......................................... SUCCESS [3.988s]
[INFO] Camel :: Atom ......................................... SUCCESS [34.687s]
[INFO] Camel :: JUEL ......................................... SUCCESS [8.377s]
[INFO] Camel :: BAM .......................................... SUCCESS [36.967s]
[INFO] Camel :: Bean validator ............................... SUCCESS [9.102s]
[INFO] Camel :: Bindy ........................................ SUCCESS [32.958s]
[INFO] Camel :: Blueprint .................................... SUCCESS [5.876s]
[INFO] Camel :: Stream ....................................... SUCCESS [20.234s]
[INFO] Camel :: Cometd ....................................... SUCCESS [18.364s]
[INFO] Camel :: Components ................................... SUCCESS [0.310s]
[INFO] Camel :: Cache ........................................ SUCCESS [9.178s]
[INFO] Camel :: Castor ....................................... SUCCESS [8.022s]
[INFO] Camel :: Crypto ....................................... SUCCESS [30.794s]
[INFO] Camel :: CSV .......................................... SUCCESS [8.998s]
[INFO] Camel :: HTTP ......................................... SUCCESS [10.320s]
[INFO] Camel :: Jetty ........................................ SUCCESS [10:20.937s]
[INFO] Camel :: CXF .......................................... SUCCESS [9:13.911s]
[INFO] Camel :: Dozer ........................................ SUCCESS [6.725s]
[INFO] Camel :: Eclipse ...................................... SUCCESS [1.435s]
[INFO] Camel :: EJB .......................................... SUCCESS [8.568s]
[INFO] Camel :: Exec ......................................... SUCCESS [23.978s]
[INFO] Camel :: FlatPack ..................................... SUCCESS [18.076s]
[INFO] Camel :: Freemarker ................................... SUCCESS [10.412s]
[INFO] Camel :: FTP .......................................... SUCCESS [6:19.941s]
[INFO] Camel :: Servlet ...................................... SUCCESS [9.863s]
[INFO] Camel :: GAE .......................................... SUCCESS [46.062s]
[INFO] Camel :: Guice ........................................ SUCCESS [13.033s]
[INFO] Camel :: Groovy ....................................... SUCCESS [15.948s]
[INFO] Camel :: HawtDB ....................................... SUCCESS [2:50.138s]
[INFO] Camel :: HTTP4 (HttpClient 4.x) ....................... SUCCESS [1:03.019s]
[INFO] Camel :: MINA ......................................... SUCCESS [2:38.352s]
[INFO] Camel :: HL7 .......................................... SUCCESS [8.841s]
[INFO] Camel :: iBatis ....................................... SUCCESS [31.263s]
[INFO] Camel :: IRC .......................................... SUCCESS [4.650s]
[INFO] Camel :: Jackson ...................................... SUCCESS [7.825s]
[INFO] Camel :: Javaspace .................................... SUCCESS [2.115s]
[INFO] Camel :: JAXB ......................................... SUCCESS [1:05.256s]
[INFO] Camel :: JDBC ......................................... SUCCESS [18.592s]
[INFO] Camel :: Jing ......................................... SUCCESS [10.402s]
[INFO] Camel :: JMX .......................................... SUCCESS [18.343s]
[INFO] Camel :: JoSQL ........................................ SUCCESS [5.794s]
[INFO] Camel :: Jasypt ....................................... SUCCESS [7.108s]
[INFO] Camel :: JCR .......................................... SUCCESS [53.099s]
[INFO] Camel :: JPA .......................................... SUCCESS [1:00.051s]
[INFO] Camel :: Java Toolbox for AS/400 ...................... SUCCESS [8.399s]
[INFO] Camel :: JXPath ....................................... SUCCESS [12.237s]
[INFO] Camel :: LDAP ......................................... SUCCESS [13.209s]
[INFO] Camel :: Lucene ....................................... SUCCESS [8.227s]
[INFO] Camel :: Mail ......................................... SUCCESS [1:37.020s]
[INFO] Camel :: MSV .......................................... SUCCESS [8.261s]
[INFO] Camel :: MVEL ......................................... SUCCESS [5.534s]
[INFO] Camel :: Netty ........................................ SUCCESS [20.339s]
[INFO] Camel :: Nagios ....................................... SUCCESS [26.173s]
[INFO] Camel :: OGNL ......................................... SUCCESS [7.644s]
[INFO] Camel :: Printer ...................................... SUCCESS [2.456s]
[INFO] Camel :: Protobuf ..................................... SUCCESS [6.196s]
[INFO] Camel :: Quartz ....................................... SUCCESS [2:23.789s]
[INFO] Camel :: QuickFIX/J ................................... SUCCESS [12.265s]
[INFO] Camel :: Restlet ...................................... SUCCESS [19.095s]
[INFO] Camel :: RMI .......................................... SUCCESS [5.177s]
[INFO] Camel :: Ruby ......................................... SUCCESS [7.940s]
[INFO] Camel :: RSS .......................................... FAILED [3.741s]
[INFO] Camel :: SAXON ........................................ SUCCESS [29.667s]
[INFO] Camel :: Velocity ..................................... SUCCESS [11.850s]
[INFO] Camel :: Scala ........................................ SUCCESS [2:34.149s]
[INFO] Camel :: Script ....................................... SUCCESS [50.556s]
[INFO] Camel :: SIP .......................................... SUCCESS [8.168s]
[INFO] Camel :: Shiro ........................................ SUCCESS [18.571s]
[INFO] Camel :: SMPP ......................................... SUCCESS [4.786s]
[INFO] Camel :: SNMP ......................................... SUCCESS [3.816s]
[INFO] Camel :: SOAP ......................................... SUCCESS [33.676s]
[INFO] Camel :: Spring Integration ........................... SUCCESS [11.480s]
[INFO] Camel :: Spring JavaConfig ............................ SUCCESS [5.916s]
[INFO] Camel :: Spring Security .............................. SUCCESS [7.650s]
[INFO] Camel :: Spring Web Services .......................... SUCCESS [13.422s]
[INFO] Camel :: SQL .......................................... SUCCESS [7.880s]
[INFO] Camel :: StringTemplate ............................... SUCCESS [5.962s]
[INFO] Camel :: Syslog ....................................... SUCCESS [32.717s]
[INFO] Camel :: TagSoup ...................................... SUCCESS [5.006s]
[INFO] Camel :: XMLBeans ..................................... SUCCESS [5.760s]
[INFO] Camel :: XML Security ................................. SUCCESS [7.481s]
[INFO] Camel :: XMPP ......................................... SUCCESS [4.457s]
[INFO] Camel :: XStream ...................................... SUCCESS [16.465s]
[INFO] Camel :: Platforms .................................... SUCCESS [0.241s]
[INFO] Camel :: Platforms :: Apache Karaf .................... SUCCESS [0.321s]
[INFO] Camel :: Platforms :: Apache Karaf :: Features ........ SUCCESS [0.713s]
[INFO] Camel :: Maven Plugins ................................ SUCCESS [0.265s]
[INFO] Camel :: Maven Camel Plugin ........................... SUCCESS [5.303s]
[INFO] Camel :: Maven Guice Plugin ........................... SUCCESS [4.985s]
[INFO] Camel :: Html to Pdf Plugin ........................... SUCCESS [9.583s]
[INFO] Camel :: Archetypes :: Camel Router with ActiveMQ ..... SUCCESS [1.215s]
[INFO] Camel :: Archetypes :: Component ...................... SUCCESS [1.239s]
[INFO] Camel :: Archetypes :: Router ......................... SUCCESS [1.089s]
[INFO] Camel :: Archetypes :: Scala Router ................... SUCCESS [1.129s]
[INFO] Camel :: Archetypes :: Spring XML Based Router ........ SUCCESS [1.080s]
[INFO] Camel :: Archetypes :: Camel Router WAR ............... SUCCESS [1.111s]
[INFO] Camel :: Archetypes ................................... SUCCESS [0.227s]
[INFO] Camel :: Manual ....................................... SUCCESS [1:19.015s]
[INFO] Camel :: Tooling ...................................... SUCCESS [0.248s]
[INFO] Camel :: Tests Bundles ................................ SUCCESS [2.291s]
[INFO] Camel :: Test Bundles: mock-javamail-1.7 .............. SUCCESS [2.996s]
[INFO] Camel :: Integration Tests ............................ SKIPPED (dependency build failed
or was skipped)
[INFO] Camel :: ITest :: Spring 2.0 .......................... SUCCESS [5.798s]
[INFO] Camel :: ITest :: Spring 2.5 .......................... SUCCESS [8.632s]
[INFO] Camel :: Partial Classpath Tests ...................... SUCCESS [3.853s]
[INFO] Camel :: OSGi Integration Tests ....................... SKIPPED (dependency build failed
or was skipped)
[INFO] Camel :: Tests ........................................ SUCCESS [0.294s]
[INFO] Camel :: Examples ..................................... SUCCESS [0.226s]
[INFO] Camel :: Example :: Aggregate ......................... SUCCESS [5.019s]
[INFO] Camel :: Example :: Axis .............................. SUCCESS [10.813s]
[INFO] Camel :: Example :: BAM ............................... SUCCESS [3.316s]
[INFO] Camel :: Example :: Cafe .............................. SUCCESS [35.563s]
[INFO] Camel :: Example :: CXF ............................... SUCCESS [34.812s]
[INFO] Camel :: Example :: CXF Proxy ......................... SUCCESS [14.280s]
[INFO] Camel :: Example :: CXF Tomcat ........................ SUCCESS [3.759s]
[INFO] Camel :: Example :: Docs .............................. SUCCESS [8.054s]
[INFO] Camel :: Example :: ETL ............................... SUCCESS [18.116s]
[INFO] Camel :: Example :: GAE ............................... SUCCESS [6.915s]
[INFO] Camel :: Example :: GAuth ............................. SUCCESS [7.318s]
[INFO] Camel :: Example :: Guice :: JMS ...................... SUCCESS [10.760s]
[INFO] Camel :: Example :: JMS-File .......................... SUCCESS [10.184s]
[INFO] Camel :: Example :: Loadbalancer camel-mina ........... SUCCESS [1.662s]
[INFO] Camel :: Example :: Loan-Broker ....................... SUCCESS [5:32.761s]
[INFO] Camel :: Example :: Management ........................ SUCCESS [18.012s]
[INFO] Camel :: Example :: OSGi .............................. SUCCESS [1.472s]
[INFO] Camel :: Example :: POJO Messaging .................... SUCCESS [16.235s]
[INFO] Camel :: Example :: Report Incident ................... SUCCESS [15.043s]
[INFO] Camel :: Example :: Report Incident :: WS-Security .... SUCCESS [14.262s]
[INFO] Camel :: Example :: Route :: Throttling ............... SUCCESS [1.675s]
[INFO] Camel :: Example :: Spring ............................ SUCCESS [9.358s]
[INFO] Camel :: Example :: Spring :: JavaConfig .............. SUCCESS [10.502s]
[INFO] Camel :: Example :: Spring :: JMS ..................... SUCCESS [28.049s]
[INFO] Camel :: Example :: Spring :: XQuery .................. SUCCESS [2.035s]
[INFO] Camel :: Example :: Spring Security ................... SUCCESS [3.185s]
[INFO] Camel :: Example :: Tracer ............................ SUCCESS [1.758s]
[INFO] Camel :: Assembly ..................................... SKIPPED (dependency build failed
or was skipped)
[INFO] ------------------------------------------------------------------------
[INFO] Error for project: Camel :: RSS (during install)
[INFO] ------------------------------------------------------------------------
[INFO] Compilation failure
<https://hudson.apache.org/hudson/job/Camel.trunk.fulltest/ws/camel-trunk/components/camel-rss/src/main/java/org/apache/camel/component/rss/RssPollingConsumer.java>:[20,-1]
cannot access org.apache.camel.component.feed.FeedPollingConsumer
bad class file: <https://hudson.apache.org/hudson/job/Camel.trunk.fulltest/ws/.repository/org/apache/camel/camel-atom/2.6-SNAPSHOT/camel-atom-2.6-SNAPSHOT.jar(org/apache/camel/component/feed/FeedPollingConsumer.class)>
class file has wrong version 50.0, should be 49.0

[INFO] ------------------------------------------------------------------------
[INFO] Trace
org.apache.maven.BuildFailureException: Compilation failure
<https://hudson.apache.org/hudson/job/Camel.trunk.fulltest/ws/camel-trunk/components/camel-rss/src/main/java/org/apache/camel/component/rss/RssPollingConsumer.java>:[20,-1]
cannot access org.apache.camel.component.feed.FeedPollingConsumer
bad class file: <https://hudson.apache.org/hudson/job/Camel.trunk.fulltest/ws/.repository/org/apache/camel/camel-atom/2.6-SNAPSHOT/camel-atom-2.6-SNAPSHOT.jar(org/apache/camel/component/feed/FeedPollingConsumer.class)>
class file has wrong version 50.0, should be 49.0

	at org.apache.maven.lifecycle.DefaultLifecycleExecutor.executeGoals(DefaultLifecycleExecutor.java:715)
	at org.apache.maven.lifecycle.DefaultLifecycleExecutor.executeGoalWithLifecycle(DefaultLifecycleExecutor.java:556)
	at org.apache.maven.lifecycle.DefaultLifecycleExecutor.executeGoal(DefaultLifecycleExecutor.java:535)
	at org.apache.maven.lifecycle.DefaultLifecycleExecutor.executeGoalAndHandleFailures(DefaultLifecycleExecutor.java:387)
	at org.apache.maven.lifecycle.DefaultLifecycleExecutor.executeTaskSegments(DefaultLifecycleExecutor.java:348)
	at org.apache.maven.lifecycle.DefaultLifecycleExecutor.execute(DefaultLifecycleExecutor.java:180)
	at org.apache.maven.lifecycle.LifecycleExecutorInterceptor.execute(LifecycleExecutorInterceptor.java:65)
	at org.apache.maven.DefaultMaven.doExecute(DefaultMaven.java:328)
	at org.apache.maven.DefaultMaven.execute(DefaultMaven.java:138)
	at org.apache.maven.cli.MavenCli.main(MavenCli.java:362)
	at sun.reflect.NativeMethodAccessorImpl.invoke0(Native Method)
	at sun.reflect.NativeMethodAccessorImpl.invoke(NativeMethodAccessorImpl.java:39)
	at sun.reflect.DelegatingMethodAccessorImpl.invoke(DelegatingMethodAccessorImpl.java:25)
	at java.lang.reflect.Method.invoke(Method.java:592)
	at org.codehaus.classworlds.Launcher.launchEnhanced(Launcher.java:315)
	at org.codehaus.classworlds.Launcher.launch(Launcher.java:255)
	at hudson.maven.agent.Main.launch(Main.java:165)
	at hudson.maven.MavenBuilder.call(MavenBuilder.java:165)
	at hudson.maven.MavenModuleSetBuild$Builder.call(MavenModuleSetBuild.java:750)
	at hudson.maven.MavenModuleSetBuild$Builder.call(MavenModuleSetBuild.java:694)
	at hudson.remoting.UserRequest.perform(UserRequest.java:114)
	at hudson.remoting.UserRequest.perform(UserRequest.java:48)
	at hudson.remoting.Request$2.run(Request.java:270)
	at java.util.concurrent.Executors$RunnableAdapter.call(Executors.java:417)
	at java.util.concurrent.FutureTask$Sync.innerRun(FutureTask.java:269)
	at java.util.concurrent.FutureTask.run(FutureTask.java:123)
	at java.util.concurrent.ThreadPoolExecutor$Worker.runTask(ThreadPoolExecutor.java:651)
	at java.util.concurrent.ThreadPoolExecutor$Worker.run(ThreadPoolExecutor.java:676)
	at java.lang.Thread.run(Thread.java:595)
Caused by: org.apache.maven.plugin.CompilationFailureException: Compilation failure
<https://hudson.apache.org/hudson/job/Camel.trunk.fulltest/ws/camel-trunk/components/camel-rss/src/main/java/org/apache/camel/component/rss/RssPollingConsumer.java>:[20,-1]
cannot access org.apache.camel.component.feed.FeedPollingConsumer
bad class file: <https://hudson.apache.org/hudson/job/Camel.trunk.fulltest/ws/.repository/org/apache/camel/camel-atom/2.6-SNAPSHOT/camel-atom-2.6-SNAPSHOT.jar(org/apache/camel/component/feed/FeedPollingConsumer.class)>
class file has wrong version 50.0, should be 49.0

	at org.apache.maven.plugin.AbstractCompilerMojo.execute(AbstractCompilerMojo.java:656)
	at org.apache.maven.plugin.CompilerMojo.execute(CompilerMojo.java:128)
	at org.apache.maven.plugin.DefaultPluginManager.executeMojo(DefaultPluginManager.java:490)
	at hudson.maven.agent.PluginManagerInterceptor.executeMojo(PluginManagerInterceptor.java:182)
	at org.apache.maven.lifecycle.DefaultLifecycleExecutor.executeGoals(DefaultLifecycleExecutor.java:694)
	... 28 more
[INFO] ------------------------------------------------------------------------
[INFO] BUILD ERRORS
[INFO] ------------------------------------------------------------------------
[INFO] Total time: 136 minutes 1 second
[INFO] Finished at: Fri Nov 12 14:42:18 UTC 2010
[INFO] Final Memory: 182M/285M
[INFO] ------------------------------------------------------------------------
Sending e-mails to: dev@camel.apache.org
Sending e-mails to: dev@camel.apache.org
Sending e-mails to: dev@camel.apache.org
Sending e-mails to: dev@camel.apache.org
channel stopped
[locks-and-latches] Releasing all the locks
[locks-and-latches] All the locks released


Mime
View raw message