camel-dev mailing list archives

Site index · List index
Message view « Date » · « Thread »
Top « Date » · « Thread »
From "Claus Ibsen (JIRA)" <j...@apache.org>
Subject [jira] Commented: (CAMEL-2181) camel-cxf - CxfBeanTest fails with NoClassDefFoundError
Date Tue, 17 Nov 2009 07:07:52 GMT

    [ https://issues.apache.org/activemq/browse/CAMEL-2181?page=com.atlassian.jira.plugin.system.issuetabpanels:comment-tabpanel&focusedCommentId=55484#action_55484
] 

Claus Ibsen commented on CAMEL-2181:
------------------------------------

Uses junit 4.6

[INFO]    junit:junit:jar:4.6:test

> camel-cxf - CxfBeanTest fails with NoClassDefFoundError
> -------------------------------------------------------
>
>                 Key: CAMEL-2181
>                 URL: https://issues.apache.org/activemq/browse/CAMEL-2181
>             Project: Apache Camel
>          Issue Type: Test
>          Components: camel-cxf
>            Reporter: Claus Ibsen
>            Priority: Minor
>             Fix For: 2.1.0
>
>
> Running org.apache.camel.component.cxf.cxfbean.CxfBeanTest
> org.apache.maven.surefire.booter.SurefireExecutionException: org/junit/Assume$AssumptionViolatedException;
nested exception is java.lang.NoClassDefFoundError: org/junit/Assume$AssumptionViolatedException
> java.lang.NoClassDefFoundError: org/junit/Assume$AssumptionViolatedException
>         at org.springframework.test.context.junit4.SpringMethodRoadie.runTestMethod(SpringMethodRoadie.java:240)
>         at org.springframework.test.context.junit4.SpringMethodRoadie$RunBeforesThenTestThenAfters.run(SpringMethodRoadie.java:333)
>         at org.springframework.test.context.junit4.SpringMethodRoadie.runWithRepetitions(SpringMethodRoadie.java:217)
>         at org.springframework.test.context.junit4.SpringMethodRoadie.runTest(SpringMethodRoadie.java:197)
>         at org.springframework.test.context.junit4.SpringMethodRoadie.run(SpringMethodRoadie.java:143)
>         at org.springframework.test.context.junit4.SpringJUnit4ClassRunner.invokeTestMethod(SpringJUnit4ClassRunner.java:160)
>         at org.junit.internal.runners.JUnit4ClassRunner.runMethods(JUnit4ClassRunner.java:61)
>         at org.junit.internal.runners.JUnit4ClassRunner$1.run(JUnit4ClassRunner.java:54)
>         at org.junit.internal.runners.ClassRoadie.runUnprotected(ClassRoadie.java:34)
>         at org.junit.internal.runners.ClassRoadie.runProtected(ClassRoadie.java:44)
>         at org.junit.internal.runners.JUnit4ClassRunner.run(JUnit4ClassRunner.java:52)
>         at org.springframework.test.context.junit4.SpringJUnit4ClassRunner.run(SpringJUnit4ClassRunner.java:97)
>         at org.apache.maven.surefire.junit4.JUnit4TestSet.execute(JUnit4TestSet.java:62)
>         at org.apache.maven.surefire.suite.AbstractDirectoryTestSuite.executeTestSet(AbstractDirectoryTestSuite.java:140)
>         at org.apache.maven.surefire.suite.AbstractDirectoryTestSuite.execute(AbstractDirectoryTestSuite.java:165)
>         at org.apache.maven.surefire.Surefire.run(Surefire.java:107)
>         at sun.reflect.NativeMethodAccessorImpl.invoke0(Native Method)
>         at sun.reflect.NativeMethodAccessorImpl.invoke(NativeMethodAccessorImpl.java:39)
>         at sun.reflect.DelegatingMethodAccessorImpl.invoke(DelegatingMethodAccessorImpl.java:25)
>         at java.lang.reflect.Method.invoke(Method.java:592)
>         at org.apache.maven.surefire.booter.SurefireBooter.runSuitesInProcess(SurefireBooter.java:289)
>         at org.apache.maven.surefire.booter.SurefireBooter.main(SurefireBooter.java:1005)
> [INFO] ------------------------------------------------------------------------
> [ERROR] BUILD FAILURE
> [INFO] ------------------------------------------------------------------------
> [INFO] There are test failures.

-- 
This message is automatically generated by JIRA.
-
You can reply to this email to add a comment to the issue online.


Mime
View raw message