bval-commits mailing list archives

Site index · List index
Message view « Date » · « Thread »
Top « Date » · « Thread »
From Apache Jenkins Server <jenk...@builds.apache.org>
Subject Build failed in Jenkins: BVal-trunk #224
Date Fri, 21 Oct 2016 19:32:23 GMT
See <https://builds.apache.org/job/BVal-trunk/224/changes>

Changes:

[struberg] BVAL-150 special AnnotationLiteral for empty annotations

------------------------------------------
[...truncated 173 lines...]
[INFO] 
[INFO] --- buildnumber-maven-plugin:1.2:create (default) @ bval-core ---
[INFO] 
[INFO] --- commons-weaver-maven-plugin:1.3:prepare (weaver-prepare) @ bval-core ---
[WARNING] Failed to getClass for org.apache.maven.plugin.source.SourceJarMojo
[INFO] 
[INFO] <<< maven-source-plugin:2.1.1:jar (attach-source) < generate-sources @
bval-core <<<
[INFO] 
[INFO] --- maven-source-plugin:2.1.1:jar (attach-source) @ bval-core ---
[INFO] Building jar: <https://builds.apache.org/job/BVal-trunk/ws/trunk/bval-core/target/bval-core-1.1.2-SNAPSHOT-sources.jar>
[INFO] 
[INFO] --- maven-jar-plugin:3.0.0:test-jar (attach-tests) @ bval-core ---
[INFO] Building jar: <https://builds.apache.org/job/BVal-trunk/ws/trunk/bval-core/target/bval-core-1.1.2-SNAPSHOT-tests.jar>
[INFO] 
[INFO] --- maven-shade-plugin:2.4.3:shade (default) @ bval-core ---
[INFO] Including org.apache.commons:commons-lang3:jar:3.5 in the shaded jar.
[INFO] Excluding commons-beanutils:commons-beanutils-core:jar:1.8.3 from the shaded jar.
[INFO] Excluding commons-logging:commons-logging:jar:1.1.1 from the shaded jar.
[INFO] Minimizing jar org.apache.bval:bval-core:jar:1.1.2-SNAPSHOT
[INFO] Minimized 326 -> 126 (38%)
[INFO] Minimized 515 -> 315 (61%)
[INFO] Replacing original artifact with shaded artifact.
[INFO] Replacing <https://builds.apache.org/job/BVal-trunk/ws/trunk/bval-core/target/bval-core-1.1.2-SNAPSHOT.jar>
with <https://builds.apache.org/job/BVal-trunk/ws/trunk/bval-core/target/bval-core-1.1.2-SNAPSHOT-shaded.jar>
[INFO] Replacing original source artifact with shaded source artifact.
[INFO] Replacing <https://builds.apache.org/job/BVal-trunk/ws/trunk/bval-core/target/bval-core-1.1.2-SNAPSHOT-sources.jar>
with <https://builds.apache.org/job/BVal-trunk/ws/trunk/bval-core/target/bval-core-1.1.2-SNAPSHOT-shaded-sources.jar>
[INFO] Dependency-reduced POM written at: <https://builds.apache.org/job/BVal-trunk/ws/trunk/bval-core/dependency-reduced-pom.xml>
[INFO] 
[INFO] --- apache-rat-plugin:0.11:check (default) @ bval-core ---
[INFO] 51 implicit excludes (use -debug for more details).
[INFO] Exclude: **/*/MANIFEST.MF
[INFO] Exclude: .git
[INFO] Exclude: .gitignore
[INFO] Exclude: README.txt
[INFO] Exclude: CHANGES.txt
[INFO] Exclude: .idea
[INFO] Exclude: release.properties
[INFO] Exclude: DEPENDENCIES
[INFO] Exclude: **/.*/**
[INFO] Exclude: **/*.log
[INFO] Exclude: **/maven-eclipse.xml
[INFO] Exclude: **/rat.txt
[INFO] Exclude: **/target/**/*
[INFO] Exclude: **/*.iml
[INFO] Exclude: **/*.ipr
[INFO] Exclude: **/*.iws
[INFO] Exclude: **/META-INF/services/*
[INFO] Exclude: **/dependency-reduced-pom.xml
[INFO] 45 resources included (use -debug for more details)
[INFO] Rat check: Summary of files. Unapproved: 0 unknown: 0 generated: 0 approved: 45 licence.
[INFO] 
[INFO] --- ianal-maven-plugin:1.0-alpha-1:verify-legal-files (default) @ bval-core ---
[INFO] Checking legal files in: bval-core-1.1.2-SNAPSHOT.jar
[INFO] Checking legal files in: bval-core-1.1.2-SNAPSHOT-sources.jar
[INFO] Checking legal files in: bval-core-1.1.2-SNAPSHOT-tests.jar
[INFO] Checking legal files in: bval-core-1.1.2-SNAPSHOT-sources.jar
[INFO] 
[INFO] --- maven-install-plugin:2.5.2:install (default-install) @ bval-core ---
[INFO] Installing <https://builds.apache.org/job/BVal-trunk/ws/trunk/bval-core/target/bval-core-1.1.2-SNAPSHOT.jar>
to /home/jenkins/jenkins-slave/maven-repositories/1/org/apache/bval/bval-core/1.1.2-SNAPSHOT/bval-core-1.1.2-SNAPSHOT.jar
[INFO] Installing <https://builds.apache.org/job/BVal-trunk/ws/trunk/bval-core/dependency-reduced-pom.xml>
to /home/jenkins/jenkins-slave/maven-repositories/1/org/apache/bval/bval-core/1.1.2-SNAPSHOT/bval-core-1.1.2-SNAPSHOT.pom
[INFO] Installing <https://builds.apache.org/job/BVal-trunk/ws/trunk/bval-core/target/bval-core-1.1.2-SNAPSHOT-sources.jar>
to /home/jenkins/jenkins-slave/maven-repositories/1/org/apache/bval/bval-core/1.1.2-SNAPSHOT/bval-core-1.1.2-SNAPSHOT-sources.jar
[INFO] Installing <https://builds.apache.org/job/BVal-trunk/ws/trunk/bval-core/target/bval-core-1.1.2-SNAPSHOT-tests.jar>
to /home/jenkins/jenkins-slave/maven-repositories/1/org/apache/bval/bval-core/1.1.2-SNAPSHOT/bval-core-1.1.2-SNAPSHOT-tests.jar
[INFO] Installing <https://builds.apache.org/job/BVal-trunk/ws/trunk/bval-core/target/bval-core-1.1.2-SNAPSHOT-sources.jar>
to /home/jenkins/jenkins-slave/maven-repositories/1/org/apache/bval/bval-core/1.1.2-SNAPSHOT/bval-core-1.1.2-SNAPSHOT-sources.jar
[INFO]                                                                         
[INFO] ------------------------------------------------------------------------
[INFO] Building Apache BVal :: bval-xstream (optional) 1.1.2-SNAPSHOT
[INFO] ------------------------------------------------------------------------
[INFO] 
[INFO] --- maven-clean-plugin:3.0.0:clean (default-clean) @ bval-xstream ---
[INFO] Deleting <https://builds.apache.org/job/BVal-trunk/ws/trunk/bval-xstream/target>
[INFO] 
[INFO] --- maven-enforcer-plugin:1.4.1:enforce (default) @ bval-xstream ---
[INFO] 
[INFO] --- buildnumber-maven-plugin:1.2:create (default) @ bval-xstream ---
[INFO] 
[INFO] --- commons-weaver-maven-plugin:1.3:prepare (weaver-prepare) @ bval-xstream ---
[INFO] 
[INFO] --- maven-remote-resources-plugin:1.5:process (process-remote-resources) @ bval-xstream
---
[INFO] 
[INFO] --- maven-remote-resources-plugin:1.5:process (process-resource-bundles) @ bval-xstream
---
[INFO] 
[INFO] --- maven-resources-plugin:2.7:resources (default-resources) @ bval-xstream ---
[INFO] Using 'UTF-8' encoding to copy filtered resources.
[INFO] skip non existing resourceDirectory <https://builds.apache.org/job/BVal-trunk/ws/trunk/bval-xstream/src/main/resources>
[INFO] Copying 3 resources
[INFO] Copying 3 resources
[INFO] 
[INFO] --- maven-compiler-plugin:3.5.1:compile (default-compile) @ bval-xstream ---
[INFO] Changes detected - recompiling the module!
[INFO] Compiling 23 source files to <https://builds.apache.org/job/BVal-trunk/ws/trunk/bval-xstream/target/classes>
[INFO] 
[INFO] --- commons-weaver-maven-plugin:1.3:weave (weaver-weave) @ bval-xstream ---
[INFO] 
[INFO] --- maven-resources-plugin:2.7:testResources (default-testResources) @ bval-xstream
---
[INFO] Using 'UTF-8' encoding to copy filtered resources.
[INFO] Copying 2 resources
[INFO] Copying 3 resources
[INFO] Copying 3 resources
[INFO] 
[INFO] --- maven-compiler-plugin:3.5.1:testCompile (default-testCompile) @ bval-xstream ---
[INFO] Changes detected - recompiling the module!
[INFO] Compiling 8 source files to <https://builds.apache.org/job/BVal-trunk/ws/trunk/bval-xstream/target/test-classes>
[INFO] 
[INFO] --- maven-surefire-plugin:2.17:test (default-test) @ bval-xstream ---
[INFO] Surefire report directory: <https://builds.apache.org/job/BVal-trunk/ws/trunk/bval-xstream/target/surefire-reports>

-------------------------------------------------------
 T E S T S
-------------------------------------------------------
Running org.apache.bval.routines.StandardValidationTest
Tests run: 9, Failures: 0, Errors: 0, Skipped: 0, Time elapsed: 0.13 sec - in org.apache.bval.routines.StandardValidationTest
Running org.apache.bval.xml.XMLMetaBeanInfosTest
Tests run: 2, Failures: 0, Errors: 0, Skipped: 0, Time elapsed: 0.728 sec - in org.apache.bval.xml.XMLMetaBeanInfosTest
Running org.apache.bval.xml.BeanValidatorTest
Tests run: 2, Failures: 0, Errors: 0, Skipped: 0, Time elapsed: 0.061 sec - in org.apache.bval.xml.BeanValidatorTest
Running org.apache.bval.xml.XMLMetaBeanManagerTest
Tests run: 4, Failures: 0, Errors: 0, Skipped: 0, Time elapsed: 0.017 sec - in org.apache.bval.xml.XMLMetaBeanManagerTest

Results :

Tests run: 17, Failures: 0, Errors: 0, Skipped: 0

[JENKINS] Recording test results
[INFO] 
[INFO] --- maven-jar-plugin:3.0.0:jar (default-jar) @ bval-xstream ---
[INFO] Building jar: <https://builds.apache.org/job/BVal-trunk/ws/trunk/bval-xstream/target/bval-xstream-1.1.2-SNAPSHOT.jar>
[INFO] 
[INFO] --- maven-site-plugin:3.5.1:attach-descriptor (attach-descriptor) @ bval-xstream ---
[INFO] 
[INFO] >>> maven-source-plugin:2.1.1:jar (attach-source) > generate-sources @
bval-xstream >>>
[INFO] 
[INFO] --- maven-enforcer-plugin:1.4.1:enforce (default) @ bval-xstream ---
[INFO] 
[INFO] --- buildnumber-maven-plugin:1.2:create (default) @ bval-xstream ---
[INFO] 
[INFO] --- commons-weaver-maven-plugin:1.3:prepare (weaver-prepare) @ bval-xstream ---
[WARNING] Failed to getClass for org.apache.maven.plugin.source.SourceJarMojo
[INFO] 
[INFO] <<< maven-source-plugin:2.1.1:jar (attach-source) < generate-sources @
bval-xstream <<<
[INFO] 
[INFO] --- maven-source-plugin:2.1.1:jar (attach-source) @ bval-xstream ---
[INFO] Building jar: <https://builds.apache.org/job/BVal-trunk/ws/trunk/bval-xstream/target/bval-xstream-1.1.2-SNAPSHOT-sources.jar>
[INFO] 
[INFO] --- maven-jar-plugin:3.0.0:test-jar (attach-tests) @ bval-xstream ---
[INFO] Building jar: <https://builds.apache.org/job/BVal-trunk/ws/trunk/bval-xstream/target/bval-xstream-1.1.2-SNAPSHOT-tests.jar>
[INFO] 
[INFO] --- maven-shade-plugin:2.4.3:shade (default) @ bval-xstream ---
[INFO] Excluding org.apache.bval:bval-core:jar:1.1.2-SNAPSHOT from the shaded jar.
[INFO] Including org.apache.commons:commons-lang3:jar:3.5 in the shaded jar.
[INFO] Excluding com.thoughtworks.xstream:xstream:jar:1.4.9 from the shaded jar.
[INFO] Excluding xmlpull:xmlpull:jar:1.1.3.1 from the shaded jar.
[INFO] Excluding xpp3:xpp3_min:jar:1.1.4c from the shaded jar.
[INFO] Minimizing jar org.apache.bval:bval-xstream:jar:1.1.2-SNAPSHOT
[INFO] Minimized 298 -> 91 (30%)
[INFO] Minimized 471 -> 264 (56%)
[INFO] Replacing original artifact with shaded artifact.
[INFO] Replacing <https://builds.apache.org/job/BVal-trunk/ws/trunk/bval-xstream/target/bval-xstream-1.1.2-SNAPSHOT.jar>
with <https://builds.apache.org/job/BVal-trunk/ws/trunk/bval-xstream/target/bval-xstream-1.1.2-SNAPSHOT-shaded.jar>
[INFO] Replacing original source artifact with shaded source artifact.
[INFO] Replacing <https://builds.apache.org/job/BVal-trunk/ws/trunk/bval-xstream/target/bval-xstream-1.1.2-SNAPSHOT-sources.jar>
with <https://builds.apache.org/job/BVal-trunk/ws/trunk/bval-xstream/target/bval-xstream-1.1.2-SNAPSHOT-shaded-sources.jar>
[INFO] Dependency-reduced POM written at: <https://builds.apache.org/job/BVal-trunk/ws/trunk/bval-xstream/dependency-reduced-pom.xml>
[INFO] 
[INFO] --- apache-rat-plugin:0.11:check (default) @ bval-xstream ---
[INFO] 51 implicit excludes (use -debug for more details).
[INFO] Exclude: **/*/MANIFEST.MF
[INFO] Exclude: .git
[INFO] Exclude: .gitignore
[INFO] Exclude: README.txt
[INFO] Exclude: CHANGES.txt
[INFO] Exclude: .idea
[INFO] Exclude: release.properties
[INFO] Exclude: DEPENDENCIES
[INFO] Exclude: **/.*/**
[INFO] Exclude: **/*.log
[INFO] Exclude: **/maven-eclipse.xml
[INFO] Exclude: **/rat.txt
[INFO] Exclude: **/target/**/*
[INFO] Exclude: **/*.iml
[INFO] Exclude: **/*.ipr
[INFO] Exclude: **/*.iws
[INFO] Exclude: **/META-INF/services/*
[INFO] Exclude: **/dependency-reduced-pom.xml
[INFO] 35 resources included (use -debug for more details)
[INFO] Rat check: Summary of files. Unapproved: 0 unknown: 0 generated: 0 approved: 35 licence.
[INFO] 
[INFO] --- ianal-maven-plugin:1.0-alpha-1:verify-legal-files (default) @ bval-xstream ---
[INFO] Checking legal files in: bval-xstream-1.1.2-SNAPSHOT.jar
[INFO] Checking legal files in: bval-xstream-1.1.2-SNAPSHOT-sources.jar
[INFO] Checking legal files in: bval-xstream-1.1.2-SNAPSHOT-tests.jar
[INFO] Checking legal files in: bval-xstream-1.1.2-SNAPSHOT-sources.jar
[INFO] 
[INFO] --- maven-install-plugin:2.5.2:install (default-install) @ bval-xstream ---
[INFO] Installing <https://builds.apache.org/job/BVal-trunk/ws/trunk/bval-xstream/target/bval-xstream-1.1.2-SNAPSHOT.jar>
to /home/jenkins/jenkins-slave/maven-repositories/1/org/apache/bval/bval-xstream/1.1.2-SNAPSHOT/bval-xstream-1.1.2-SNAPSHOT.jar
[INFO] Installing <https://builds.apache.org/job/BVal-trunk/ws/trunk/bval-xstream/dependency-reduced-pom.xml>
to /home/jenkins/jenkins-slave/maven-repositories/1/org/apache/bval/bval-xstream/1.1.2-SNAPSHOT/bval-xstream-1.1.2-SNAPSHOT.pom
[INFO] Installing <https://builds.apache.org/job/BVal-trunk/ws/trunk/bval-xstream/target/bval-xstream-1.1.2-SNAPSHOT-sources.jar>
to /home/jenkins/jenkins-slave/maven-repositories/1/org/apache/bval/bval-xstream/1.1.2-SNAPSHOT/bval-xstream-1.1.2-SNAPSHOT-sources.jar
[INFO] Installing <https://builds.apache.org/job/BVal-trunk/ws/trunk/bval-xstream/target/bval-xstream-1.1.2-SNAPSHOT-tests.jar>
to /home/jenkins/jenkins-slave/maven-repositories/1/org/apache/bval/bval-xstream/1.1.2-SNAPSHOT/bval-xstream-1.1.2-SNAPSHOT-tests.jar
[INFO] Installing <https://builds.apache.org/job/BVal-trunk/ws/trunk/bval-xstream/target/bval-xstream-1.1.2-SNAPSHOT-sources.jar>
to /home/jenkins/jenkins-slave/maven-repositories/1/org/apache/bval/bval-xstream/1.1.2-SNAPSHOT/bval-xstream-1.1.2-SNAPSHOT-sources.jar
[INFO]                                                                         
[INFO] ------------------------------------------------------------------------
[INFO] Building Apache BVal :: bval-jsr 1.1.2-SNAPSHOT
[INFO] ------------------------------------------------------------------------
[INFO] Downloading: https://repo.maven.apache.org/maven2/org/apache/tomcat/tomcat-el-api/7.0.72/tomcat-el-api-7.0.72.pom
[INFO] Downloading: https://repo.maven.apache.org/maven2/org/apache/geronimo/specs/geronimo-validation_1.1_spec/1.0/geronimo-validation_1.1_spec-1.0.pom
[INFO] ------------------------------------------------------------------------
[INFO] Reactor Summary:
[INFO] 
[INFO] Apache BVal :: bval-parent (Parent POM) ............ SUCCESS [ 21.388 s]
[INFO] Apache BVal :: bval-core ........................... SUCCESS [ 23.990 s]
[INFO] Apache BVal :: bval-xstream (optional) ............. SUCCESS [  7.081 s]
[INFO] Apache BVal :: bval-jsr ............................ FAILURE [  6.053 s]
[INFO] Apache BVal :: bval-json (optional) ................ SKIPPED
[INFO] Apache BVal :: bval-extras (optional) .............. SKIPPED
[INFO] Apache BVal :: bval-tck11 (TCK Runner) ............. SKIPPED
[INFO] Apache BVal :: org.apache.bval.bundle .............. SKIPPED
[INFO] ------------------------------------------------------------------------
[INFO] BUILD FAILURE
[INFO] ------------------------------------------------------------------------
[INFO] Total time: 01:06 min
[INFO] Finished at: 2016-10-21T19:30:42+00:00
[INFO] Final Memory: 40M/675M
[INFO] ------------------------------------------------------------------------
Waiting for Jenkins to finish collecting data
[ERROR] Failed to execute goal on project bval-jsr: Could not resolve dependencies for project
org.apache.bval:bval-jsr:jar:1.1.2-SNAPSHOT: Failed to collect dependencies at org.apache.tomcat:tomcat-el-api:jar:7.0.72:
Failed to read artifact descriptor for org.apache.tomcat:tomcat-el-api:jar:7.0.72: Could not
transfer artifact org.apache.tomcat:tomcat-el-api:pom:7.0.72 from/to central (https://repo.maven.apache.org/maven2):
repo.maven.apache.org: Name or service not known: Unknown host repo.maven.apache.org: Name
or service not known -> [Help 1]
[ERROR] 
[ERROR] To see the full stack trace of the errors, re-run Maven with the -e switch.
[ERROR] Re-run Maven using the -X switch to enable full debug logging.
[ERROR] 
[ERROR] For more information about the errors and possible solutions, please read the following
articles:
[ERROR] [Help 1] http://cwiki.apache.org/confluence/display/MAVEN/DependencyResolutionException
[ERROR] 
[ERROR] After correcting the problems, you can resume the build with the command
[ERROR]   mvn <goals> -rf :bval-jsr
[JENKINS] Archiving <https://builds.apache.org/job/BVal-trunk/ws/trunk/bval-json/pom.xml>
to org.apache.bval/bval-json/1.1.2-SNAPSHOT/bval-json-1.1.2-SNAPSHOT.pom
[JENKINS] Archiving <https://builds.apache.org/job/BVal-trunk/ws/trunk/bval-tck11/pom.xml>
to org.apache.bval/bval-tck11-runner/1.1.2-SNAPSHOT/bval-tck11-runner-1.1.2-SNAPSHOT.pom
[JENKINS] Archiving <https://builds.apache.org/job/BVal-trunk/ws/trunk/bval-core/dependency-reduced-pom.xml>
to org.apache.bval/bval-core/1.1.2-SNAPSHOT/bval-core-1.1.2-SNAPSHOT.pom
[JENKINS] Archiving <https://builds.apache.org/job/BVal-trunk/ws/trunk/bval-core/target/bval-core-1.1.2-SNAPSHOT.jar>
to org.apache.bval/bval-core/1.1.2-SNAPSHOT/bval-core-1.1.2-SNAPSHOT.jar
[JENKINS] Archiving <https://builds.apache.org/job/BVal-trunk/ws/trunk/bval-core/target/bval-core-1.1.2-SNAPSHOT-sources.jar>
to org.apache.bval/bval-core/1.1.2-SNAPSHOT/bval-core-1.1.2-SNAPSHOT-sources.jar
[JENKINS] Archiving <https://builds.apache.org/job/BVal-trunk/ws/trunk/bval-core/target/bval-core-1.1.2-SNAPSHOT-tests.jar>
to org.apache.bval/bval-core/1.1.2-SNAPSHOT/bval-core-1.1.2-SNAPSHOT-tests.jar
[JENKINS] Archiving <https://builds.apache.org/job/BVal-trunk/ws/trunk/bundle/pom.xml>
to org.apache.bval/org.apache.bval.bundle/1.1.2-SNAPSHOT/org.apache.bval.bundle-1.1.2-SNAPSHOT.pom
[JENKINS] Archiving <https://builds.apache.org/job/BVal-trunk/ws/trunk/pom.xml> to org.apache.bval/bval-parent/1.1.2-SNAPSHOT/bval-parent-1.1.2-SNAPSHOT.pom
[JENKINS] Archiving <https://builds.apache.org/job/BVal-trunk/ws/trunk/bval-xstream/dependency-reduced-pom.xml>
to org.apache.bval/bval-xstream/1.1.2-SNAPSHOT/bval-xstream-1.1.2-SNAPSHOT.pom
[JENKINS] Archiving <https://builds.apache.org/job/BVal-trunk/ws/trunk/bval-xstream/target/bval-xstream-1.1.2-SNAPSHOT.jar>
to org.apache.bval/bval-xstream/1.1.2-SNAPSHOT/bval-xstream-1.1.2-SNAPSHOT.jar
[JENKINS] Archiving <https://builds.apache.org/job/BVal-trunk/ws/trunk/bval-xstream/target/bval-xstream-1.1.2-SNAPSHOT-sources.jar>
to org.apache.bval/bval-xstream/1.1.2-SNAPSHOT/bval-xstream-1.1.2-SNAPSHOT-sources.jar
[JENKINS] Archiving <https://builds.apache.org/job/BVal-trunk/ws/trunk/bval-xstream/target/bval-xstream-1.1.2-SNAPSHOT-tests.jar>
to org.apache.bval/bval-xstream/1.1.2-SNAPSHOT/bval-xstream-1.1.2-SNAPSHOT-tests.jar
[JENKINS] Archiving <https://builds.apache.org/job/BVal-trunk/ws/trunk/bval-jsr/pom.xml>
to org.apache.bval/bval-jsr/1.1.2-SNAPSHOT/bval-jsr-1.1.2-SNAPSHOT.pom
[JENKINS] Archiving <https://builds.apache.org/job/BVal-trunk/ws/trunk/bval-extras/pom.xml>
to org.apache.bval/bval-extras/1.1.2-SNAPSHOT/bval-extras-1.1.2-SNAPSHOT.pom
Sending e-mails to: commits@bval.apache.org
Sending e-mails to: commits@bval.apache.org
Sending e-mails to: commits@bval.apache.org
Sending e-mails to: commits@bval.apache.org
channel stopped

Mime
View raw message