bval-commits mailing list archives

Site index · List index
Message view « Date » · « Thread »
Top « Date » · « Thread »
From Apache Jenkins Server <jenk...@builds.apache.org>
Subject Build failed in Jenkins: BVal-trunk #176
Date Fri, 05 Oct 2012 08:00:53 GMT
See <https://builds.apache.org/job/BVal-trunk/176/changes>

Changes:

[mbenson] reorg some poms; remove refs to slf4j; remove exclusion of commons-logging--this
is the responsibility of the user

------------------------------------------
Started by user mbenson
Building remotely on ubuntu1 in workspace <https://builds.apache.org/job/BVal-trunk/ws/>
Updating https://svn.apache.org/repos/asf/bval/trunk
U         bval-xstream/pom.xml
U         bval-jsr303/pom.xml
U         pom.xml
At revision 1394400
Parsing POMs
Modules changed, recalculating dependency graph
[trunk] $ /home/hudson/tools/java/latest1.5/bin/java -Xmx1024m -XX:MaxPermSize=256m -cp /home/jenkins/jenkins-slave/maven-agent.jar:/home/jenkins/jenkins-slave/classworlds.jar
hudson.maven.agent.Main /home/hudson/tools/maven/apache-maven-2.2.1 /home/jenkins/jenkins-slave/slave.jar
/home/jenkins/jenkins-slave/maven-interceptor.jar 58051 /home/jenkins/jenkins-slave/maven2.1-interceptor.jar
<===[JENKINS REMOTING CAPACITY]===>channel started
   log4j:WARN No appenders could be found for logger (org.apache.commons.beanutils.converters.BooleanConverter).
log4j:WARN Please initialize the log4j system properly.
Executing Maven:  -B -f <https://builds.apache.org/job/BVal-trunk/ws/trunk/pom.xml>
-Dmaven.repo.local=/home/jenkins/jenkins-slave/maven-repositories/0 clean install
[INFO] Scanning for projects...
[INFO] Reactor build order: 
[INFO]   Apache BVal :: bval-parent (Parent POM)
[INFO]   Apache BVal :: bval-core
[INFO]   Apache BVal :: bval-xstream (optional)
[INFO]   Apache BVal :: bval-jsr303
[INFO]   Apache BVal :: org.apache.bval.bundle
[INFO]   Apache BVal :: bval-json (optional)
[INFO]   Apache BVal :: bval-guice (optional)
[INFO]   Apache BVal :: bval-tck (TCK Runner)
[INFO]   Apache BVal :: bval-extras (optional)
[INFO] ------------------------------------------------------------------------
[INFO] Building Apache BVal :: bval-parent (Parent POM)
[INFO]    task-segment: [clean, install]
[INFO] ------------------------------------------------------------------------
[INFO] [clean:clean {execution: default-clean}]
[INFO] Deleting <https://builds.apache.org/job/BVal-trunk/ws/trunk/target>
[INFO] [enforcer:enforce {execution: default}]
[INFO] [buildnumber:create {execution: default}]
[INFO] Checking for local modifications: skipped.
[INFO] Updating project files from SCM: skipped.
[INFO] Executing: /bin/sh -c cd <https://builds.apache.org/job/BVal-trunk/ws/trunk>
&& svn --non-interactive info
[INFO] Working directory: <https://builds.apache.org/job/BVal-trunk/ws/trunk>
[INFO] Storing buildNumber: 1394400 at timestamp: 1349424033790
[INFO] Executing: /bin/sh -c cd <https://builds.apache.org/job/BVal-trunk/ws/trunk>
&& svn --non-interactive info
[INFO] Working directory: <https://builds.apache.org/job/BVal-trunk/ws/trunk>
[INFO] Storing buildScmBranch: trunk
[INFO] [remote-resources:process {execution: process-remote-resources}]
[INFO] [remote-resources:process {execution: default}]
[INFO] [site:attach-descriptor {execution: default-attach-descriptor}]
[INFO] Preparing source:jar
[WARNING] Removing: jar from forked lifecycle, to prevent recursive invocation.
[JENKINS] Archiving <https://builds.apache.org/job/BVal-trunk/ws/trunk/pom.xml> to /home/hudson/hudson/jobs/BVal-trunk/modules/org.apache.bval$bval-parent/builds/2012-10-05_07-59-35/archive/org.apache.bval/bval-parent/0.6-SNAPSHOT/bval-parent-0.6-SNAPSHOT.pom
[INFO] [enforcer:enforce {execution: default}]
[INFO] [buildnumber:create {execution: default}]
[INFO] [source:jar {execution: attach-source}]
[INFO] [apache-rat:check {execution: default}]
[INFO] Exclude: README.txt
[INFO] Exclude: CHANGES.txt
[INFO] Exclude: release.properties
[INFO] Exclude: DEPENDENCIES
[INFO] Exclude: **/.*/**
[INFO] Exclude: **/*.log
[INFO] Exclude: **/maven-eclipse.xml
[INFO] Exclude: **/rat.txt
[INFO] Exclude: **/target/**/*
[INFO] Exclude: **/*.iml
[INFO] Exclude: **/*.ipr
[INFO] Exclude: **/*.iws
[INFO] [ianal:verify-legal-files {execution: default}]
[INFO] [install:install {execution: default-install}]
[INFO] Installing <https://builds.apache.org/job/BVal-trunk/ws/trunk/pom.xml> to /home/jenkins/jenkins-slave/maven-repositories/0/org/apache/bval/bval-parent/0.6-SNAPSHOT/bval-parent-0.6-SNAPSHOT.pom
[INFO] ------------------------------------------------------------------------
[INFO] Building Apache BVal :: bval-core
[INFO]    task-segment: [clean, install]
[INFO] ------------------------------------------------------------------------
[INFO] [clean:clean {execution: default-clean}]
[INFO] Deleting <https://builds.apache.org/job/BVal-trunk/ws/trunk/bval-core/target>
[INFO] [enforcer:enforce {execution: default}]
[INFO] [buildnumber:create {execution: default}]
[INFO] [remote-resources:process {execution: process-remote-resources}]
Oct 5, 2012 8:00:50 AM org.apache.velocity.runtime.log.JdkLogChute log
INFO: FileResourceLoader : adding path '.'
[INFO] [remote-resources:process {execution: default}]
[debug] execute contextualize
[INFO] [resources:resources {execution: default-resources}]
[INFO] Using 'UTF-8' encoding to copy filtered resources.
[INFO] skip non existing resourceDirectory <https://builds.apache.org/job/BVal-trunk/ws/trunk/bval-core/src/main/resources>
[INFO] Copying 3 resources
[INFO] Copying 3 resources
[INFO] [compiler:compile {execution: default-compile}]
[INFO] Compiling 31 source files to <https://builds.apache.org/job/BVal-trunk/ws/trunk/bval-core/target/classes>
[INFO] -------------------------------------------------------------
[ERROR] COMPILATION ERROR : 
[INFO] -------------------------------------------------------------
[ERROR] <https://builds.apache.org/job/BVal-trunk/ws/trunk/bval-core/src/main/java/org/apache/bval/model/FeaturesCapable.java>:[81,25]
type parameters of <T>T cannot be determined; no unique maximal instance exists for
type variable T with upper bounds T,java.lang.Object
[INFO] 1 error
[INFO] -------------------------------------------------------------
[JENKINS] Archiving <https://builds.apache.org/job/BVal-trunk/ws/trunk/bval-core/pom.xml>
to /home/hudson/hudson/jobs/BVal-trunk/modules/org.apache.bval$bval-core/builds/2012-10-05_07-59-35/archive/org.apache.bval/bval-core/0.6-SNAPSHOT/bval-core-0.6-SNAPSHOT.pom
[INFO] ------------------------------------------------------------------------
[ERROR] BUILD FAILURE
[INFO] ------------------------------------------------------------------------
[INFO] Compilation failure
<https://builds.apache.org/job/BVal-trunk/ws/trunk/bval-core/src/main/java/org/apache/bval/model/FeaturesCapable.java>:[81,25]
type parameters of <T>T cannot be determined; no unique maximal instance exists for
type variable T with upper bounds T,java.lang.Object

[INFO] ------------------------------------------------------------------------
[INFO] For more information, run Maven with the -e switch
[INFO] ------------------------------------------------------------------------
[INFO] Total time: 29 seconds
[INFO] Finished at: Fri Oct 05 08:00:52 UTC 2012
[INFO] Final Memory: 56M/134M
[INFO] ------------------------------------------------------------------------
Sending e-mails to: commits@bval.apache.org
channel stopped

Mime
View raw message