bval-commits mailing list archives

Site index · List index
Message view « Date » · « Thread »
Top « Date » · « Thread »
From Apache Jenkins Server <jenk...@builds.apache.org>
Subject Build failed in Jenkins: BVal-trunk » Apache BVal :: bval-core #175
Date Fri, 05 Oct 2012 07:09:54 GMT
See <https://builds.apache.org/job/BVal-trunk/org.apache.bval$bval-core/175/changes>

Changes:

[mbenson] [BVAL-113] Minor performance improvements

------------------------------------------
[INFO] ------------------------------------------------------------------------
[INFO] Building Apache BVal :: bval-core
[INFO]    task-segment: [clean, install]
[INFO] ------------------------------------------------------------------------
[INFO] [clean:clean {execution: default-clean}]
[INFO] Deleting <https://builds.apache.org/job/BVal-trunk/org.apache.bval$bval-core/ws/target>
[INFO] [enforcer:enforce {execution: default}]
[INFO] [buildnumber:create {execution: default}]
[INFO] [remote-resources:process {execution: process-remote-resources}]
Oct 5, 2012 7:09:47 AM org.apache.velocity.runtime.log.JdkLogChute log
INFO: FileResourceLoader : adding path '.'
[INFO] [remote-resources:process {execution: default}]
[debug] execute contextualize
[INFO] [resources:resources {execution: default-resources}]
[INFO] Using 'UTF-8' encoding to copy filtered resources.
[INFO] skip non existing resourceDirectory <https://builds.apache.org/job/BVal-trunk/org.apache.bval$bval-core/ws/src/main/resources>
[INFO] Copying 3 resources
[INFO] Copying 3 resources
[INFO] [compiler:compile {execution: default-compile}]
[INFO] Compiling 31 source files to <https://builds.apache.org/job/BVal-trunk/org.apache.bval$bval-core/ws/target/classes>
[INFO] -------------------------------------------------------------
[ERROR] COMPILATION ERROR : 
[INFO] -------------------------------------------------------------
[ERROR] <https://builds.apache.org/job/BVal-trunk/org.apache.bval$bval-core/ws/src/main/java/org/apache/bval/model/FeaturesCapable.java>:[81,25]
type parameters of <T>T cannot be determined; no unique maximal instance exists for
type variable T with upper bounds T,java.lang.Object
[INFO] 1 error
[INFO] -------------------------------------------------------------
[JENKINS] Archiving <https://builds.apache.org/job/BVal-trunk/org.apache.bval$bval-core/ws/pom.xml>
to /home/hudson/hudson/jobs/BVal-trunk/modules/org.apache.bval$bval-core/builds/2012-10-05_07-08-34/archive/org.apache.bval/bval-core/0.6-SNAPSHOT/bval-core-0.6-SNAPSHOT.pom
[INFO] ------------------------------------------------------------------------
[ERROR] BUILD FAILURE
[INFO] ------------------------------------------------------------------------
[INFO] Compilation failure
<https://builds.apache.org/job/BVal-trunk/org.apache.bval$bval-core/ws/src/main/java/org/apache/bval/model/FeaturesCapable.java>:[81,25]
type parameters of <T>T cannot be determined; no unique maximal instance exists for
type variable T with upper bounds T,java.lang.Object

[INFO] ------------------------------------------------------------------------
[INFO] For more information, run Maven with the -e switch
[INFO] ------------------------------------------------------------------------
[INFO] Total time: 39 seconds
[INFO] Finished at: Fri Oct 05 07:09:48 UTC 2012
[INFO] Final Memory: 56M/132M
[INFO] ------------------------------------------------------------------------

Mime
View raw message