bval-commits mailing list archives

Site index · List index
Message view « Date » · « Thread »
Top « Date » · « Thread »
From Apache Jenkins Server <jenk...@builds.apache.org>
Subject Build failed in Jenkins: BVal-trunk #133
Date Thu, 29 Mar 2012 02:23:53 GMT
See <https://builds.apache.org/job/BVal-trunk/133/changes>

Changes:

[mbenson] upgrade surefire

------------------------------------------
[...truncated 383 lines...]


[INFO] [jar:jar {execution: default-jar}]
[INFO] Building jar: <https://builds.apache.org/job/BVal-trunk/ws/trunk/bval-jsr303/target/bval-jsr303-0.4-incubating-SNAPSHOT.jar>
[INFO] Preparing source:jar
[WARNING] Removing: jar from forked lifecycle, to prevent recursive invocation.
[JENKINS] Archiving <https://builds.apache.org/job/BVal-trunk/ws/trunk/bval-jsr303/pom.xml>
to /home/hudson/hudson/jobs/BVal-trunk/modules/org.apache.bval$bval-jsr303/builds/2012-03-29_02-08-49/archive/org.apache.bval/bval-jsr303/0.4-incubating-SNAPSHOT/bval-jsr303-0.4-incubating-SNAPSHOT.pom
[JENKINS] Archiving <https://builds.apache.org/job/BVal-trunk/ws/trunk/bval-jsr303/target/bval-jsr303-0.4-incubating-SNAPSHOT.jar>
to /home/hudson/hudson/jobs/BVal-trunk/modules/org.apache.bval$bval-jsr303/builds/2012-03-29_02-08-49/archive/org.apache.bval/bval-jsr303/0.4-incubating-SNAPSHOT/bval-jsr303-0.4-incubating-SNAPSHOT.jar
[INFO] [enforcer:enforce {execution: default}]
[INFO] [buildnumber:create {execution: default}]
[INFO] [jaxb2:xjc {execution: default}]
[INFO] No changes detected in schema or binding files, skipping source generation.
[INFO] [source:jar {execution: attach-source}]
[INFO] Building jar: <https://builds.apache.org/job/BVal-trunk/ws/trunk/bval-jsr303/target/bval-jsr303-0.4-incubating-SNAPSHOT-sources.jar>
[INFO] [jar:test-jar {execution: test-jar}]
[INFO] Building jar: <https://builds.apache.org/job/BVal-trunk/ws/trunk/bval-jsr303/target/bval-jsr303-0.4-incubating-SNAPSHOT-tests.jar>
[INFO] [apache-rat:check {execution: default}]
[INFO] Exclude: README.txt
[INFO] Exclude: CHANGES.txt
[INFO] Exclude: release.properties
[INFO] Exclude: DEPENDENCIES
[INFO] Exclude: **/.*/**
[INFO] Exclude: **/*.log
[INFO] Exclude: **/maven-eclipse.xml
[INFO] Exclude: **/rat.txt
[INFO] Exclude: **/target/**/*
[INFO] Exclude: **/*.iml
[INFO] Exclude: **/*.ipr
[INFO] Exclude: **/*.iws
[INFO] [ianal:verify-legal-files {execution: default}]
[INFO] Checking legal files in: bval-jsr303-0.4-incubating-SNAPSHOT.jar
[INFO] Checking legal files in: bval-jsr303-0.4-incubating-SNAPSHOT-sources.jar
[INFO] Checking legal files in: bval-jsr303-0.4-incubating-SNAPSHOT-tests.jar
[INFO] [install:install {execution: default-install}]
[INFO] Installing <https://builds.apache.org/job/BVal-trunk/ws/trunk/bval-jsr303/target/bval-jsr303-0.4-incubating-SNAPSHOT.jar>
to /home/jenkins/jenkins-slave/maven-repositories/0/org/apache/bval/bval-jsr303/0.4-incubating-SNAPSHOT/bval-jsr303-0.4-incubating-SNAPSHOT.jar
[INFO] Installing <https://builds.apache.org/job/BVal-trunk/ws/trunk/bval-jsr303/target/bval-jsr303-0.4-incubating-SNAPSHOT-sources.jar>
to /home/jenkins/jenkins-slave/maven-repositories/0/org/apache/bval/bval-jsr303/0.4-incubating-SNAPSHOT/bval-jsr303-0.4-incubating-SNAPSHOT-sources.jar
[INFO] Installing <https://builds.apache.org/job/BVal-trunk/ws/trunk/bval-jsr303/target/bval-jsr303-0.4-incubating-SNAPSHOT-tests.jar>
to /home/jenkins/jenkins-slave/maven-repositories/0/org/apache/bval/bval-jsr303/0.4-incubating-SNAPSHOT/bval-jsr303-0.4-incubating-SNAPSHOT-tests.jar
[JENKINS] Archiving <https://builds.apache.org/job/BVal-trunk/ws/trunk/bval-jsr303/target/bval-jsr303-0.4-incubating-SNAPSHOT-sources.jar>
to /home/hudson/hudson/jobs/BVal-trunk/modules/org.apache.bval$bval-jsr303/builds/2012-03-29_02-08-49/archive/org.apache.bval/bval-jsr303/0.4-incubating-SNAPSHOT/bval-jsr303-0.4-incubating-SNAPSHOT-sources.jar
[JENKINS] Archiving <https://builds.apache.org/job/BVal-trunk/ws/trunk/bval-jsr303/target/bval-jsr303-0.4-incubating-SNAPSHOT-tests.jar>
to /home/hudson/hudson/jobs/BVal-trunk/modules/org.apache.bval$bval-jsr303/builds/2012-03-29_02-08-49/archive/org.apache.bval/bval-jsr303/0.4-incubating-SNAPSHOT/bval-jsr303-0.4-incubating-SNAPSHOT-tests.jar
[INFO] ------------------------------------------------------------------------
[INFO] Building Apache BVal :: org.apache.bval.bundle
[INFO]    task-segment: [clean, install]
[INFO] ------------------------------------------------------------------------
[INFO] [clean:clean {execution: default-clean}]
[INFO] Deleting <https://builds.apache.org/job/BVal-trunk/ws/trunk/bundle/target>
[INFO] [enforcer:enforce {execution: default}]
[INFO] [buildnumber:create {execution: default}]
[INFO] [remote-resources:process {execution: process-remote-resources}]
[INFO] [remote-resources:process {execution: default}]
[debug] execute contextualize
[INFO] [resources:resources {execution: default-resources}]
[INFO] Using 'UTF-8' encoding to copy filtered resources.
[INFO] skip non existing resourceDirectory <https://builds.apache.org/job/BVal-trunk/ws/trunk/bundle/src/main/resources>
[INFO] Copying 4 resources
[INFO] Copying 4 resources
[INFO] [compiler:compile {execution: default-compile}]
[INFO] No sources to compile
[debug] execute contextualize
[INFO] [resources:testResources {execution: default-testResources}]
[INFO] Using 'UTF-8' encoding to copy filtered resources.
[INFO] skip non existing resourceDirectory <https://builds.apache.org/job/BVal-trunk/ws/trunk/bundle/src/test/resources>
[INFO] Copying 4 resources
[INFO] Copying 4 resources
[INFO] [compiler:testCompile {execution: default-testCompile}]
[INFO] No sources to compile
[JENKINS] Recording test results[INFO] [surefire:test {execution: default-test}]
[INFO] Surefire report directory: <https://builds.apache.org/job/BVal-trunk/ws/trunk/bundle/target/surefire-reports>

-------------------------------------------------------
 T E S T S
-------------------------------------------------------

Results :

Tests run: 0, Failures: 0, Errors: 0, Skipped: 0

[INFO] [bundle:bundle {execution: default-bundle}]
[INFO] Preparing source:jar
[WARNING] Removing: jar from forked lifecycle, to prevent recursive invocation.

[JENKINS] Archiving <https://builds.apache.org/job/BVal-trunk/ws/trunk/bundle/pom.xml>
to /home/hudson/hudson/jobs/BVal-trunk/modules/org.apache.bval$org.apache.bval.bundle/builds/2012-03-29_02-08-49/archive/org.apache.bval/org.apache.bval.bundle/0.4-incubating-SNAPSHOT/org.apache.bval.bundle-0.4-incubating-SNAPSHOT.pom
[JENKINS] Archiving <https://builds.apache.org/job/BVal-trunk/ws/trunk/bundle/target/org.apache.bval.bundle-0.4-incubating-SNAPSHOT.jar>
to /home/hudson/hudson/jobs/BVal-trunk/modules/org.apache.bval$org.apache.bval.bundle/builds/2012-03-29_02-08-49/archive/org.apache.bval/org.apache.bval.bundle/0.4-incubating-SNAPSHOT/org.apache.bval.bundle-0.4-incubating-SNAPSHOT.jar
[INFO] [enforcer:enforce {execution: default}]
[INFO] [buildnumber:create {execution: default}]
[INFO] [source:jar {execution: attach-source}]
[INFO] Building jar: <https://builds.apache.org/job/BVal-trunk/ws/trunk/bundle/target/org.apache.bval.bundle-0.4-incubating-SNAPSHOT-sources.jar>
[INFO] [apache-rat:check {execution: default}]
[INFO] Exclude: README.txt
[INFO] Exclude: CHANGES.txt
[INFO] Exclude: release.properties
[INFO] Exclude: DEPENDENCIES
[INFO] Exclude: **/.*/**
[INFO] Exclude: **/*.log
[INFO] Exclude: **/maven-eclipse.xml
[INFO] Exclude: **/rat.txt
[INFO] Exclude: **/target/**/*
[INFO] Exclude: **/*.iml
[INFO] Exclude: **/*.ipr
[INFO] Exclude: **/*.iws
[INFO] [ianal:verify-legal-files {execution: default}]
[INFO] Checking legal files in: org.apache.bval.bundle-0.4-incubating-SNAPSHOT.jar
[INFO] Checking legal files in: org.apache.bval.bundle-0.4-incubating-SNAPSHOT-sources.jar
[INFO] [install:install {execution: default-install}]
[INFO] Installing <https://builds.apache.org/job/BVal-trunk/ws/trunk/bundle/target/org.apache.bval.bundle-0.4-incubating-SNAPSHOT.jar>
to /home/jenkins/jenkins-slave/maven-repositories/0/org/apache/bval/org.apache.bval.bundle/0.4-incubating-SNAPSHOT/org.apache.bval.bundle-0.4-incubating-SNAPSHOT.jar
[INFO] Installing <https://builds.apache.org/job/BVal-trunk/ws/trunk/bundle/target/org.apache.bval.bundle-0.4-incubating-SNAPSHOT-sources.jar>
to /home/jenkins/jenkins-slave/maven-repositories/0/org/apache/bval/org.apache.bval.bundle/0.4-incubating-SNAPSHOT/org.apache.bval.bundle-0.4-incubating-SNAPSHOT-sources.jar
[INFO] [bundle:install {execution: default-install}]
[INFO] Parsing file:/home/jenkins/jenkins-slave/maven-repositories/0/repository.xml
[INFO] Installing org/apache/bval/org.apache.bval.bundle/0.4-incubating-SNAPSHOT/org.apache.bval.bundle-0.4-incubating-SNAPSHOT.jar
[INFO] Writing OBR metadata
[JENKINS] Archiving <https://builds.apache.org/job/BVal-trunk/ws/trunk/bundle/target/org.apache.bval.bundle-0.4-incubating-SNAPSHOT-sources.jar>
to /home/hudson/hudson/jobs/BVal-trunk/modules/org.apache.bval$org.apache.bval.bundle/builds/2012-03-29_02-08-49/archive/org.apache.bval/org.apache.bval.bundle/0.4-incubating-SNAPSHOT/org.apache.bval.bundle-0.4-incubating-SNAPSHOT-sources.jar
[INFO] ------------------------------------------------------------------------
[INFO] Building Apache BVal :: bval-json (optional)
[INFO]    task-segment: [clean, install]
[INFO] ------------------------------------------------------------------------
[INFO] [clean:clean {execution: default-clean}]
[INFO] Deleting <https://builds.apache.org/job/BVal-trunk/ws/trunk/bval-json/target>
[INFO] [enforcer:enforce {execution: default}]
[INFO] [buildnumber:create {execution: default}]
[INFO] [remote-resources:process {execution: process-remote-resources}]
[INFO] [remote-resources:process {execution: default}]
[debug] execute contextualize
[INFO] [resources:resources {execution: default-resources}]
[INFO] Using 'UTF-8' encoding to copy filtered resources.
[INFO] Copying 1 resource
[INFO] Copying 4 resources
[INFO] Copying 4 resources
[INFO] [compiler:compile {execution: default-compile}]
[INFO] Compiling 1 source file to <https://builds.apache.org/job/BVal-trunk/ws/trunk/bval-json/target/classes>
[debug] execute contextualize
[INFO] [resources:testResources {execution: default-testResources}]
[INFO] Using 'UTF-8' encoding to copy filtered resources.
[INFO] skip non existing resourceDirectory <https://builds.apache.org/job/BVal-trunk/ws/trunk/bval-json/src/test/resources>
[INFO] Copying 4 resources
[INFO] Copying 4 resources
[INFO] [compiler:testCompile {execution: default-testCompile}]
[INFO] Compiling 1 source file to <https://builds.apache.org/job/BVal-trunk/ws/trunk/bval-json/target/test-classes>
[INFO] [surefire:test {execution: default-test}]
[INFO] Surefire report directory: <https://builds.apache.org/job/BVal-trunk/ws/trunk/bval-json/target/surefire-reports>

-------------------------------------------------------
 T E S T S
-------------------------------------------------------
Running org.apache.bval.json.JSONGeneratorTest
Tests run: 3, Failures: 0, Errors: 0, Skipped: 0, Time elapsed: 0.587 sec

Results :

Tests run: 3, Failures: 0, Errors: 0, Skipped: 0

[JENKINS] Recording test results
[INFO] [bundle:bundle {execution: default-bundle}]
[INFO] Preparing source:jar
[WARNING] Removing: jar from forked lifecycle, to prevent recursive invocation.
[JENKINS] Archiving <https://builds.apache.org/job/BVal-trunk/ws/trunk/bval-json/pom.xml>
to /home/hudson/hudson/jobs/BVal-trunk/modules/org.apache.bval$bval-json/builds/2012-03-29_02-08-49/archive/org.apache.bval/bval-json/0.4-incubating-SNAPSHOT/bval-json-0.4-incubating-SNAPSHOT.pom
[JENKINS] Archiving <https://builds.apache.org/job/BVal-trunk/ws/trunk/bval-json/target/bval-json-0.4-incubating-SNAPSHOT.jar>
to /home/hudson/hudson/jobs/BVal-trunk/modules/org.apache.bval$bval-json/builds/2012-03-29_02-08-49/archive/org.apache.bval/bval-json/0.4-incubating-SNAPSHOT/bval-json-0.4-incubating-SNAPSHOT.jar
[INFO] [enforcer:enforce {execution: default}]
[INFO] [buildnumber:create {execution: default}]
[INFO] [source:jar {execution: attach-source}]
[INFO] Building jar: <https://builds.apache.org/job/BVal-trunk/ws/trunk/bval-json/target/bval-json-0.4-incubating-SNAPSHOT-sources.jar>
[INFO] [apache-rat:check {execution: default}]
[INFO] Exclude: README.txt
[INFO] Exclude: CHANGES.txt
[INFO] Exclude: release.properties
[INFO] Exclude: DEPENDENCIES
[INFO] Exclude: **/.*/**
[INFO] Exclude: **/*.log
[INFO] Exclude: **/maven-eclipse.xml
[INFO] Exclude: **/rat.txt
[INFO] Exclude: **/target/**/*
[INFO] Exclude: **/*.iml
[INFO] Exclude: **/*.ipr
[INFO] Exclude: **/*.iws
[INFO] [ianal:verify-legal-files {execution: default}]
[INFO] Checking legal files in: bval-json-0.4-incubating-SNAPSHOT.jar
[INFO] Checking legal files in: bval-json-0.4-incubating-SNAPSHOT-sources.jar
[INFO] [install:install {execution: default-install}]
[INFO] Installing <https://builds.apache.org/job/BVal-trunk/ws/trunk/bval-json/target/bval-json-0.4-incubating-SNAPSHOT.jar>
to /home/jenkins/jenkins-slave/maven-repositories/0/org/apache/bval/bval-json/0.4-incubating-SNAPSHOT/bval-json-0.4-incubating-SNAPSHOT.jar
[INFO] Installing <https://builds.apache.org/job/BVal-trunk/ws/trunk/bval-json/target/bval-json-0.4-incubating-SNAPSHOT-sources.jar>
to /home/jenkins/jenkins-slave/maven-repositories/0/org/apache/bval/bval-json/0.4-incubating-SNAPSHOT/bval-json-0.4-incubating-SNAPSHOT-sources.jar
[INFO] [bundle:install {execution: default-install}]
[INFO] Parsing file:/home/jenkins/jenkins-slave/maven-repositories/0/repository.xml
[INFO] Installing org/apache/bval/bval-json/0.4-incubating-SNAPSHOT/bval-json-0.4-incubating-SNAPSHOT.jar
[INFO] Writing OBR metadata
[JENKINS] Archiving <https://builds.apache.org/job/BVal-trunk/ws/trunk/bval-json/target/bval-json-0.4-incubating-SNAPSHOT-sources.jar>
to /home/hudson/hudson/jobs/BVal-trunk/modules/org.apache.bval$bval-json/builds/2012-03-29_02-08-49/archive/org.apache.bval/bval-json/0.4-incubating-SNAPSHOT/bval-json-0.4-incubating-SNAPSHOT-sources.jar
Build timed out (after 15 minutes). Marking the build as failed.
[INFO] ------------------------------------------------------------------------
[ERROR] FATAL ERROR
[INFO] ------------------------------------------------------------------------
channel stopped
[INFO] hudson.remoting.RequestAbortedException: hudson.remoting.Channel$OrderlyShutdown
[INFO] ------------------------------------------------------------------------
[INFO] Trace
hudson.remoting.RequestAbortedException: hudson.remoting.RequestAbortedException: hudson.remoting.Channel$OrderlyShutdown
	at hudson.remoting.Request.call(Request.java:149)
	at hudson.remoting.Channel.call(Channel.java:681)
	at hudson.remoting.RemoteInvocationHandler.invoke(RemoteInvocationHandler.java:158)
	at $Proxy2.isArchivingDisabled(Unknown Source)
	at hudson.maven.MavenBuildProxy$Filter.isArchivingDisabled(MavenBuildProxy.java:227)
	at hudson.maven.reporters.MavenArtifact.archive(MavenArtifact.java:223)
	at hudson.maven.reporters.MavenArtifactArchiver.postBuild(MavenArtifactArchiver.java:106)
	at hudson.maven.Maven2Builder.postModule(Maven2Builder.java:127)
	at hudson.maven.MavenBuilder$Adapter.fireLeaveModule(MavenBuilder.java:327)
	at hudson.maven.MavenBuilder$Adapter.postBuild(MavenBuilder.java:285)
	at org.apache.maven.lifecycle.LifecycleExecutorInterceptor.execute(LifecycleExecutorInterceptor.java:68)
	at org.apache.maven.DefaultMaven.doExecute(DefaultMaven.java:328)
	at org.apache.maven.DefaultMaven.execute(DefaultMaven.java:138)
	at org.apache.maven.cli.MavenCli.main(MavenCli.java:362)
	at sun.reflect.NativeMethodAccessorImpl.invoke0(Native Method)
	at sun.reflect.NativeMethodAccessorImpl.invoke(NativeMethodAccessorImpl.java:39)
	at sun.reflect.DelegatingMethodAccessorImpl.invoke(DelegatingMethodAccessorImpl.java:25)
	at java.lang.reflect.Method.invoke(Method.java:592)
	at org.codehaus.classworlds.Launcher.launchEnhanced(Launcher.java:315)
	at org.codehaus.classworlds.Launcher.launch(Launcher.java:255)
	at hudson.maven.agent.Main.launch(Main.java:185)
	at hudson.maven.MavenBuilder.call(MavenBuilder.java:151)
	at hudson.maven.Maven2Builder.call(Maven2Builder.java:77)
	at hudson.maven.Maven2Builder.call(Maven2Builder.java:53)
	at hudson.remoting.UserRequest.perform(UserRequest.java:118)
	at hudson.remoting.UserRequest.perform(UserRequest.java:48)
	at hudson.remoting.Request$2.run(Request.java:287)
	at hudson.remoting.InterceptingExecutorService$1.call(InterceptingExecutorService.java:72)
	at java.util.concurrent.FutureTask$Sync.innerRun(FutureTask.java:269)
	at java.util.concurrent.FutureTask.run(FutureTask.java:123)
	at java.util.concurrent.ThreadPoolExecutor$Worker.runTask(ThreadPoolExecutor.java:651)
	at java.util.concurrent.ThreadPoolExecutor$Worker.run(ThreadPoolExecutor.java:676)
	at java.lang.Thread.run(Thread.java:595)
Caused by: hudson.remoting.RequestAbortedException: hudson.remoting.Channel$OrderlyShutdown
	at hudson.remoting.Request.abort(Request.java:273)
	at hudson.remoting.Channel.terminate(Channel.java:732)
	at hudson.remoting.Channel$CloseCommand.execute(Channel.java:848)
	at hudson.remoting.Channel$ReaderThread.run(Channel.java:1146)
Caused by: hudson.remoting.Channel$OrderlyShutdown
	... 2 more
Caused by: Command close created at
	at hudson.remoting.Command.<init>(Command.java:51)
	at hudson.remoting.Channel$CloseCommand.<init>(Channel.java:842)
	at hudson.remoting.Channel$CloseCommand.<init>(Channel.java:840)
	at hudson.remoting.Channel.close(Channel.java:907)
	at hudson.remoting.Channel.close(Channel.java:890)
	at hudson.slaves.Channels$1.close(Channels.java:91)
	at hudson.maven.ProcessCache$MavenProcess.discard(ProcessCache.java:145)
	at hudson.maven.MavenModuleSetBuild$RunnerImpl.doRun(MavenModuleSetBuild.java:800)
	at hudson.model.AbstractBuild$AbstractRunner.run(AbstractBuild.java:473)
	at hudson.model.Run.run(Run.java:1410)
	at hudson.maven.MavenModuleSetBuild.run(MavenModuleSetBuild.java:481)
	at hudson.model.ResourceController.execute(ResourceController.java:88)
	at hudson.model.Executor.run(Executor.java:238)
[INFO] ------------------------------------------------------------------------
[INFO] Total time: 10 minutes 13 seconds
[INFO] Finished at: Thu Mar 29 02:23:42 UTC 2012

Mime
View raw message