buildr-ci mailing list archives

Site index · List index
Message view « Date » · « Thread »
Top « Date » · « Thread »
From Apache Jenkins Server <jenk...@builds.apache.org>
Subject Build failed in Jenkins: Buildr-ci-build-jruby-win32 #264
Date Mon, 27 Apr 2015 12:07:56 GMT
See <https://builds.apache.org/job/Buildr-ci-build-jruby-win32/264/>

------------------------------------------
[...truncated 1887 lines...]
    Tests run: 0, Failures: 0, Skips: 0
===============================================


===============================================
foo
Total tests run: 0, Failures: 0, Skips: 0
===============================================

[TestNG] Time taken by org.testng.reporters.XMLReporter@22838de0: 14 ms
[TestNG] Time taken by org.testng.reporters.JUnitReportReporter@5b46c2cb: 0 ms
[TestNG] Time taken by org.testng.reporters.EmailableReporter2@31b75e54: 3 ms
[TestNG] Time taken by org.testng.reporters.SuiteHTMLReporter@5e21151e: 19 ms
[TestNG] Time taken by [FailedReporter passed=0 failed=0 skipped=0]: 1 ms
[TestNG] Time taken by org.testng.reporters.jq.Main@5c03bb34: 36 ms
.[TestNG] Running:
  foo

FAILED: testNothing
java.lang.AssertionError: 
	at org.testng.AssertJUnit.fail(AssertJUnit.java:59)
	at org.testng.AssertJUnit.assertTrue(AssertJUnit.java:24)
	at org.testng.AssertJUnit.assertTrue(AssertJUnit.java:33)
	at FailingTest1.testNothing(FailingTest1.java:4)
	at sun.reflect.NativeMethodAccessorImpl.invoke0(Native Method)
	at sun.reflect.NativeMethodAccessorImpl.invoke(NativeMethodAccessorImpl.java:57)
	at sun.reflect.DelegatingMethodAccessorImpl.invoke(DelegatingMethodAccessorImpl.java:43)
	at java.lang.reflect.Method.invoke(Method.java:601)
	at org.testng.internal.MethodInvocationHelper.invokeMethod(MethodInvocationHelper.java:84)
	at org.testng.internal.Invoker.invokeMethod(Invoker.java:714)
	at org.testng.internal.Invoker.invokeTestMethod(Invoker.java:901)
	at org.testng.internal.Invoker.invokeTestMethods(Invoker.java:1231)
	at org.testng.internal.TestMethodWorker.invokeTestMethods(TestMethodWorker.java:127)
	at org.testng.internal.TestMethodWorker.run(TestMethodWorker.java:111)
	at org.testng.TestRunner.privateRun(TestRunner.java:767)
	at org.testng.TestRunner.run(TestRunner.java:617)
	at org.testng.SuiteRunner.runTest(SuiteRunner.java:334)
	at org.testng.SuiteRunner.runSequentially(SuiteRunner.java:329)
	at org.testng.SuiteRunner.privateRun(SuiteRunner.java:291)
	at org.testng.SuiteRunner.run(SuiteRunner.java:240)
	at org.testng.SuiteRunnerWorker.runSuite(SuiteRunnerWorker.java:52)
	at org.testng.SuiteRunnerWorker.run(SuiteRunnerWorker.java:86)
	at org.testng.TestNG.runSuitesSequentially(TestNG.java:1224)
	at org.testng.TestNG.runSuitesLocally(TestNG.java:1149)
	at org.testng.TestNG.run(TestNG.java:1057)
	at org.testng.TestNG.privateMain(TestNG.java:1364)
	at org.testng.TestNG.main(TestNG.java:1333)

FAILED: testNothing
java.lang.AssertionError: 
	at org.testng.AssertJUnit.fail(AssertJUnit.java:59)
	at org.testng.AssertJUnit.assertTrue(AssertJUnit.java:24)
	at org.testng.AssertJUnit.assertTrue(AssertJUnit.java:33)
	at FailingTest2.testNothing(FailingTest2.java:4)
	at sun.reflect.NativeMethodAccessorImpl.invoke0(Native Method)
	at sun.reflect.NativeMethodAccessorImpl.invoke(NativeMethodAccessorImpl.java:57)
	at sun.reflect.DelegatingMethodAccessorImpl.invoke(DelegatingMethodAccessorImpl.java:43)
	at java.lang.reflect.Method.invoke(Method.java:601)
	at org.testng.internal.MethodInvocationHelper.invokeMethod(MethodInvocationHelper.java:84)
	at org.testng.internal.Invoker.invokeMethod(Invoker.java:714)
	at org.testng.internal.Invoker.invokeTestMethod(Invoker.java:901)
	at org.testng.internal.Invoker.invokeTestMethods(Invoker.java:1231)
	at org.testng.internal.TestMethodWorker.invokeTestMethods(TestMethodWorker.java:127)
	at org.testng.internal.TestMethodWorker.run(TestMethodWorker.java:111)
	at org.testng.TestRunner.privateRun(TestRunner.java:767)
	at org.testng.TestRunner.run(TestRunner.java:617)
	at org.testng.SuiteRunner.runTest(SuiteRunner.java:334)
	at org.testng.SuiteRunner.runSequentially(SuiteRunner.java:329)
	at org.testng.SuiteRunner.privateRun(SuiteRunner.java:291)
	at org.testng.SuiteRunner.run(SuiteRunner.java:240)
	at org.testng.SuiteRunnerWorker.runSuite(SuiteRunnerWorker.java:52)
	at org.testng.SuiteRunnerWorker.run(SuiteRunnerWorker.java:86)
	at org.testng.TestNG.runSuitesSequentially(TestNG.java:1224)
	at org.testng.TestNG.runSuitesLocally(TestNG.java:1149)
	at org.testng.TestNG.run(TestNG.java:1057)
	at org.testng.TestNG.privateMain(TestNG.java:1364)
	at org.testng.TestNG.main(TestNG.java:1333)


===============================================
    Command line test
    Tests run: 2, Failures: 2, Skips: 0
===============================================


===============================================
foo
Total tests run: 2, Failures: 2, Skips: 0
===============================================

[TestNG] Time taken by org.testng.reporters.EmailableReporter2@5ebb2539: 14 ms
[TestNG] Time taken by [FailedReporter passed=0 failed=0 skipped=0]: 18 ms
[TestNG] Time taken by org.testng.reporters.jq.Main@398f1ef8: 41 ms
[TestNG] Time taken by org.testng.reporters.XMLReporter@5e335678: 10 ms
[TestNG] Time taken by org.testng.reporters.SuiteHTMLReporter@4a2e64c1: 14 ms
[TestNG] Time taken by org.testng.reporters.JUnitReportReporter@79e776cc: 5 ms
.[TestNG] Running:
  foo

PASSED: testNothing

===============================================
    Command line test
    Tests run: 1, Failures: 0, Skips: 0
===============================================


===============================================
foo
Total tests run: 1, Failures: 0, Skips: 0
===============================================

[TestNG] Time taken by [FailedReporter passed=0 failed=0 skipped=0]: 0 ms
[TestNG] Time taken by org.testng.reporters.SuiteHTMLReporter@23ccf0ad: 23 ms
[TestNG] Time taken by org.testng.reporters.XMLReporter@2a09f3f8: 8 ms
[TestNG] Time taken by org.testng.reporters.jq.Main@18a37512: 42 ms
[TestNG] Time taken by org.testng.reporters.JUnitReportReporter@df08e98: 3 ms
[TestNG] Time taken by org.testng.reporters.EmailableReporter2@6b6c433e: 5 ms
.........................................................................................F.......................................................................................DEPRECATION:
any_number_of_times is deprecated. Use stub instead. Called from F:/hudson/hudson-slave/workspace/Buildr-ci-build-jruby-win32/spec/packaging/artifact_spec.rb:1065:in
`(root)'.
DEPRECATION: any_number_of_times is deprecated. Use stub instead. Called from F:/hudson/hudson-slave/workspace/Buildr-ci-build-jruby-win32/spec/packaging/artifact_spec.rb:1079:in
`(root)'.
..DEPRECATION: any_number_of_times is deprecated. Use stub instead. Called from F:/hudson/hudson-slave/workspace/Buildr-ci-build-jruby-win32/spec/packaging/artifact_spec.rb:1079:in
`(root)'.
.........................................................................................................................Buildfile:
F:\hudson\hudson-slave\workspace\Buildr-ci-build-jruby-win32\tmp\build.xml

dist:

BUILD SUCCESSFUL
Total time: 0 seconds
Buildfile: F:\hudson\hudson-slave\workspace\Buildr-ci-build-jruby-win32\tmp\build.xml

dist:

BUILD SUCCESSFUL
Total time: 0 seconds
.Creating destination directory: "F:/hudson/hudson-slave/workspace/Buildr-ci-build-jruby-win32/tmp/doc\"
Creating destination directory: "F:/hudson/hudson-slave/workspace/Buildr-ci-build-jruby-win32/tmp/doc\"
..Creating destination directory: "F:/hudson/hudson-slave/workspace/Buildr-ci-build-jruby-win32/tmp/doc\"
.......

Failures:

  1) Buildr::Filter should respond to :exclude with a Proc and use these exclusion patterns
     Failure/Error: Dir['target/*'].sort.should eql(['target/file1', 'target/file3'])
       
       expected: ["target/file1", "target/file3"]
            got: ["target/dependency-1.0.jar", "target/file1", "target/file3"]
       
       (compared using eql?)
     # F:/hudson/tools/jruby-1.6.7/lib/ruby/gems/1.8/gems/rspec-expectations-2.14.3/lib/rspec/expectations/fail_with.rb:32:in
`fail_with'
     # F:/hudson/tools/jruby-1.6.7/lib/ruby/gems/1.8/gems/rspec-expectations-2.14.3/lib/rspec/expectations/handler.rb:34:in
`handle_matcher'
     # F:/hudson/tools/jruby-1.6.7/lib/ruby/gems/1.8/gems/rspec-expectations-2.14.3/lib/rspec/expectations/syntax.rb:53:in
`should'
     # ./spec/core/common_spec.rb:343:in `(root)'
     # org/jruby/RubyKernel.java:2045:in `instance_eval'
     # F:/hudson/tools/jruby-1.6.7/lib/ruby/gems/1.8/gems/rspec-core-2.14.5/lib/rspec/core/example.rb:114:in
`run'
     # F:/hudson/tools/jruby-1.6.7/lib/ruby/gems/1.8/gems/rspec-core-2.14.5/lib/rspec/core/example.rb:112:in
`run'
     # org/jruby/RubyProc.java:270:in `call'
     # org/jruby/RubyProc.java:220:in `call'
     # F:/hudson/tools/jruby-1.6.7/lib/ruby/gems/1.8/gems/rspec-core-2.14.5/lib/rspec/core/example.rb:179:in
`extended'
     # F:/hudson/tools/jruby-1.6.7/lib/ruby/gems/1.8/gems/rspec-retry-0.2.1/lib/rspec/retry.rb:28:in
`apply'
     # org/jruby/RubyFixnum.java:256:in `times'
     # F:/hudson/tools/jruby-1.6.7/lib/ruby/gems/1.8/gems/rspec-retry-0.2.1/lib/rspec/retry.rb:19:in
`apply'
     # org/jruby/RubyKernel.java:2062:in `instance_exec'
     # F:/hudson/tools/jruby-1.6.7/lib/ruby/gems/1.8/gems/rspec-core-2.14.5/lib/rspec/core/extensions/instance_eval_with_args.rb:16:in
`instance_eval_with_args'
     # F:/hudson/tools/jruby-1.6.7/lib/ruby/gems/1.8/gems/rspec-core-2.14.5/lib/rspec/core/example.rb:247:in
`instance_eval_with_args'
     # F:/hudson/tools/jruby-1.6.7/lib/ruby/gems/1.8/gems/rspec-core-2.14.5/lib/rspec/core/hooks.rb:106:in
`run'
     # org/jruby/RubyProc.java:270:in `call'
     # org/jruby/RubyProc.java:220:in `call'
     # F:/hudson/tools/jruby-1.6.7/lib/ruby/gems/1.8/gems/rspec-core-2.14.5/lib/rspec/core/hooks.rb:104:in
`run'
     # F:/hudson/tools/jruby-1.6.7/lib/ruby/gems/1.8/gems/rspec-core-2.14.5/lib/rspec/core/hooks.rb:446:in
`run_hook'
     # F:/hudson/tools/jruby-1.6.7/lib/ruby/gems/1.8/gems/rspec-core-2.14.5/lib/rspec/core/example_group.rb:340:in
`run_around_each_hooks'
     # F:/hudson/tools/jruby-1.6.7/lib/ruby/gems/1.8/gems/rspec-core-2.14.5/lib/rspec/core/example.rb:256:in
`with_around_each_hooks'
     # F:/hudson/tools/jruby-1.6.7/lib/ruby/gems/1.8/gems/rspec-core-2.14.5/lib/rspec/core/example.rb:111:in
`run'
     # F:/hudson/tools/jruby-1.6.7/lib/ruby/gems/1.8/gems/rspec-core-2.14.5/lib/rspec/core/example.rb:109:in
`run'
     # F:/hudson/tools/jruby-1.6.7/lib/ruby/gems/1.8/gems/rspec-core-2.14.5/lib/rspec/core/example_group.rb:390:in
`run_examples'
     # org/jruby/RubyArray.java:2331:in `collect'
     # F:/hudson/tools/jruby-1.6.7/lib/ruby/gems/1.8/gems/rspec-core-2.14.5/lib/rspec/core/example_group.rb:386:in
`run_examples'
     # F:/hudson/tools/jruby-1.6.7/lib/ruby/gems/1.8/gems/rspec-core-2.14.5/lib/rspec/core/example_group.rb:371:in
`run'
     # F:/hudson/tools/jruby-1.6.7/lib/ruby/gems/1.8/gems/rspec-core-2.14.5/lib/rspec/core/example_group.rb:369:in
`run'
     # F:/hudson/tools/jruby-1.6.7/lib/ruby/gems/1.8/gems/rspec-core-2.14.5/lib/rspec/core/command_line.rb:28:in
`run'
     # org/jruby/RubyArray.java:2331:in `collect'
     # F:/hudson/tools/jruby-1.6.7/lib/ruby/gems/1.8/gems/rspec-core-2.14.5/lib/rspec/core/command_line.rb:28:in
`run'
     # F:/hudson/tools/jruby-1.6.7/lib/ruby/gems/1.8/gems/rspec-core-2.14.5/lib/rspec/core/reporter.rb:58:in
`report'
     # F:/hudson/tools/jruby-1.6.7/lib/ruby/gems/1.8/gems/rspec-core-2.14.5/lib/rspec/core/command_line.rb:25:in
`run'
     # F:/hudson/tools/jruby-1.6.7/lib/ruby/gems/1.8/gems/rspec-core-2.14.5/lib/rspec/core/runner.rb:80:in
`run'
     # F:/hudson/tools/jruby-1.6.7/lib/ruby/gems/1.8/gems/rspec-core-2.14.5/lib/rspec/core/runner.rb:17:in
`autorun'
     # org/jruby/RubyProc.java:270:in `call'
     # org/jruby/RubyProc.java:224:in `call'

Finished in 22 minutes 3 seconds
2333 examples, 1 failure

Failed examples:

rspec ./spec/core/common_spec.rb:341 # Buildr::Filter should respond to :exclude with a Proc
and use these exclusion patterns

Failures:

  1) Buildr::Filter should respond to :exclude with a Proc and use these exclusion patterns
     Failure/Error: Dir['target/*'].sort.should eql(['target/file1', 'target/file3'])
       
       expected: ["target/file1", "target/file3"]
            got: ["target/dependency-1.0.jar", "target/file1", "target/file3"]
       
       (compared using eql?)
     # F:/hudson/tools/jruby-1.6.7/lib/ruby/gems/1.8/gems/rspec-expectations-2.14.3/lib/rspec/expectations/fail_with.rb:32:in
`fail_with'
     # F:/hudson/tools/jruby-1.6.7/lib/ruby/gems/1.8/gems/rspec-expectations-2.14.3/lib/rspec/expectations/handler.rb:34:in
`handle_matcher'
     # F:/hudson/tools/jruby-1.6.7/lib/ruby/gems/1.8/gems/rspec-expectations-2.14.3/lib/rspec/expectations/syntax.rb:53:in
`should'
     # ./spec/core/common_spec.rb:343:in `(root)'
     # org/jruby/RubyKernel.java:2045:in `instance_eval'
     # F:/hudson/tools/jruby-1.6.7/lib/ruby/gems/1.8/gems/rspec-core-2.14.5/lib/rspec/core/example.rb:114:in
`run'
     # F:/hudson/tools/jruby-1.6.7/lib/ruby/gems/1.8/gems/rspec-core-2.14.5/lib/rspec/core/example.rb:112:in
`run'
     # org/jruby/RubyProc.java:270:in `call'
     # org/jruby/RubyProc.java:220:in `call'
     # F:/hudson/tools/jruby-1.6.7/lib/ruby/gems/1.8/gems/rspec-core-2.14.5/lib/rspec/core/example.rb:179:in
`extended'
     # F:/hudson/tools/jruby-1.6.7/lib/ruby/gems/1.8/gems/rspec-retry-0.2.1/lib/rspec/retry.rb:28:in
`apply'
     # org/jruby/RubyFixnum.java:256:in `times'
     # F:/hudson/tools/jruby-1.6.7/lib/ruby/gems/1.8/gems/rspec-retry-0.2.1/lib/rspec/retry.rb:19:in
`apply'
     # org/jruby/RubyKernel.java:2062:in `instance_exec'
     # F:/hudson/tools/jruby-1.6.7/lib/ruby/gems/1.8/gems/rspec-core-2.14.5/lib/rspec/core/extensions/instance_eval_with_args.rb:16:in
`instance_eval_with_args'
     # F:/hudson/tools/jruby-1.6.7/lib/ruby/gems/1.8/gems/rspec-core-2.14.5/lib/rspec/core/example.rb:247:in
`instance_eval_with_args'
     # F:/hudson/tools/jruby-1.6.7/lib/ruby/gems/1.8/gems/rspec-core-2.14.5/lib/rspec/core/hooks.rb:106:in
`run'
     # org/jruby/RubyProc.java:270:in `call'
     # org/jruby/RubyProc.java:220:in `call'
     # F:/hudson/tools/jruby-1.6.7/lib/ruby/gems/1.8/gems/rspec-core-2.14.5/lib/rspec/core/hooks.rb:104:in
`run'
     # F:/hudson/tools/jruby-1.6.7/lib/ruby/gems/1.8/gems/rspec-core-2.14.5/lib/rspec/core/hooks.rb:446:in
`run_hook'
     # F:/hudson/tools/jruby-1.6.7/lib/ruby/gems/1.8/gems/rspec-core-2.14.5/lib/rspec/core/example_group.rb:340:in
`run_around_each_hooks'
     # F:/hudson/tools/jruby-1.6.7/lib/ruby/gems/1.8/gems/rspec-core-2.14.5/lib/rspec/core/example.rb:256:in
`with_around_each_hooks'
     # F:/hudson/tools/jruby-1.6.7/lib/ruby/gems/1.8/gems/rspec-core-2.14.5/lib/rspec/core/example.rb:111:in
`run'
     # F:/hudson/tools/jruby-1.6.7/lib/ruby/gems/1.8/gems/rspec-core-2.14.5/lib/rspec/core/example.rb:109:in
`run'
     # F:/hudson/tools/jruby-1.6.7/lib/ruby/gems/1.8/gems/rspec-core-2.14.5/lib/rspec/core/example_group.rb:390:in
`run_examples'
     # org/jruby/RubyArray.java:2331:in `collect'
     # F:/hudson/tools/jruby-1.6.7/lib/ruby/gems/1.8/gems/rspec-core-2.14.5/lib/rspec/core/example_group.rb:386:in
`run_examples'
     # F:/hudson/tools/jruby-1.6.7/lib/ruby/gems/1.8/gems/rspec-core-2.14.5/lib/rspec/core/example_group.rb:371:in
`run'
     # F:/hudson/tools/jruby-1.6.7/lib/ruby/gems/1.8/gems/rspec-core-2.14.5/lib/rspec/core/example_group.rb:369:in
`run'
     # F:/hudson/tools/jruby-1.6.7/lib/ruby/gems/1.8/gems/rspec-core-2.14.5/lib/rspec/core/command_line.rb:28:in
`run'
     # org/jruby/RubyArray.java:2331:in `collect'
     # F:/hudson/tools/jruby-1.6.7/lib/ruby/gems/1.8/gems/rspec-core-2.14.5/lib/rspec/core/command_line.rb:28:in
`run'
     # F:/hudson/tools/jruby-1.6.7/lib/ruby/gems/1.8/gems/rspec-core-2.14.5/lib/rspec/core/reporter.rb:58:in
`report'
     # F:/hudson/tools/jruby-1.6.7/lib/ruby/gems/1.8/gems/rspec-core-2.14.5/lib/rspec/core/command_line.rb:25:in
`run'
     # F:/hudson/tools/jruby-1.6.7/lib/ruby/gems/1.8/gems/rspec-core-2.14.5/lib/rspec/core/runner.rb:80:in
`run'
     # F:/hudson/tools/jruby-1.6.7/lib/ruby/gems/1.8/gems/rspec-core-2.14.5/lib/rspec/core/runner.rb:17:in
`autorun'
     # org/jruby/RubyProc.java:270:in `call'
     # org/jruby/RubyProc.java:224:in `call'

Randomized with seed 123

org.jruby.exceptions.RaiseException: (SystemExit) exit
F:/hudson/tools/jruby-1.6.7/bin/jruby.exe -S rspec spec/version_requirement_spec.rb spec/addon/bnd_spec.rb
spec/addon/drb_spec.rb spec/addon/jaxb_xjc_spec.rb spec/core/application_spec.rb spec/core/build_spec.rb
spec/core/cc_spec.rb spec/core/checks_spec.rb spec/core/common_spec.rb spec/core/compile_spec.rb
spec/core/console_spec.rb spec/core/doc_spec.rb spec/core/extension_spec.rb spec/core/generate_from_eclipse_spec.rb
spec/core/generate_spec.rb spec/core/project_spec.rb spec/core/run_spec.rb spec/core/shell_spec.rb
spec/core/test_spec.rb spec/core/transport_spec.rb spec/core/util_spec.rb spec/ide/eclipse_spec.rb
spec/ide/idea_spec.rb spec/java/ant_spec.rb spec/java/bdd_spec.rb spec/java/cobertura_spec.rb
spec/java/commands_spec.rb spec/java/compiler_spec.rb spec/java/doc_spec.rb spec/java/ecj_spec.rb
spec/java/emma_spec.rb spec/java/external_spec.rb spec/java/java_spec.rb spec/java/packaging_spec.rb
spec/java/pom_spec.rb spec/java/run_spec.rb spec/java/tests_spec.rb spec/packaging/archive_spec.rb
spec/packaging/artifact_namespace_spec.rb spec/packaging/artifact_spec.rb spec/packaging/packaging_spec.rb
spec/scala/bdd_spec.rb spec/scala/compiler_spec.rb spec/scala/doc_spec.rb spec/scala/tests_spec.rb
--order random:123 --format html --out _reports/specs.html --backtrace failed
Build step 'Execute Windows batch command' marked build as failure
Recording test results

Mime
View raw message