buildr-ci mailing list archives

Site index · List index
Message view « Date » · « Thread »
Top « Date » · « Thread »
From Apache Jenkins Server <jenk...@builds.apache.org>
Subject Build failed in Jenkins: Buildr-ci-build-jruby-win32 #229
Date Fri, 11 Oct 2013 23:15:25 GMT
See <https://builds.apache.org/job/Buildr-ci-build-jruby-win32/229/changes>

Changes:

[donaldp] Add some resilience to the travis-ci job so that if rubygems is temperamental or
fails it will retry

[donaldp] BUILDR-605 - Ensure package task invokes included paths.

------------------------------------------
[...truncated 1503 lines...]
	at org.testng.SuiteRunner.privateRun(SuiteRunner.java:291)
	at org.testng.SuiteRunner.run(SuiteRunner.java:240)
	at org.testng.SuiteRunnerWorker.runSuite(SuiteRunnerWorker.java:52)
	at org.testng.SuiteRunnerWorker.run(SuiteRunnerWorker.java:86)
	at org.testng.TestNG.runSuitesSequentially(TestNG.java:1224)
	at org.testng.TestNG.runSuitesLocally(TestNG.java:1149)
	at org.testng.TestNG.run(TestNG.java:1057)
	at org.testng.TestNG.privateMain(TestNG.java:1364)
	at org.testng.TestNG.main(TestNG.java:1333)

FAILED: testNothing
java.lang.AssertionError: 
	at org.testng.AssertJUnit.fail(AssertJUnit.java:59)
	at org.testng.AssertJUnit.assertTrue(AssertJUnit.java:24)
	at org.testng.AssertJUnit.assertTrue(AssertJUnit.java:33)
	at FailingTest2.testNothing(FailingTest2.java:4)
	at sun.reflect.NativeMethodAccessorImpl.invoke0(Native Method)
	at sun.reflect.NativeMethodAccessorImpl.invoke(NativeMethodAccessorImpl.java:57)
	at sun.reflect.DelegatingMethodAccessorImpl.invoke(DelegatingMethodAccessorImpl.java:43)
	at java.lang.reflect.Method.invoke(Method.java:601)
	at org.testng.internal.MethodInvocationHelper.invokeMethod(MethodInvocationHelper.java:84)
	at org.testng.internal.Invoker.invokeMethod(Invoker.java:714)
	at org.testng.internal.Invoker.invokeTestMethod(Invoker.java:901)
	at org.testng.internal.Invoker.invokeTestMethods(Invoker.java:1231)
	at org.testng.internal.TestMethodWorker.invokeTestMethods(TestMethodWorker.java:127)
	at org.testng.internal.TestMethodWorker.run(TestMethodWorker.java:111)
	at org.testng.TestRunner.privateRun(TestRunner.java:767)
	at org.testng.TestRunner.run(TestRunner.java:617)
	at org.testng.SuiteRunner.runTest(SuiteRunner.java:334)
	at org.testng.SuiteRunner.runSequentially(SuiteRunner.java:329)
	at org.testng.SuiteRunner.privateRun(SuiteRunner.java:291)
	at org.testng.SuiteRunner.run(SuiteRunner.java:240)
	at org.testng.SuiteRunnerWorker.runSuite(SuiteRunnerWorker.java:52)
	at org.testng.SuiteRunnerWorker.run(SuiteRunnerWorker.java:86)
	at org.testng.TestNG.runSuitesSequentially(TestNG.java:1224)
	at org.testng.TestNG.runSuitesLocally(TestNG.java:1149)
	at org.testng.TestNG.run(TestNG.java:1057)
	at org.testng.TestNG.privateMain(TestNG.java:1364)
	at org.testng.TestNG.main(TestNG.java:1333)


===============================================
    Command line test
    Tests run: 2, Failures: 2, Skips: 0
===============================================


===============================================
foo
Total tests run: 2, Failures: 2, Skips: 0
===============================================

[TestNG] Time taken by org.testng.reporters.EmailableReporter2@79e8dd92: 12 ms
[TestNG] Time taken by org.testng.reporters.SuiteHTMLReporter@14f4189a: 24 ms
[TestNG] Time taken by org.testng.reporters.JUnitReportReporter@bb081e3: 12 ms
[TestNG] Time taken by org.testng.reporters.jq.Main@2d35dd72: 33 ms
[TestNG] Time taken by org.testng.reporters.XMLReporter@138bb3fd: 6 ms
[TestNG] Time taken by [FailedReporter passed=0 failed=0 skipped=0]: 9 ms
...................................................DEPRECATION: any_number_of_times is deprecated.
Use stub instead. Called from F:/hudson/hudson-slave/workspace/Buildr-ci-build-jruby-win32/spec/packaging/artifact_spec.rb:981:in
`(root)'.
DEPRECATION: any_number_of_times is deprecated. Use stub instead. Called from F:/hudson/hudson-slave/workspace/Buildr-ci-build-jruby-win32/spec/packaging/artifact_spec.rb:995:in
`(root)'.
..DEPRECATION: any_number_of_times is deprecated. Use stub instead. Called from F:/hudson/hudson-slave/workspace/Buildr-ci-build-jruby-win32/spec/packaging/artifact_spec.rb:995:in
`(root)'.
........
Time: 0.03s

Total: 1. Success!
...
Time: 0.014s

Total: 1. Success!
...........................................Error: Could not find or load main class org.example.NonExistentMain
.........................................DEPRECATION: any_number_of_times is deprecated. Use
stub instead. Called from F:/hudson/hudson-slave/workspace/Buildr-ci-build-jruby-win32/spec/packaging/artifact_spec.rb:942:in
`(root)'.
DEPRECATION: any_number_of_times is deprecated. Use stub instead. Called from F:/hudson/hudson-slave/workspace/Buildr-ci-build-jruby-win32/spec/packaging/artifact_spec.rb:956:in
`(root)'.
DEPRECATION: any_number_of_times is deprecated. Use stub instead. Called from F:/hudson/hudson-slave/workspace/Buildr-ci-build-jruby-win32/spec/packaging/artifact_spec.rb:956:in
`(root)'.
.............................................DEPRECATION: be_close(Fri Oct 11 23:53:37 +0100
2013, 10) is deprecated. Use be_within(10).of(Fri Oct 11 23:53:37 +0100 2013) instead. Called
from F:/hudson/hudson-slave/workspace/Buildr-ci-build-jruby-win32/spec/core/common_spec.rb:504:in
`(root)'.
......DEPRECATION: be_close(Sat Oct 12 00:10:18 +0100 2013, 10) is deprecated. Use be_within(10).of(Sat
Oct 12 00:10:18 +0100 2013) instead. Called from F:/hudson/hudson-slave/workspace/Buildr-ci-build-jruby-win32/spec/core/common_spec.rb:498:in
`(root)'.
........................................DEPRECATION: mock is deprecated. Use double instead.
Called from F:/hudson/hudson-slave/workspace/Buildr-ci-build-jruby-win32/spec/core/test_spec.rb:186:in
`(root)'.
.....DEPRECATION: mock is deprecated. Use double instead. Called from F:/hudson/hudson-slave/workspace/Buildr-ci-build-jruby-win32/spec/core/test_spec.rb:195:in
`(root)'.
.........................................................................................................DEPRECATION:
mock is deprecated. Use double instead. Called from F:/hudson/hudson-slave/workspace/Buildr-ci-build-jruby-win32/spec/core/transport_spec.rb:365:in
`(root)'.
DEPRECATION: mock is deprecated. Use double instead. Called from F:/hudson/hudson-slave/workspace/Buildr-ci-build-jruby-win32/spec/core/transport_spec.rb:365:in
`(root)'.
....DEPRECATION: mock is deprecated. Use double instead. Called from F:/hudson/hudson-slave/workspace/Buildr-ci-build-jruby-win32/spec/core/transport_spec.rb:365:in
`(root)'.
DEPRECATION: mock is deprecated. Use double instead. Called from F:/hudson/hudson-slave/workspace/Buildr-ci-build-jruby-win32/spec/core/transport_spec.rb:365:in
`(root)'.
DEPRECATION: mock is deprecated. Use double instead. Called from F:/hudson/hudson-slave/workspace/Buildr-ci-build-jruby-win32/spec/core/transport_spec.rb:365:in
`(root)'.
DEPRECATION: mock is deprecated. Use double instead. Called from F:/hudson/hudson-slave/workspace/Buildr-ci-build-jruby-win32/spec/core/transport_spec.rb:365:in
`(root)'.
....DEPRECATION: mock is deprecated. Use double instead. Called from F:/hudson/hudson-slave/workspace/Buildr-ci-build-jruby-win32/spec/core/transport_spec.rb:365:in
`(root)'.
DEPRECATION: mock is deprecated. Use double instead. Called from F:/hudson/hudson-slave/workspace/Buildr-ci-build-jruby-win32/spec/core/transport_spec.rb:365:in
`(root)'.
DEPRECATION: mock is deprecated. Use double instead. Called from F:/hudson/hudson-slave/workspace/Buildr-ci-build-jruby-win32/spec/core/transport_spec.rb:365:in
`(root)'.
..................................    [junit] Test FailingTest FAILED
........    [junit] Test FailingTest FAILED
......model contains 4 documentable templates
....    [junit] Test FailingTest FAILED
...........    [junit] Tests FAILED
.........    [junit] Test FailingTest FAILED
............[info] Compiling 1 Scala source and 1 Java source to F:\hudson\hudson-slave\workspace\Buildr-ci-build-jruby-win32\tmp\target\classes...
[info] Compile success at Oct 12, 2013 12:13:12 AM [20.797s]
.[info] Compiling 1 Scala source to F:\hudson\hudson-slave\workspace\Buildr-ci-build-jruby-win32\tmp\target\classes...
[info] Compile success at Oct 12, 2013 12:13:24 AM [8.967s]
..[info] Compiling 1 Scala source and 1 Java source to F:\hudson\hudson-slave\workspace\Buildr-ci-build-jruby-win32\tmp\target\classes...
[info] Compile success at Oct 12, 2013 12:13:34 AM [7.218s]
..[info] Compiling 1 Scala source to F:\hudson\hudson-slave\workspace\Buildr-ci-build-jruby-win32\tmp\target\dependency...
[info] Compile success at Oct 12, 2013 12:13:41 AM [5.535s]
[info] Compiling 1 Scala source to F:\hudson\hudson-slave\workspace\Buildr-ci-build-jruby-win32\tmp\target\classes...
[info] Compile success at Oct 12, 2013 12:13:47 AM [6.422s]
.[info] Compiling 1 Scala source to F:\hudson\hudson-slave\workspace\Buildr-ci-build-jruby-win32\tmp\target\classes...
[info] Compile success at Oct 12, 2013 12:13:55 AM [5.883s]
.........................................................................................

Failures:

  1) Buildr::Compiler::ExternalJavac should compile a Java project just in the same way javac
does externaljavac compiler should include tools.jar dependency
     Failure/Error: Unable to find matching line from backtrace
     RuntimeError:
       Failed to compile, see errors above
     # ./lib/buildr/java/external.rb:45:in `compile'
     # ./lib/buildr/core/compile.rb:256:in `initialize'
     # org/jruby/RubyProc.java:270:in `call'
     # org/jruby/RubyProc.java:220:in `call'
     # F:/hudson/tools/jruby-1.6.7/lib/ruby/gems/1.8/gems/rake-0.9.2.2/lib/rake/task.rb:203:in
`execute'
     # org/jruby/RubyArray.java:1615:in `each'
     # F:/hudson/tools/jruby-1.6.7/lib/ruby/gems/1.8/gems/rake-0.9.2.2/lib/rake/task.rb:200:in
`execute'
     # ./spec/spec_helpers.rb:154:in `execute'
     # ./lib/buildr/core/application.rb:662:in `invoke_with_call_chain'
     # ./lib/buildr/core/application.rb:660:in `invoke_with_call_chain'
     # F:/hudson/tools/jruby-1.6.7/lib/ruby/1.8/monitor.rb:191:in `mon_synchronize'
     # F:/hudson/tools/jruby-1.6.7/lib/ruby/1.8/monitor.rb:190:in `mon_synchronize'
     # ./lib/buildr/core/application.rb:648:in `invoke_with_call_chain'
     # ./lib/buildr/core/application.rb:643:in `invoke'
     # (eval):89:in `(root)'
     # org/jruby/RubyKernel.java:2045:in `instance_eval'
     # F:/hudson/tools/jruby-1.6.7/lib/ruby/gems/1.8/gems/rspec-core-2.14.5/lib/rspec/core/example.rb:114:in
`run'
     # F:/hudson/tools/jruby-1.6.7/lib/ruby/gems/1.8/gems/rspec-core-2.14.5/lib/rspec/core/example.rb:112:in
`run'
     # org/jruby/RubyProc.java:270:in `call'
     # org/jruby/RubyProc.java:220:in `call'
     # F:/hudson/tools/jruby-1.6.7/lib/ruby/gems/1.8/gems/rspec-core-2.14.5/lib/rspec/core/example.rb:179:in
`extended'
     # F:/hudson/tools/jruby-1.6.7/lib/ruby/gems/1.8/gems/rspec-retry-0.2.1/lib/rspec/retry.rb:28:in
`apply'
     # org/jruby/RubyFixnum.java:256:in `times'
     # F:/hudson/tools/jruby-1.6.7/lib/ruby/gems/1.8/gems/rspec-retry-0.2.1/lib/rspec/retry.rb:19:in
`apply'
     # org/jruby/RubyKernel.java:2062:in `instance_exec'
     # F:/hudson/tools/jruby-1.6.7/lib/ruby/gems/1.8/gems/rspec-core-2.14.5/lib/rspec/core/extensions/instance_eval_with_args.rb:16:in
`instance_eval_with_args'
     # F:/hudson/tools/jruby-1.6.7/lib/ruby/gems/1.8/gems/rspec-core-2.14.5/lib/rspec/core/example.rb:247:in
`instance_eval_with_args'
     # F:/hudson/tools/jruby-1.6.7/lib/ruby/gems/1.8/gems/rspec-core-2.14.5/lib/rspec/core/hooks.rb:106:in
`run'
     # org/jruby/RubyProc.java:270:in `call'
     # org/jruby/RubyProc.java:220:in `call'
     # F:/hudson/tools/jruby-1.6.7/lib/ruby/gems/1.8/gems/rspec-core-2.14.5/lib/rspec/core/hooks.rb:104:in
`run'
     # F:/hudson/tools/jruby-1.6.7/lib/ruby/gems/1.8/gems/rspec-core-2.14.5/lib/rspec/core/hooks.rb:446:in
`run_hook'
     # F:/hudson/tools/jruby-1.6.7/lib/ruby/gems/1.8/gems/rspec-core-2.14.5/lib/rspec/core/example_group.rb:340:in
`run_around_each_hooks'
     # F:/hudson/tools/jruby-1.6.7/lib/ruby/gems/1.8/gems/rspec-core-2.14.5/lib/rspec/core/example.rb:256:in
`with_around_each_hooks'
     # F:/hudson/tools/jruby-1.6.7/lib/ruby/gems/1.8/gems/rspec-core-2.14.5/lib/rspec/core/example.rb:111:in
`run'
     # F:/hudson/tools/jruby-1.6.7/lib/ruby/gems/1.8/gems/rspec-core-2.14.5/lib/rspec/core/example.rb:109:in
`run'
     # F:/hudson/tools/jruby-1.6.7/lib/ruby/gems/1.8/gems/rspec-core-2.14.5/lib/rspec/core/example_group.rb:390:in
`run_examples'
     # org/jruby/RubyArray.java:2331:in `collect'
     # F:/hudson/tools/jruby-1.6.7/lib/ruby/gems/1.8/gems/rspec-core-2.14.5/lib/rspec/core/example_group.rb:386:in
`run_examples'
     # F:/hudson/tools/jruby-1.6.7/lib/ruby/gems/1.8/gems/rspec-core-2.14.5/lib/rspec/core/example_group.rb:371:in
`run'
     # F:/hudson/tools/jruby-1.6.7/lib/ruby/gems/1.8/gems/rspec-core-2.14.5/lib/rspec/core/example_group.rb:369:in
`run'
     # F:/hudson/tools/jruby-1.6.7/lib/ruby/gems/1.8/gems/rspec-core-2.14.5/lib/rspec/core/example_group.rb:372:in
`run'
     # org/jruby/RubyArray.java:2331:in `collect'
     # F:/hudson/tools/jruby-1.6.7/lib/ruby/gems/1.8/gems/rspec-core-2.14.5/lib/rspec/core/example_group.rb:372:in
`run'
     # F:/hudson/tools/jruby-1.6.7/lib/ruby/gems/1.8/gems/rspec-core-2.14.5/lib/rspec/core/example_group.rb:369:in
`run'
     # F:/hudson/tools/jruby-1.6.7/lib/ruby/gems/1.8/gems/rspec-core-2.14.5/lib/rspec/core/example_group.rb:372:in
`run'
     # org/jruby/RubyArray.java:2331:in `collect'
     # F:/hudson/tools/jruby-1.6.7/lib/ruby/gems/1.8/gems/rspec-core-2.14.5/lib/rspec/core/example_group.rb:372:in
`run'
     # F:/hudson/tools/jruby-1.6.7/lib/ruby/gems/1.8/gems/rspec-core-2.14.5/lib/rspec/core/example_group.rb:369:in
`run'
     # F:/hudson/tools/jruby-1.6.7/lib/ruby/gems/1.8/gems/rspec-core-2.14.5/lib/rspec/core/command_line.rb:28:in
`run'
     # org/jruby/RubyArray.java:2331:in `collect'
     # F:/hudson/tools/jruby-1.6.7/lib/ruby/gems/1.8/gems/rspec-core-2.14.5/lib/rspec/core/command_line.rb:28:in
`run'
     # F:/hudson/tools/jruby-1.6.7/lib/ruby/gems/1.8/gems/rspec-core-2.14.5/lib/rspec/core/reporter.rb:58:in
`report'
     # F:/hudson/tools/jruby-1.6.7/lib/ruby/gems/1.8/gems/rspec-core-2.14.5/lib/rspec/core/command_line.rb:25:in
`run'
     # F:/hudson/tools/jruby-1.6.7/lib/ruby/gems/1.8/gems/rspec-core-2.14.5/lib/rspec/core/runner.rb:80:in
`run'
     # F:/hudson/tools/jruby-1.6.7/lib/ruby/gems/1.8/gems/rspec-core-2.14.5/lib/rspec/core/runner.rb:17:in
`autorun'
     # org/jruby/RubyProc.java:270:in `call'
     # org/jruby/RubyProc.java:224:in `call'

Finished in 27 minutes 48 seconds
2323 examples, 1 failure

Failed examples:

rspec (eval):84 # Buildr::Compiler::ExternalJavac should compile a Java project just in the
same way javac does externaljavac compiler should include tools.jar dependency

Failures:

  1) Buildr::Compiler::ExternalJavac should compile a Java project just in the same way javac
does externaljavac compiler should include tools.jar dependency
     Failure/Error: Unable to find matching line from backtrace
     RuntimeError:
       Failed to compile, see errors above
     # ./lib/buildr/java/external.rb:45:in `compile'
     # ./lib/buildr/core/compile.rb:256:in `initialize'
     # org/jruby/RubyProc.java:270:in `call'
     # org/jruby/RubyProc.java:220:in `call'
     # F:/hudson/tools/jruby-1.6.7/lib/ruby/gems/1.8/gems/rake-0.9.2.2/lib/rake/task.rb:203:in
`execute'
     # org/jruby/RubyArray.java:1615:in `each'
     # F:/hudson/tools/jruby-1.6.7/lib/ruby/gems/1.8/gems/rake-0.9.2.2/lib/rake/task.rb:200:in
`execute'
     # ./spec/spec_helpers.rb:154:in `execute'
     # ./lib/buildr/core/application.rb:662:in `invoke_with_call_chain'
     # ./lib/buildr/core/application.rb:660:in `invoke_with_call_chain'
     # F:/hudson/tools/jruby-1.6.7/lib/ruby/1.8/monitor.rb:191:in `mon_synchronize'
     # F:/hudson/tools/jruby-1.6.7/lib/ruby/1.8/monitor.rb:190:in `mon_synchronize'
     # ./lib/buildr/core/application.rb:648:in `invoke_with_call_chain'
     # ./lib/buildr/core/application.rb:643:in `invoke'
     # (eval):89:in `(root)'
     # org/jruby/RubyKernel.java:2045:in `instance_eval'
     # F:/hudson/tools/jruby-1.6.7/lib/ruby/gems/1.8/gems/rspec-core-2.14.5/lib/rspec/core/example.rb:114:in
`run'
     # F:/hudson/tools/jruby-1.6.7/lib/ruby/gems/1.8/gems/rspec-core-2.14.5/lib/rspec/core/example.rb:112:in
`run'
     # org/jruby/RubyProc.java:270:in `call'
     # org/jruby/RubyProc.java:220:in `call'
     # F:/hudson/tools/jruby-1.6.7/lib/ruby/gems/1.8/gems/rspec-core-2.14.5/lib/rspec/core/example.rb:179:in
`extended'
     # F:/hudson/tools/jruby-1.6.7/lib/ruby/gems/1.8/gems/rspec-retry-0.2.1/lib/rspec/retry.rb:28:in
`apply'
     # org/jruby/RubyFixnum.java:256:in `times'
     # F:/hudson/tools/jruby-1.6.7/lib/ruby/gems/1.8/gems/rspec-retry-0.2.1/lib/rspec/retry.rb:19:in
`apply'
     # org/jruby/RubyKernel.java:2062:in `instance_exec'
     # F:/hudson/tools/jruby-1.6.7/lib/ruby/gems/1.8/gems/rspec-core-2.14.5/lib/rspec/core/extensions/instance_eval_with_args.rb:16:in
`instance_eval_with_args'
     # F:/hudson/tools/jruby-1.6.7/lib/ruby/gems/1.8/gems/rspec-core-2.14.5/lib/rspec/core/example.rb:247:in
`instance_eval_with_args'
     # F:/hudson/tools/jruby-1.6.7/lib/ruby/gems/1.8/gems/rspec-core-2.14.5/lib/rspec/core/hooks.rb:106:in
`run'
     # org/jruby/RubyProc.java:270:in `call'
     # org/jruby/RubyProc.java:220:in `call'
     # F:/hudson/tools/jruby-1.6.7/lib/ruby/gems/1.8/gems/rspec-core-2.14.5/lib/rspec/core/hooks.rb:104:in
`run'
     # F:/hudson/tools/jruby-1.6.7/lib/ruby/gems/1.8/gems/rspec-core-2.14.5/lib/rspec/core/hooks.rb:446:in
`run_hook'
     # F:/hudson/tools/jruby-1.6.7/lib/ruby/gems/1.8/gems/rspec-core-2.14.5/lib/rspec/core/example_group.rb:340:in
`run_around_each_hooks'
     # F:/hudson/tools/jruby-1.6.7/lib/ruby/gems/1.8/gems/rspec-core-2.14.5/lib/rspec/core/example.rb:256:in
`with_around_each_hooks'
     # F:/hudson/tools/jruby-1.6.7/lib/ruby/gems/1.8/gems/rspec-core-2.14.5/lib/rspec/core/example.rb:111:in
`run'
     # F:/hudson/tools/jruby-1.6.7/lib/ruby/gems/1.8/gems/rspec-core-2.14.5/lib/rspec/core/example.rb:109:in
`run'
     # F:/hudson/tools/jruby-1.6.7/lib/ruby/gems/1.8/gems/rspec-core-2.14.5/lib/rspec/core/example_group.rb:390:in
`run_examples'
     # org/jruby/RubyArray.java:2331:in `collect'
     # F:/hudson/tools/jruby-1.6.7/lib/ruby/gems/1.8/gems/rspec-core-2.14.5/lib/rspec/core/example_group.rb:386:in
`run_examples'
     # F:/hudson/tools/jruby-1.6.7/lib/ruby/gems/1.8/gems/rspec-core-2.14.5/lib/rspec/core/example_group.rb:371:in
`run'
     # F:/hudson/tools/jruby-1.6.7/lib/ruby/gems/1.8/gems/rspec-core-2.14.5/lib/rspec/core/example_group.rb:369:in
`run'
     # F:/hudson/tools/jruby-1.6.7/lib/ruby/gems/1.8/gems/rspec-core-2.14.5/lib/rspec/core/example_group.rb:372:in
`run'
     # org/jruby/RubyArray.java:2331:in `collect'
     # F:/hudson/tools/jruby-1.6.7/lib/ruby/gems/1.8/gems/rspec-core-2.14.5/lib/rspec/core/example_group.rb:372:in
`run'
     # F:/hudson/tools/jruby-1.6.7/lib/ruby/gems/1.8/gems/rspec-core-2.14.5/lib/rspec/core/example_group.rb:369:in
`run'
     # F:/hudson/tools/jruby-1.6.7/lib/ruby/gems/1.8/gems/rspec-core-2.14.5/lib/rspec/core/example_group.rb:372:in
`run'
     # org/jruby/RubyArray.java:2331:in `collect'
     # F:/hudson/tools/jruby-1.6.7/lib/ruby/gems/1.8/gems/rspec-core-2.14.5/lib/rspec/core/example_group.rb:372:in
`run'
     # F:/hudson/tools/jruby-1.6.7/lib/ruby/gems/1.8/gems/rspec-core-2.14.5/lib/rspec/core/example_group.rb:369:in
`run'
     # F:/hudson/tools/jruby-1.6.7/lib/ruby/gems/1.8/gems/rspec-core-2.14.5/lib/rspec/core/command_line.rb:28:in
`run'
     # org/jruby/RubyArray.java:2331:in `collect'
     # F:/hudson/tools/jruby-1.6.7/lib/ruby/gems/1.8/gems/rspec-core-2.14.5/lib/rspec/core/command_line.rb:28:in
`run'
     # F:/hudson/tools/jruby-1.6.7/lib/ruby/gems/1.8/gems/rspec-core-2.14.5/lib/rspec/core/reporter.rb:58:in
`report'
     # F:/hudson/tools/jruby-1.6.7/lib/ruby/gems/1.8/gems/rspec-core-2.14.5/lib/rspec/core/command_line.rb:25:in
`run'
     # F:/hudson/tools/jruby-1.6.7/lib/ruby/gems/1.8/gems/rspec-core-2.14.5/lib/rspec/core/runner.rb:80:in
`run'
     # F:/hudson/tools/jruby-1.6.7/lib/ruby/gems/1.8/gems/rspec-core-2.14.5/lib/rspec/core/runner.rb:17:in
`autorun'
     # org/jruby/RubyProc.java:270:in `call'
     # org/jruby/RubyProc.java:224:in `call'

Randomized with seed 123

org.jruby.exceptions.RaiseException: (SystemExit) exit
F:/hudson/tools/jruby-1.6.7/bin/jruby.exe -S rspec spec/version_requirement_spec.rb spec/addon/bnd_spec.rb
spec/addon/drb_spec.rb spec/addon/jaxb_xjc_spec.rb spec/core/application_spec.rb spec/core/build_spec.rb
spec/core/cc_spec.rb spec/core/checks_spec.rb spec/core/common_spec.rb spec/core/compile_spec.rb
spec/core/console_spec.rb spec/core/doc_spec.rb spec/core/extension_spec.rb spec/core/generate_from_eclipse_spec.rb
spec/core/generate_spec.rb spec/core/project_spec.rb spec/core/run_spec.rb spec/core/shell_spec.rb
spec/core/test_spec.rb spec/core/transport_spec.rb spec/core/util_spec.rb spec/ide/eclipse_spec.rb
spec/ide/idea_spec.rb spec/java/ant_spec.rb spec/java/bdd_spec.rb spec/java/cobertura_spec.rb
spec/java/commands_spec.rb spec/java/compiler_spec.rb spec/java/doc_spec.rb spec/java/ecj_spec.rb
spec/java/emma_spec.rb spec/java/external_spec.rb spec/java/java_spec.rb spec/java/packaging_spec.rb
spec/java/pom_spec.rb spec/java/run_spec.rb spec/java/tests_spec.rb spec/packaging/archive_spec.rb
spec/packaging/artifact_namespace_spec.rb spec/packaging/artifact_spec.rb spec/packaging/packaging_spec.rb
spec/scala/bdd_spec.rb spec/scala/compiler_spec.rb spec/scala/doc_spec.rb spec/scala/tests_spec.rb
--order random:123 --format html --out _reports/specs.html --backtrace failed
Build step 'Execute Windows batch command' marked build as failure
Recording test results

Mime
View raw message