buildr-ci mailing list archives

Site index · List index
Message view « Date » · « Thread »
Top « Date » · « Thread »
From Apache Jenkins Server <jenk...@builds.apache.org>
Subject Build failed in Jenkins: Buildr-ci-build-jruby-win32 #210
Date Mon, 07 Oct 2013 01:03:09 GMT
See <https://builds.apache.org/job/Buildr-ci-build-jruby-win32/210/changes>

Changes:

[donaldp] Fixed regression using transitive dependencies due to presence of :scope option
in Artifacts.to_hash.

[donaldp] Note down the fix to the gwt addon

------------------------------------------
[...truncated 1416 lines...]
.foo-2.1.3.jar 2 1120
foo-bar-2.2.jar 1 982
.foo-2.1.3.jar 2 1120
foo-bar-2.2.jar 1 982
.foo-2.1.3.jar 2 1120
foo-bar-2.2.jar 1 982
.foo-2.1.3.jar 2 1120
foo-bar-2.2.jar 1 982
.foo-2.1.3.jar 2 1120
foo-bar-2.2.jar 1 982
.foo-2.1.3.jar 2 1120
foo-bar-2.2.jar 1 982
.foo-2.1.3.jar 30 46904
.foo-2.1.3.jar 30 46904
...foo-2.1.3.jar 1 846
foo-bar-2.2.jar 1 984
.backward compatibility: used 0.0.384 restoring 1.50.0
......................................DEPRECATION: be_close(Mon Oct 07 01:56:24 +0100 2013,
2) is deprecated. Use be_within(2).of(Mon Oct 07 01:56:24 +0100 2013) instead. Called from
F:/hudson/hudson-slave/workspace/Buildr-ci-build-jruby-win32/spec/core/compile_spec.rb:406:in
`(root)'.
...F:\hudson\hudson-slave\workspace\Buildr-ci-build-jruby-win32\tmp\failed.java:1: error:
class, interface, or enum expected
not a class
^
F:\hudson\hudson-slave\workspace\Buildr-ci-build-jruby-win32\tmp\failed.java:1: error: reached
end of file while parsing
not a class
           ^
2 errors
..DEPRECATION: be_close(Mon Oct 07 01:56:26 +0100 2013, 2) is deprecated. Use be_within(2).of(Mon
Oct 07 01:56:26 +0100 2013) instead. Called from F:/hudson/hudson-slave/workspace/Buildr-ci-build-jruby-win32/spec/core/compile_spec.rb:414:in
`(root)'.
...DEPRECATION: be_close(Mon Oct 07 01:56:37 +0100 2013, 2) is deprecated. Use be_within(2).of(Mon
Oct 07 01:56:37 +0100 2013) instead. Called from F:/hudson/hudson-slave/workspace/Buildr-ci-build-jruby-win32/spec/core/compile_spec.rb:399:in
`(root)'.
.........DEPRECATION: be_close(Mon Oct 07 01:56:30 +0100 2013, 2) is deprecated. Use be_within(2).of(Mon
Oct 07 01:56:30 +0100 2013) instead. Called from F:/hudson/hudson-slave/workspace/Buildr-ci-build-jruby-win32/spec/core/compile_spec.rb:432:in
`(root)'.
...DEPRECATION: be_close(Mon Oct 07 01:56:31 +0100 2013, 1) is deprecated. Use be_within(1).of(Mon
Oct 07 01:56:31 +0100 2013) instead. Called from F:/hudson/hudson-slave/workspace/Buildr-ci-build-jruby-win32/spec/core/compile_spec.rb:392:in
`(root)'.
...DEPRECATION: be_close(Mon Oct 07 01:56:42 +0100 2013, 10) is deprecated. Use be_within(10).of(Mon
Oct 07 01:56:42 +0100 2013) instead. Called from F:/hudson/hudson-slave/workspace/Buildr-ci-build-jruby-win32/spec/packaging/archive_spec.rb:348:in
`(root)'.
.....................................DEPRECATION: be_close(Mon Oct 07 01:55:11 +0100 2013,
10) is deprecated. Use be_within(10).of(Mon Oct 07 01:55:11 +0100 2013) instead. Called from
F:/hudson/hudson-slave/workspace/Buildr-ci-build-jruby-win32/spec/packaging/archive_spec.rb:372:in
`(root)'.
...............................model contains 4 documentable templates
...................................................................
Time: 0.018s

Total: 1. Success!
....
Time: 0.009s

Total: 1. Success!
...model contains 2 documentable templates
..............................Error: Could not find or load main class org.example.NonExistentMain
.............................DEPRECATION: be_close(Mon Oct 07 01:58:00 +0100 2013, 10) is
deprecated. Use be_within(10).of(Mon Oct 07 01:58:00 +0100 2013) instead. Called from F:/hudson/hudson-slave/workspace/Buildr-ci-build-jruby-win32/spec/packaging/archive_spec.rb:348:in
`(root)'.
..................................DEPRECATION: be_close(Mon Oct 07 01:56:28 +0100 2013, 10)
is deprecated. Use be_within(10).of(Mon Oct 07 01:56:28 +0100 2013) instead. Called from F:/hudson/hudson-slave/workspace/Buildr-ci-build-jruby-win32/spec/packaging/archive_spec.rb:372:in
`(root)'.
...................    [junit] Test FailingTest FAILED
........    [junit] Test FailingTest FAILED
..........................................................................................................................................................................................................................................................................................Buildfile:
F:\hudson\hudson-slave\workspace\Buildr-ci-build-jruby-win32\tmp\build.xml

dist:

BUILD SUCCESSFUL
Total time: 0 seconds
..Buildfile: F:\hudson\hudson-slave\workspace\Buildr-ci-build-jruby-win32\tmp\build.xml

dist:

BUILD SUCCESSFUL
Total time: 0 seconds
Creating destination directory: "F:/hudson/hudson-slave/workspace/Buildr-ci-build-jruby-win32/tmp/doc\"
Creating destination directory: "F:/hudson/hudson-slave/workspace/Buildr-ci-build-jruby-win32/tmp/doc\"
..Creating destination directory: "F:/hudson/hudson-slave/workspace/Buildr-ci-build-jruby-win32/tmp/doc\"
..............Note: F:\hudson\hudson-slave\workspace\Buildr-ci-build-jruby-win32\tmp\src\main\java\UseApt.java
uses or overrides a deprecated API.
Note: Recompile with -Xlint:deprecation for details.
..................................................................................................................................Run
starting. Expected test count is: 2
MySuite:
- list concatenation
- list concatenation using a test method
Run completed in 746 milliseconds.
Total number of tests run: 2
Suites: completed 1, aborted 0
Tests: succeeded 2, failed 0, ignored 0, pending 0
All tests passed.
.Run starting. Expected test count is: 1
PropertyTestSuite:
- testProperty
Run completed in 107 milliseconds.
Total number of tests run: 1
Suites: completed 1, aborted 0
Tests: succeeded 1, failed 0, ignored 0, pending 0
All tests passed.
....Run starting. Expected test count is: 1
InnerClassTest:
- addition
Run completed in 92 milliseconds.
Total number of tests run: 1
Suites: completed 1, aborted 0
Tests: succeeded 1, failed 0, ignored 0, pending 0
All tests passed.
.Run starting. Expected test count is: 1
PassingSuite:
- passing
Run completed in 126 milliseconds.
Total number of tests run: 1
Suites: completed 1, aborted 0
Tests: succeeded 1, failed 0, ignored 0, pending 0
All tests passed.
.Run starting. Expected test count is: 1
MySuite:
- addition
Run completed in 93 milliseconds.
Total number of tests run: 1
Suites: completed 1, aborted 0
Tests: succeeded 1, failed 0, ignored 0, pending 0
All tests passed.
..Run starting. Expected test count is: 1
FailingSuite:
- failing *** FAILED ***
  org.scalatest.exceptions.TestFailedException was thrown. (FailingSuite.scala:3)
Run completed in 107 milliseconds.
Total number of tests run: 1
Suites: completed 1, aborted 0
Tests: succeeded 0, failed 1, ignored 0, pending 0
*** 1 TEST FAILED ***
.Run starting. Expected test count is: 5
StringSuite:
- startsWith
- endsWith
- concat *** FAILED ***
  GeneratorDrivenPropertyCheckFailedException was thrown during property evaluation.
 (StringSuite.scala:17)
  Falsified after 0 successful property evaluations.
  Location: (StringSuite.scala:17)
  Occurred when passed generated values (
    arg0 = "",
    arg1 = ""
  )
- substring2
- substring3
Run completed in 662 milliseconds.
Total number of tests run: 5
Suites: completed 1, aborted 0
Tests: succeeded 4, failed 1, ignored 0, pending 0
*** 1 TEST FAILED ***
..Run starting. Expected test count is: 1
PassingSuite:
- passing
Run completed in 101 milliseconds.
Total number of tests run: 1
Suites: completed 1, aborted 0
Tests: succeeded 1, failed 0, ignored 0, pending 0
All tests passed.
.Run starting. Expected test count is: 1
PassingSuite:
- addition
Run completed in 100 milliseconds.
Total number of tests run: 1
Suites: completed 1, aborted 0
Tests: succeeded 1, failed 0, ignored 0, pending 0
All tests passed.
.Run starting. Expected test count is: 1
FailingSuite:
- failing *** FAILED ***
  org.scalatest.exceptions.TestFailedException was thrown. (FailingSuite.scala:3)
Run completed in 107 milliseconds.
Total number of tests run: 1
Suites: completed 1, aborted 0
Tests: succeeded 0, failed 1, ignored 0, pending 0
*** 1 TEST FAILED ***
...........................................................................................DEPRECATION:
mock is deprecated. Use double instead. Called from F:/hudson/hudson-slave/workspace/Buildr-ci-build-jruby-win32/spec/core/common_spec.rb:100:in
`(root)'.
DEPRECATION: mock is deprecated. Use double instead. Called from F:/hudson/hudson-slave/workspace/Buildr-ci-build-jruby-win32/spec/core/common_spec.rb:100:in
`(root)'.
DEPRECATION: mock is deprecated. Use double instead. Called from F:/hudson/hudson-slave/workspace/Buildr-ci-build-jruby-win32/spec/core/common_spec.rb:100:in
`(root)'.
.......DEPRECATION: mock is deprecated. Use double instead. Called from F:/hudson/hudson-slave/workspace/Buildr-ci-build-jruby-win32/spec/core/common_spec.rb:100:in
`(root)'.
DEPRECATION: mock is deprecated. Use double instead. Called from F:/hudson/hudson-slave/workspace/Buildr-ci-build-jruby-win32/spec/core/common_spec.rb:100:in
`(root)'.
DEPRECATION: mock is deprecated. Use double instead. Called from F:/hudson/hudson-slave/workspace/Buildr-ci-build-jruby-win32/spec/core/common_spec.rb:100:in
`(root)'.
DEPRECATION: mock is deprecated. Use double instead. Called from F:/hudson/hudson-slave/workspace/Buildr-ci-build-jruby-win32/spec/core/common_spec.rb:100:in
`(root)'.
DEPRECATION: mock is deprecated. Use double instead. Called from F:/hudson/hudson-slave/workspace/Buildr-ci-build-jruby-win32/spec/core/common_spec.rb:100:in
`(root)'.
DEPRECATION: mock is deprecated. Use double instead. Called from F:/hudson/hudson-slave/workspace/Buildr-ci-build-jruby-win32/spec/core/common_spec.rb:100:in
`(root)'.
DEPRECATION: mock is deprecated. Use double instead. Called from F:/hudson/hudson-slave/workspace/Buildr-ci-build-jruby-win32/spec/core/common_spec.rb:100:in
`(root)'.
........DEPRECATION: mock is deprecated. Use double instead. Called from F:/hudson/hudson-slave/workspace/Buildr-ci-build-jruby-win32/spec/core/common_spec.rb:100:in
`(root)'.
DEPRECATION: mock is deprecated. Use double instead. Called from F:/hudson/hudson-slave/workspace/Buildr-ci-build-jruby-win32/spec/core/common_spec.rb:100:in
`(root)'.
DEPRECATION: mock is deprecated. Use double instead. Called from F:/hudson/hudson-slave/workspace/Buildr-ci-build-jruby-win32/spec/core/common_spec.rb:100:in
`(root)'.
............................................................................................DEPRECATION:
mock is deprecated. Use double instead. Called from F:/hudson/hudson-slave/workspace/Buildr-ci-build-jruby-win32/spec/core/test_spec.rb:186:in
`(root)'.
....DEPRECATION: mock is deprecated. Use double instead. Called from F:/hudson/hudson-slave/workspace/Buildr-ci-build-jruby-win32/spec/core/test_spec.rb:195:in
`(root)'.
.........................................DEPRECATION: be_close(Mon Oct 07 02:02:39 +0100 2013,
2) is deprecated. Use be_within(2).of(Mon Oct 07 02:02:39 +0100 2013) instead. Called from
F:/hudson/hudson-slave/workspace/Buildr-ci-build-jruby-win32/spec/packaging/archive_spec.rb:593:in
`(root)'.
........

Failures:

  1) Buildr::JUnit report should clean after itself
     Failure/Error: lambda { task('clean').invoke }.should change { File.exist?(JUnit.report.target)
}.to(false)
       result should have been changed to false, but is now true
     # F:/hudson/tools/jruby-1.6.7/lib/ruby/gems/1.8/gems/rspec-expectations-2.14.3/lib/rspec/expectations/fail_with.rb:32:in
`fail_with'
     # F:/hudson/tools/jruby-1.6.7/lib/ruby/gems/1.8/gems/rspec-expectations-2.14.3/lib/rspec/expectations/handler.rb:36:in
`handle_matcher'
     # F:/hudson/tools/jruby-1.6.7/lib/ruby/gems/1.8/gems/rspec-expectations-2.14.3/lib/rspec/expectations/syntax.rb:53:in
`should'
     # ./spec/java/tests_spec.rb:313:in `(root)'
     # org/jruby/RubyKernel.java:2045:in `instance_eval'
     # F:/hudson/tools/jruby-1.6.7/lib/ruby/gems/1.8/gems/rspec-core-2.14.5/lib/rspec/core/example.rb:114:in
`run'
     # F:/hudson/tools/jruby-1.6.7/lib/ruby/gems/1.8/gems/rspec-core-2.14.5/lib/rspec/core/example.rb:112:in
`run'
     # F:/hudson/tools/jruby-1.6.7/lib/ruby/gems/1.8/gems/rspec-core-2.14.5/lib/rspec/core/example.rb:254:in
`with_around_each_hooks'
     # F:/hudson/tools/jruby-1.6.7/lib/ruby/gems/1.8/gems/rspec-core-2.14.5/lib/rspec/core/example.rb:111:in
`run'
     # F:/hudson/tools/jruby-1.6.7/lib/ruby/gems/1.8/gems/rspec-core-2.14.5/lib/rspec/core/example.rb:109:in
`run'
     # F:/hudson/tools/jruby-1.6.7/lib/ruby/gems/1.8/gems/rspec-core-2.14.5/lib/rspec/core/example_group.rb:390:in
`run_examples'
     # org/jruby/RubyArray.java:2331:in `collect'
     # F:/hudson/tools/jruby-1.6.7/lib/ruby/gems/1.8/gems/rspec-core-2.14.5/lib/rspec/core/example_group.rb:386:in
`run_examples'
     # F:/hudson/tools/jruby-1.6.7/lib/ruby/gems/1.8/gems/rspec-core-2.14.5/lib/rspec/core/example_group.rb:371:in
`run'
     # F:/hudson/tools/jruby-1.6.7/lib/ruby/gems/1.8/gems/rspec-core-2.14.5/lib/rspec/core/example_group.rb:369:in
`run'
     # F:/hudson/tools/jruby-1.6.7/lib/ruby/gems/1.8/gems/rspec-core-2.14.5/lib/rspec/core/command_line.rb:28:in
`run'
     # org/jruby/RubyArray.java:2331:in `collect'
     # F:/hudson/tools/jruby-1.6.7/lib/ruby/gems/1.8/gems/rspec-core-2.14.5/lib/rspec/core/command_line.rb:28:in
`run'
     # F:/hudson/tools/jruby-1.6.7/lib/ruby/gems/1.8/gems/rspec-core-2.14.5/lib/rspec/core/reporter.rb:58:in
`report'
     # F:/hudson/tools/jruby-1.6.7/lib/ruby/gems/1.8/gems/rspec-core-2.14.5/lib/rspec/core/command_line.rb:25:in
`run'
     # F:/hudson/tools/jruby-1.6.7/lib/ruby/gems/1.8/gems/rspec-core-2.14.5/lib/rspec/core/runner.rb:80:in
`run'
     # F:/hudson/tools/jruby-1.6.7/lib/ruby/gems/1.8/gems/rspec-core-2.14.5/lib/rspec/core/runner.rb:17:in
`autorun'
     # org/jruby/RubyProc.java:270:in `call'
     # org/jruby/RubyProc.java:224:in `call'

Finished in 16 minutes 37 seconds
2314 examples, 1 failure

Failed examples:

rspec ./spec/java/tests_spec.rb:311 # Buildr::JUnit report should clean after itself

Failures:

  1) Buildr::JUnit report should clean after itself
     Failure/Error: lambda { task('clean').invoke }.should change { File.exist?(JUnit.report.target)
}.to(false)
       result should have been changed to false, but is now true
     # F:/hudson/tools/jruby-1.6.7/lib/ruby/gems/1.8/gems/rspec-expectations-2.14.3/lib/rspec/expectations/fail_with.rb:32:in
`fail_with'
     # F:/hudson/tools/jruby-1.6.7/lib/ruby/gems/1.8/gems/rspec-expectations-2.14.3/lib/rspec/expectations/handler.rb:36:in
`handle_matcher'
     # F:/hudson/tools/jruby-1.6.7/lib/ruby/gems/1.8/gems/rspec-expectations-2.14.3/lib/rspec/expectations/syntax.rb:53:in
`should'
     # ./spec/java/tests_spec.rb:313:in `(root)'
     # org/jruby/RubyKernel.java:2045:in `instance_eval'
     # F:/hudson/tools/jruby-1.6.7/lib/ruby/gems/1.8/gems/rspec-core-2.14.5/lib/rspec/core/example.rb:114:in
`run'
     # F:/hudson/tools/jruby-1.6.7/lib/ruby/gems/1.8/gems/rspec-core-2.14.5/lib/rspec/core/example.rb:112:in
`run'
     # F:/hudson/tools/jruby-1.6.7/lib/ruby/gems/1.8/gems/rspec-core-2.14.5/lib/rspec/core/example.rb:254:in
`with_around_each_hooks'
     # F:/hudson/tools/jruby-1.6.7/lib/ruby/gems/1.8/gems/rspec-core-2.14.5/lib/rspec/core/example.rb:111:in
`run'
     # F:/hudson/tools/jruby-1.6.7/lib/ruby/gems/1.8/gems/rspec-core-2.14.5/lib/rspec/core/example.rb:109:in
`run'
     # F:/hudson/tools/jruby-1.6.7/lib/ruby/gems/1.8/gems/rspec-core-2.14.5/lib/rspec/core/example_group.rb:390:in
`run_examples'
     # org/jruby/RubyArray.java:2331:in `collect'
     # F:/hudson/tools/jruby-1.6.7/lib/ruby/gems/1.8/gems/rspec-core-2.14.5/lib/rspec/core/example_group.rb:386:in
`run_examples'
     # F:/hudson/tools/jruby-1.6.7/lib/ruby/gems/1.8/gems/rspec-core-2.14.5/lib/rspec/core/example_group.rb:371:in
`run'
     # F:/hudson/tools/jruby-1.6.7/lib/ruby/gems/1.8/gems/rspec-core-2.14.5/lib/rspec/core/example_group.rb:369:in
`run'
     # F:/hudson/tools/jruby-1.6.7/lib/ruby/gems/1.8/gems/rspec-core-2.14.5/lib/rspec/core/command_line.rb:28:in
`run'
     # org/jruby/RubyArray.java:2331:in `collect'
     # F:/hudson/tools/jruby-1.6.7/lib/ruby/gems/1.8/gems/rspec-core-2.14.5/lib/rspec/core/command_line.rb:28:in
`run'
     # Forg.jruby.exceptions.RaiseException: (SystemExit) exit
:/hudson/tools/jruby-1.6.7/lib/ruby/gems/1.8/gems/rspec-core-2.14.5/lib/rspec/core/reporter.rb:58:in
`report'
     # F:/hudson/tools/jruby-1.6.7/lib/ruby/gems/1.8/gems/rspec-core-2.14.5/lib/rspec/core/command_line.rb:25:in
`run'
     # F:/hudson/tools/jruby-1.6.7/lib/ruby/gems/1.8/gems/rspec-core-2.14.5/lib/rspec/core/runner.rb:80:in
`run'
     # F:/hudson/tools/jruby-1.6.7/lib/ruby/gems/1.8/gems/rspec-core-2.14.5/lib/rspec/core/runner.rb:17:in
`autorun'
     # org/jruby/RubyProc.java:270:in `call'
     # org/jruby/RubyProc.java:224:in `call'

Randomized with seed 123

F:/hudson/tools/jruby-1.6.7/bin/jruby.exe -S rspec spec/version_requirement_spec.rb spec/addon/bnd_spec.rb
spec/addon/drb_spec.rb spec/addon/jaxb_xjc_spec.rb spec/core/application_spec.rb spec/core/build_spec.rb
spec/core/cc_spec.rb spec/core/checks_spec.rb spec/core/common_spec.rb spec/core/compile_spec.rb
spec/core/doc_spec.rb spec/core/extension_spec.rb spec/core/generate_from_eclipse_spec.rb
spec/core/generate_spec.rb spec/core/project_spec.rb spec/core/run_spec.rb spec/core/shell_spec.rb
spec/core/test_spec.rb spec/core/transport_spec.rb spec/core/util_spec.rb spec/ide/eclipse_spec.rb
spec/ide/idea_spec.rb spec/java/ant_spec.rb spec/java/bdd_spec.rb spec/java/cobertura_spec.rb
spec/java/commands_spec.rb spec/java/compiler_spec.rb spec/java/doc_spec.rb spec/java/ecj_spec.rb
spec/java/emma_spec.rb spec/java/external_spec.rb spec/java/java_spec.rb spec/java/packaging_spec.rb
spec/java/pom_spec.rb spec/java/run_spec.rb spec/java/tests_spec.rb spec/packaging/archive_spec.rb
spec/packaging/artifact_namespace_spec.rb spec/packaging/artifact_spec.rb spec/packaging/packaging_spec.rb
spec/scala/bdd_spec.rb spec/scala/compiler_spec.rb spec/scala/doc_spec.rb spec/scala/tests_spec.rb
--order random:123 --format html --out _reports/specs.html --backtrace failed
Build step 'Execute Windows batch command' marked build as failure
Recording test results

Mime
View raw message