buildr-ci mailing list archives

Site index · List index
Message view « Date » · « Thread »
Top « Date » · « Thread »
From Apache Jenkins Server <jenk...@builds.apache.org>
Subject Build failed in Jenkins: Buildr-ci-build-jruby-win32 #186
Date Wed, 25 Sep 2013 13:02:30 GMT
See <https://builds.apache.org/job/Buildr-ci-build-jruby-win32/186/changes>

Changes:

[donaldp] Update some dependencies

------------------------------------------
[...truncated 2149 lines...]
DEPRECATION: stub! is deprecated. Use stub instead. Called from F:/hudson/hudson-slave/workspace/Buildr-ci-build-jruby-win32/spec/core/build_spec.rb:912:in
`(root)'.
DEPRECATION: stub! is deprecated. Use stub instead. Called from F:/hudson/hudson-slave/workspace/Buildr-ci-build-jruby-win32/spec/core/build_spec.rb:913:in
`(root)'.
DEPRECATION: stub! is deprecated. Use stub instead. Called from F:/hudson/hudson-slave/workspace/Buildr-ci-build-jruby-win32/spec/core/build_spec.rb:914:in
`(root)'.
DEPRECATION: stub! is deprecated. Use stub instead. Called from F:/hudson/hudson-slave/workspace/Buildr-ci-build-jruby-win32/spec/core/build_spec......rb:912:in
`(root)'.
DEPRECATION: stub! is deprecated. Use stub instead. Called from F:/hudson/hudson-slave/workspace/Buildr-ci-build-jruby-win32/spec/core/build_spec.rb:913:in
`(root)'.
DEPRECATION: stub! is deprecated. Use stub instead. Called from F:/hudson/hudson-slave/workspace/Buildr-ci-build-jruby-win32/spec/core/build_spec.rb:914:in
`(root)'.
DEPRECATION: stub! is deprecated. Use stub instead. Called from F:/hudson/hudson-slave/workspace/Buildr-ci-build-jruby-win32/spec/core/build_spec.rb:912:in
`(root)'.
DEPRECATION: stub! is deprecated. Use stub instead. Called from F:/hudson/hudson-slave/workspace/Buildr-ci-build-jruby-win32/spec/core/build_spec.rb:913:in
`(root)'.
DEPRECATION: stub! is deprecated. Use stub instead. Called from F:/hudson/hudson-slave/workspace/Buildr-ci-build-jruby-win32/spec/core/build_spec.rb:914:in
`(root)'.
DEPRECATION: stub! is deprecated. Use stub instead. Called from F:/hudson/hudson-slave/workspace/Buildr-ci-build-jruby-win32/spec/core/build_spec.rb:912:in
`(root)'.
DEPRECATION: stub! is deprecated. Use stub instead. Called from F:/hudson/hudson-slave/workspace/Buildr-ci-build-jruby-win32/spec/core/build_spec.rb:913:in
`(root)'.
DEPRECATION: stub! is deprecated. Use stub instead. Called from F:/hudson/hudson-slave/workspace/Buildr-ci-build-jruby-win32/spec/core/build_spec.rb:914:in
`(root)'.
DEPRECATION: stub! is deprecated. Use stub instead. Called from F:/hudson/hudson-slave/workspace/Buildr-ci-build-jruby-win32/spec/core/build_spec.rb:912:in
`(root)'.
DEPRECATION: stub! is deprecated. Use stub instead. Called from F:/hudson/hudson-slave/workspace/Buildr-ci-build-jruby-win32/spec/core/build_spec.rb:913:in
`(root)'.
DEPRECATION: stub! is deprecated. Use stub instead. Called from F:/hudson/hudson-slave/workspace/Buildr-ci-build-jruby-win32/spec/core/build_spec.rb:914:in
`(root)'.
DEPRECATION: stub! is deprecated. Use stub instead. Called from F:/hudson/hudson-slave/workspace/Buildr-ci-build-jruby-win32/spec/core/build_spec.rb:912:in
`(root)'.
DEPRECATION: stub! is deprecated. Us....e stub instead. Called from F:/hudson/hudson-slave/workspace/Buildr-ci-build-jruby-win32/spec/core/build_spec.rb:913:in
`(root)'.
DEPRECATION: stub! is deprecated. Use stub instead. Called from F:/hudson/hudson-slave/workspace/Buildr-ci-build-jruby-win32/spec/core/build_spec.rb:914:in
`(root)'.
DEPRECATION: stub! is deprecated. Use stub instead. Called from F:/hudson/hudson-slave/workspace/Buildr-ci-build-jruby-win32/spec/core/build_spec.rb:912:in
`(root)'.
DEPRECATION: stub! is deprecated. Use stub instead. Called from F:/hudson/hudson-slave/workspace/Buildr-ci-build-jruby-win32/spec/core/build_spec.rb:913:in
`(root)'.
DEPRECATION: stub! is deprecated. Use stub instead. Called from F:/hudson/hudson-slave/workspace/Buildr-ci-build-jruby-win32/spec/core/build_spec.rb:914:in
`(root)'.
DEPRECATION: stub! is deprecated. Use stub instead. Called from F:/hudson/hudson-slave/workspace/Buildr-ci-build-jruby-win32/spec/core/build_spec.rb:912:in
`(root)'.
DEPRECATION: stub! is deprecated. Use stub instead. Called from F:/hudson/hudson-slave/workspace/Buildr-ci-build-jruby-win32/spec/core/build_spec.rb:913:in
`(root)'.
DEPRECATION: stub! is deprecated. Use stub instead. Called from F:/hudson/hudson-slave/workspace/Buildr-ci-build-jruby-win32/spec/core/build_spec.rb:914:in
`(root)'.
DEPRECATION: stub! is deprecated. Use stub instead. Called from F:/hudson/hudson-slave/workspace/Buildr-ci-build-jruby-win32/spec/core/build_spec.rb:912:in
`(root)'.
DEPRECATION: stub! is deprecated. Use stub instead. Called from F:/hudson/hudson-slave/workspace/Buildr-ci-build-jruby-win32/spec/core/build_spec.rb:913:in
`(root)'.
DEPRECATION: stub! is deprecated. Use stub instead. Called from F:/hudson/hudson-slave/workspace/Buildr-ci-build-jruby-win32/spec/core/build_spec.rb:914:in
`(root)'.
DEPRECATION: stub! is deprecated. Use stub instead. Called from F:/hudson/hudson-slave/workspace/Buildr-ci-build-jruby-win32/spec/core/build_spec.rb:930:in
`(root)'.
DEPRECATION: stub! is deprecated. Use stub instead. Called from F:/hudson/hudson-slave/workspace/Buildr-ci-build-jruby-win32/spec/core/build_spec.rb:941:in
`(root)'.
DEPRECATION: stub! is deprecated. Use stub instead. Called from F:/hudson/hudson-slave/workspace/Buildr-ci-build-jruby-win32/spec/core/build_spec.rb:912:in
`(root)'.
DEPRECATION: stub! is deprecated. Use stub instead. Called from F:/hudson/hudson-slave/workspace/Buildr-ci-build-jruby-win32/spec/core/build_spec.rb:913:in
`(root)'.
DEPRECATION: stub! is deprecated. Use stub instead. Called from F:/hudson/hudson-slave/workspace/Buildr-ci-build-jruby-win32/spec/core/build_spec.rb:914:in
`(root)'.
DEPRECATION: stub! is deprecated. Use stub instead. Called from F:/hudson/hudson-slave/workspace/Buildr-ci-build-jruby-win32/spec/core/build_spec.rb:930:in
`(root)'.
DEPRECATION: stub! is deprecated. Use stub instead. Called from F:/hudson/hudson-slave/workspace/Buildr-ci-build-jruby-win32/spec/core/build_spec.rb:956:in
`(root)'.
DEPRECATION: stub! is deprecated. Use stub instead. Called from F:/hudson/hudson-slave/workspace/Buildr-ci-build-jruby-win32/spec/core/build_spec.rb:957:in
`(root)'.
DEPRECATION: stub! is deprecated. Use stub instead. Called from F:/hudson/hudson-slave/workspace/Buildr-ci-build-jruby-win32/spec/core/build_spec.rb:912:in
`(root)'.
DEPRECATION: stub! is deprecated. Use stub instead. Called from F:/hudson/hudson-slave/workspace/Buildr-ci-build-jruby-win32/spec/core/build_spec.rb:913:in
`(root)'.
DEPRECATION: stub! is deprecated. Use stub instead. Called from F:/hudson/hudson-slave/workspace/Buildr-ci-build-jruby-win32/spec/core/build_spec.rb:914:in
`(root)'.
DEPRECATION: stub! is deprecated. Use stub instead. Called from F:/hudson/hudson-slave/workspace/Buildr-ci-build-jruby-win32/spec/core/build_spec.rb:930:in
`(root)'.
DEPRECATION: stub! is deprecated. Use stub instead. Called from F:/hudson/hudson-slave/workspace/Buildr-ci-build-jruby-win32/spec/core/build_spec.rb:946:in
`(root)'.
DEPRECATION: stub! is deprecated. Use stub instead. Called from F:/hudson/hudson-slave/workspace/Buildr-ci-build-jruby-win32/spec/core/build_spec.rb.....:912:in
`(root)'.
DEPRECATION: stub! is deprecated. Use stub instead. Called from F:/hudson/hudson-slave/workspace/Buildr-ci-build-jruby-win32/spec/core/build_spec.rb:913:in
`(root)'.
DEPRECATION: stub! is deprecated. Use stub instead. Called from F:/hudson/hudson-slave/workspace/Buildr-ci-build-jruby-win32/spec/core/build_spec.rb:914:in
`(root)'.
DEPRECATION: stub! is deprecated. Use stub instead. Called from F:/hudson/hudson-slave/workspace/Buildr-ci-build-jruby-win32/spec/core/build_spec.rb:930:in
`(root)'.
DEPRECATION: stub! is deprecated. Use stub instead. Called from F:/hudson/hudson-slave/workspace/Buildr-ci-build-jruby-win32/spec/core/build_spec.rb:936:in
`(root)'.
DEPRECATION: stub! is deprecated. Use stub instead. Called from F:/hudson/hudson-slave/workspace/Buildr-ci-build-jruby-win32/spec/core/build_spec.rb:912:in
`(root)'.
DEPRECATION: stub! is deprecated. Use stub instead. Called from F:/hudson/hudson-slave/workspace/Buildr-ci-build-jruby-win32/spec/core/build_spec.rb:913:in
`(root)'.
DEPRECATION: stub! is deprecated. Use stub instead. Called from F:/hudson/hudson-slave/workspace/Buildr-ci-build-jruby-win32/spec/core/build_spec.rb:914:in
`(root)'.
DEPRECATION: stub! is deprecated. Use stub instead. Called from F:/hudson/hudson-slave/workspace/Buildr-ci-build-jruby-win32/spec/core/build_spec.rb:930:in
`(root)'.
DEPRECATION: stub! is deprecated. Use stub instead. Called from F:/hudson/hudson-slave/workspace/Buildr-ci-build-jruby-win32/spec/core/build_spec.rb:951:in
`(root)'.
.Run starting. Expected test count is: 2
MySuite:
- list concatenation
- list concatenation using a test method
Run completed in 698 milliseconds.
Total number of tests run: 2
Suites: completed 1, aborted 0
Tests: succeeded 2, failed 0, ignored 0, pending 0
All tests passed.
.Run starting. Expected test count is: 1
PropertyTestSuite:
- testProperty
Run completed in 95 milliseconds.
Total number of tests run: 1
Suites: completed 1, aborted 0
Tests: succeeded 1, failed 0, ignored 0, pending 0
All tests passed.
....Run starting. Expected test count is: 1
InnerClassTest:
- addition
Run completed in 108 milliseconds.
Total number of tests run: 1
Suites: completed 1, aborted 0
Tests: succeeded 1, failed 0, ignored 0, pending 0
All tests passed.
.Run starting. Expected test count is: 1
PassingSuite:
- passing
Run completed in 102 milliseconds.
Total number of tests run: 1
Suites: completed 1, aborted 0
Tests: succeeded 1, failed 0, ignored 0, pending 0
All tests passed.
.Run starting. Expected test count is: 1
MySuite:
- addition
Run completed in 227 milliseconds.
Total number of tests run: 1
Suites: completed 1, aborted 0
Tests: succeeded 1, failed 0, ignored 0, pending 0
All tests passed.
..Run starting. Expected test count is: 1
FailingSuite:
- failing *** FAILED ***
  org.scalatest.exceptions.TestFailedException was thrown. (FailingSuite.scala:3)
Run completed in 101 milliseconds.
Total number of tests run: 1
Suites: completed 1, aborted 0
Tests: succeeded 0, failed 1, ignored 0, pending 0
*** 1 TEST FAILED ***
.Run starting. Expected test count is: 5
StringSuite:
- startsWith
- endsWith
- concat *** FAILED ***
  GeneratorDrivenPropertyCheckFailedException was thrown during property evaluation.
 (StringSuite.scala:17)
  Falsified after 0 successful property evaluations.
  Location: (StringSuite.scala:17)
  Occurred when passed generated values (
    arg0 = "",
    arg1 = ""
  )
- substring2
- substring3
Run completed in 518 milliseconds.
Total number of tests run: 5
Suites: completed 1, aborted 0
Tests: succeeded 4, failed 1, ignored 0, pending 0
*** 1 TEST FAILED ***
..Run starting. Expected test count is: 1
PassingSuite:
- passing
Run completed in 100 milliseconds.
Total number of tests run: 1
Suites: completed 1, aborted 0
Tests: succeeded 1, failed 0, ignored 0, pending 0
All tests passed.
.Run starting. Expected test count is: 1
PassingSuite:
- addition
Run completed in 119 milliseconds.
Total number of tests run: 1
Suites: completed 1, aborted 0
Tests: succeeded 1, failed 0, ignored 0, pending 0
All tests passed.
.Run starting. Expected test count is: 1
FailingSuite:
- failing *** FAILED ***
  org.scalatest.exceptions.TestFailedException was thrown. (FailingSuite.scala:3)
Run completed in 101 milliseconds.
Total number of tests run: 1
Suites: completed 1, aborted 0
Tests: succeeded 0, failed 1, ignored 0, pending 0
*** 1 TEST FAILED ***
............................................................................................DEPRECATION:
mock is deprecated. Use double instead. Called from F:/hudson/hudson-slave/workspace/Buildr-ci-build-jruby-win32/spec/core/common_spec.rb:100:in
`(root)'.
DEPRECATION: stub! is deprecated. Use stub instead. Called from F:/hudson/hudson-slave/workspace/Buildr-ci-build-jruby-win32/spec/core/common_spec.rb:101:in
`(root)'.
DEPRECATION: mock is deprecated. Use double instead. Called from F:/hudson/hudson-slave/workspace/Buildr-ci-build-jruby-win32/spec/core/common_spec.rb:100:in
`(root)'.
DEPRECATION: stub! is deprecated. Use stub instead. Called from F:/hudson/hudson-slave/workspace/Buildr-ci-build-jruby-win32/spec/core/common_spec.rb:101:in
`(root)'.
....DEPRECATION: mock is deprecated. Use double instead. Called from F:/hudson/hudson-slave/workspace/Buildr-ci-build-jruby-win32/spec/core/common_spec.rb:100:in
`(root)'.
DEPRECATION: stub! is deprecated. Use stub instead. Called from F:/hudson/hudson-slave/workspace/Buildr-ci-build-jruby-win32/spec/core/common_spec.rb:101:in
`(root)'.
DEPRECATION: mock is deprecated. Use double instead. Called from F:/hudson/hudson-slave/workspace/Buildr-ci-build-jruby-win32/spec/core/common_spec.rb:100:in
`(root)'.
DEPRECATION: stub! is deprecated. Use stub instead. Called from F:/hudson/hudson-slave/workspace/Buildr-ci-build-jruby-win32/spec/core/common_spec.rb:101:in
`(root)'.
DEPRECATION: mock is deprecated. Use double instead. Called from F:/hudson/hudson-slave/workspace/Buildr-ci-build-jruby-win32/spec/core/common_spec.rb:100:in
`(root)'.
DEPRECATION: stub! is deprecated. Use stub instead. Called from F:/hudson/hudson-slave/workspace/Buildr-ci-build-jruby-win32/spec/core/common_spec.rb:101:in
`(root)'.
...DEPRECATION: mock is deprecated. Use double instead. Called from F:/hudson/hudson-slave/workspace/Buildr-ci-build-jruby-win32/spec/core/common_spec.rb:100:in
`(root)'.
DEPRECATION: stub! is deprecated. Use stub instead. Called from F:/hudson/hudson-slave/workspace/Buildr-ci-build-jruby-win32/spec/core/common_spec.rb:101:in
`(root)'.
DEPRECATION: mock is deprecated. Use double instead. Called from F:/hudson/hudson-slave/workspace/Buildr-ci-build-jruby-win32/spec/core/common_spec.rb:100:in
`(root)'.
DEPRECATION: stub! is deprecated. Use stub instead. Called from F:/hudson/hudson-slave/workspace/Buildr-ci-build-jruby-win32/spec/core/common_spec.rb:101:in
`(root)'.
DEPRECATION: mock is deprecated. Use double instead. Called from F:/hudson/hudson-slave/workspace/Buildr-ci-build-jruby-win32/spec/core/common_spec.rb:100:in
`(root)'.
DEPRECATION: stub! is deprecated. Use stub instead. Called from F:/hudson/hudson-slave/workspace/Buildr-ci-build-jruby-win32/spec/core/common_spec.rb:101:in
`(root)'.
DEPRECATION: mock is deprecated. Use double instead. Called from F:/hudson/hudson-slave/workspace/Buildr-ci-build-jruby-win32/spec/core/common_spec.rb:100:in
`(root)'.
DEPRECATION: stub! is deprecated. Use stub instead. Called from F:/hudson/hudson-slave/workspace/Buildr-ci-build-jruby-win32/spec/core/common_spec.rb:101:in
`(root)'.
DEPRECATION: mock is deprecated. Use double instead. Called from F:/hudson/hudson-slave/workspace/Buildr-ci-build-jruby-win32/spec/core/common_spec.rb:100:in
`(root)'.
DEPRECATION: stub! is deprecated. Use stub instead. Called from F:/hudson/hudson-slave/workspace/Buildr-ci-build-jruby-win32/spec/core/common_spec.rb:101:in
`(root)'.
DEPRECATION: mock is deprecated. Use double instead. Called from F:/hudson/hudson-slave/workspace/Buildr-ci-build-jruby-win32/spec/core/common_spec.rb:100:in
`(root)'.
DEPRECATION: stub! is deprecated. Use stub instead. Called from F:/hudson/hudson-slave/workspace/Buildr-ci-build-jruby-win32/spec/core/common_spec.rb:101:in
`(root)'.
DEPRECATION: mock is deprecated. Use d.....ouble instead. Called from F:/hudson/hudson-slave/workspace/Buildr-ci-build-jruby-win32/spec/core/common_spec.rb:100:in
`(root)'.
DEPRECATION: stub! is deprecated. Use stub instead. Called from F:/hudson/hudson-slave/workspace/Buildr-ci-build-jruby-win32/spec/core/common_spec.rb:101:in
`(root)'.
DEPRECATION: mock is deprecated. Use double instead. Called from F:/hudson/hudson-slave/workspace/Buildr-ci-build-jruby-win32/spec/core/common_spec.rb:100:in
`(root)'.
DEPRECATION: stub! is deprecated. Use stub instead. Called from F:/hudson/hudson-slave/workspace/Buildr-ci-build-jruby-win32/spec/core/common_spec.rb:101:in
`(root)'.
................................................................................................DEPRECATION:
mock is deprecated. Use double instead. Called from F:/hudson/hudson-slave/workspace/Buildr-ci-build-jruby-win32/spec/core/test_spec.rb:186:in
`(root)'.
...DEPRECATION: mock is deprecated. Use double instead. Called from F:/hudson/hudson-slave/workspace/Buildr-ci-build-jruby-win32/spec/core/test_spec.rb:195:in
`(root)'.
....................................DEPRECATION: be_close(Wed Sep 25 14:02:21 +0100 2013,
2) is deprecated. Use be_within(2).of(Wed Sep 25 14:02:21 +0100 2013) instead. Called from
F:/hudson/hudson-slave/workspace/Buildr-ci-build-jruby-win32/spec/packaging/archive_spec.rb:593:in
`(root)'.
............

Failures:

  1) Buildr::JUnit report should clean after itself
     Failure/Error: lambda { task('clean').invoke }.should change { File.exist?(JUnit.report.target)
}.to(false)
       result should have been changed to false, but is now true
     # F:/hudson/tools/jruby-1.6.7/lib/ruby/gems/1.8/gems/rspec-expectations-2.14.3/lib/rspec/expectations/fail_with.rb:32:in
`fail_with'
     # F:/hudson/tools/jruby-1.6.7/lib/ruby/gems/1.8/gems/rspec-expectations-2.14.3/lib/rspec/expectations/handler.rb:36:in
`handle_matcher'
     # F:/hudson/tools/jruby-1.6.7/lib/ruby/gems/1.8/gems/rspec-expectations-2.14.3/lib/rspec/expectations/syntax.rb:53:in
`should'
     # ./spec/java/tests_spec.rb:313:in `(root)'
     # org/jruby/RubyKernel.java:2045:in `instance_eval'
     # F:/hudson/tools/jruby-1.6.7/lib/ruby/gems/1.8/gems/rspec-core-2.14.5/lib/rspec/core/example.rb:114:in
`run'
     # F:/hudson/tools/jruby-1.6.7/lib/ruby/gems/1.8/gems/rspec-core-2.14.5/lib/rspec/core/example.rb:112:in
`run'
     # F:/hudson/tools/jruby-1.6.7/lib/ruby/gems/1.8/gems/rspec-core-2.14.5/lib/rspec/core/example.rb:254:in
`with_around_each_hooks'
     # F:/hudson/tools/jruby-1.6.7/lib/ruby/gems/1.8/gems/rspec-core-2.14.5/lib/rspec/core/example.rb:111:in
`run'
     # F:/hudson/tools/jruby-1.6.7/lib/ruby/gems/1.8/gems/rspec-core-2.14.5/lib/rspec/core/example.rb:109:in
`run'
     # F:/hudson/tools/jruby-1.6.7/lib/ruby/gems/1.8/gems/rspec-core-2.14.5/lib/rspec/core/example_group.rb:390:in
`run_examples'
     # org/jruby/RubyArray.java:2331:in `collect'
     # F:/hudson/tools/jruby-1.6.7/lib/ruby/gems/1.8/gems/rspec-core-2.14.5/lib/rspec/core/example_group.rb:386:in
`run_examples'
     # F:/hudson/tools/jruby-1.6.7/lib/ruby/gems/1.8/gems/rspec-core-2.14.5/lib/rspec/core/example_group.rb:371:in
`run'
     # F:/hudson/tools/jruby-1.6.7/lib/ruby/gems/1.8/gems/rspec-core-2.14.5/lib/rspec/core/example_group.rb:369:in
`run'
     # F:/hudson/tools/jruby-1.6.7/lib/ruby/gems/1.8/gems/rspec-core-2.14.5/lib/rspec/core/command_line.rb:28:in
`run'
     # org/jruby/RubyArray.java:2331:in `collect'
     # F:/hudson/tools/jruby-1.6.7/lib/ruby/gems/1.8/gems/rspec-core-2.14.5/lib/rspec/core/command_line.rb:28:in
`run'
     # F:/hudson/tools/jruby-1.6.7/lib/ruby/gems/1.8/gems/rspec-core-2.14.5/lib/rspec/core/reporter.rb:58:in
`report'
     # F:/hudson/tools/jruby-1.6.7/lib/ruby/gems/1.8/gems/rspec-core-2.14.5/lib/rspec/core/command_line.rb:25:in
`run'
     # F:/hudson/tools/jruby-1.6.7/lib/ruby/gems/1.8/gems/rspec-core-2.14.5/lib/rspec/core/runner.rb:80:in
`run'
     # F:/hudson/tools/jruby-1.6.7/lib/ruby/gems/1.8/gems/rspec-core-2.14.5/lib/rspec/core/runner.rb:17:in
`autorun'
     # org/jruby/RubyProc.java:270:in `call'
     # org/jruby/RubyProc.java:224:in `call'

Finished in 16 minutes 59 seconds
2276 examples, 1 failure

Failed examples:

rspec ./spec/java/tests_spec.rb:311 # Buildr::JUnit report should clean after itself

Failures:

  1) Buildr::JUnit report should clean after itself
     Failure/Error: lambda { task('clean').invoke }.should change { File.exist?(JUnit.report.target)
}.to(false)
       result should have been changed to false, but is now true
     # F:/hudson/tools/jruby-1.6.7/lib/ruby/gems/1.8/gems/rspec-expectations-2.14.3/lib/rspec/expectations/fail_with.rb:32:in
`fail_with'
     # F:/hudson/tools/jruby-1.6.7/lib/ruby/gems/1.8/gems/rspec-expectations-2.14.3/lib/rspec/expectations/handler.rb:36:in
`handle_matcher'
     # F:/hudson/tools/jruby-1.6.7/lib/ruby/gems/1.8/gems/rspec-expectations-2.14.3/lib/rspec/expectations/syntax.rb:53:in
`should'
     # ./spec/java/tests_spec.rb:313:in `(root)'
     # org/jruby/RubyKernel.java:2045:in `instance_eval'
     # F:/hudson/tools/jruby-1.6.7/lib/ruby/gems/1.8/gems/rspec-core-2.14.5/lib/rspec/core/example.rb:114:in
`run'
     # F:/hudson/tools/jruby-1.6.7/lib/ruby/gems/1.8/gems/rspec-core-2.14.5/lib/rspec/core/example.rb:112:in
`run'
     # F:/hudson/tools/jruby-1.6.7/lib/ruby/gems/1.8/gems/rspec-core-2.14.5/lib/rspec/core/example.rb:254:in
`with_around_each_hooks'
     # F:/hudson/tools/jruby-1.6.7/lib/ruby/gems/1.8/gems/rspec-core-2.14.5/lib/rspec/core/example.rb:111:in
`run'
     # F:/hudson/tools/jruby-1.6.7/lib/ruby/gems/1.8/gems/rspec-core-2.14.5/lib/rspec/core/example.rb:109:in
`run'
     # F:/hudson/tools/jruby-1.6.7/lib/ruby/gems/1.8/gems/rspec-core-2.14.5/lib/rspec/core/example_group.rb:390:in
`run_examples'
     # org/jruby/RubyArray.java:2331:in `collect'
     # F:/hudson/tools/jruby-1.6.7/lib/ruby/gems/1.8/gems/rspec-core-2.14.5/lib/rspec/core/example_group.rb:386:in
`run_examples'
     # F:/hudson/tools/jruby-1.6.7/lib/ruby/gems/1.8/gems/rspec-core-2.14.5/lib/rspec/core/example_group.rb:371:in
`run'
     # F:/hudson/tools/jruby-1.6.7/lib/ruby/gems/1.8/gems/rspec-core-2.14.5/lib/rspec/core/example_group.rb:369:in
`run'
     # F:/hudson/tools/jruby-1.6.7/lib/ruby/gems/1.8/gems/rspec-core-2.14.5/lib/rspec/core/command_line.rb:28:in
`run'
     # org/jruby/RubyArray.java:2331:in `collect'
     # F:/hudson/tools/jruby-1.6.7/lib/ruby/gems/1.8/gems/rspec-core-2.14.5/lib/rspec/core/command_line.rb:28:in
`run'
     # F:org.jruby.exceptions.RaiseException: (SystemExit) exit
/hudson/tools/jruby-1.6.7/lib/ruby/gems/1.8/gems/rspec-core-2.14.5/lib/rspec/core/reporter.rb:58:in
`report'
     # F:/hudson/tools/jruby-1.6.7/lib/ruby/gems/1.8/gems/rspec-core-2.14.5/lib/rspec/core/command_line.rb:25:in
`run'
     # F:/hudson/tools/jruby-1.6.7/lib/ruby/gems/1.8/gems/rspec-core-2.14.5/lib/rspec/core/runner.rb:80:in
`run'
     # F:/hudson/tools/jruby-1.6.7/lib/ruby/gems/1.8/gems/rspec-core-2.14.5/lib/rspec/core/runner.rb:17:in
`autorun'
     # org/jruby/RubyProc.java:270:in `call'
     # org/jruby/RubyProc.java:224:in `call'

Randomized with seed 123

F:/hudson/tools/jruby-1.6.7/bin/jruby.exe -S rspec spec/version_requirement_spec.rb spec/addon/bnd_spec.rb
spec/addon/drb_spec.rb spec/addon/jaxb_xjc_spec.rb spec/core/application_spec.rb spec/core/build_spec.rb
spec/core/cc_spec.rb spec/core/checks_spec.rb spec/core/common_spec.rb spec/core/compile_spec.rb
spec/core/doc_spec.rb spec/core/extension_spec.rb spec/core/generate_from_eclipse_spec.rb
spec/core/generate_spec.rb spec/core/project_spec.rb spec/core/run_spec.rb spec/core/shell_spec.rb
spec/core/test_spec.rb spec/core/transport_spec.rb spec/core/util_spec.rb spec/ide/eclipse_spec.rb
spec/ide/idea_spec.rb spec/java/ant_spec.rb spec/java/bdd_spec.rb spec/java/cobertura_spec.rb
spec/java/commands_spec.rb spec/java/compiler_spec.rb spec/java/doc_spec.rb spec/java/ecj_spec.rb
spec/java/emma_spec.rb spec/java/external_spec.rb spec/java/java_spec.rb spec/java/packaging_spec.rb
spec/java/pom_spec.rb spec/java/run_spec.rb spec/java/tests_spec.rb spec/packaging/archive_spec.rb
spec/packaging/artifact_namespace_spec.rb spec/packaging/artifact_spec.rb spec/packaging/packaging_spec.rb
spec/scala/bdd_spec.rb spec/scala/compiler_spec.rb spec/scala/doc_spec.rb spec/scala/tests_spec.rb
--order random:123 --format html --out _reports/specs.html --backtrace failed
Build step 'Execute Windows batch command' marked build as failure
Recording test results

Mime
View raw message