buildr-ci mailing list archives

Site index · List index
Message view « Date » · « Thread »
Top « Date » · « Thread »
From Apache Jenkins Server <jenk...@builds.apache.org>
Subject Build failed in Jenkins: Buildr-ci-build-jruby-jdk1.5 #17
Date Tue, 25 Sep 2012 05:30:53 GMT
See <https://builds.apache.org/job/Buildr-ci-build-jruby-jdk1.5/17/changes>

Changes:

[donaldp] Update rjb dependency (1.4.1 > 1.4.0)

------------------------------------------
[...truncated 471 lines...]
[org.testng.internal.PoolService] Shutting down poolservice org.testng.internal.PoolService@3d66aa18
terminated:false
"[\"./src\", \"./home\", \"./src/test\", \"./src/test/java\", \"./src/test/java/PassingTest.java\"]"
"[\"./reports\", \"./src\", \"./target\", \"./home\", \"./reports/multitest\", \"./reports/multitest/index.html\",
\"./reports/multitest/foo\", \"./reports/multitest/emailable-report.html\", \"./reports/multitest/last_successful_run\",
\"./reports/multitest/testng-results.xml\", \"./reports/multitest/testng.css\", \"./reports/multitest/foo/reporter-output.html\",
\"./reports/multitest/foo/index.html\", \"./reports/multitest/foo/methods-alphabetical.html\",
\"./reports/multitest/foo/methods.html\", \"./reports/multitest/foo/methods-not-run.html\",
\"./reports/multitest/foo/groups.html\", \"./reports/multitest/foo/Command line test.properties\",
\"./reports/multitest/foo/Command line test.html\", \"./reports/multitest/foo/testng.xml.html\",
\"./reports/multitest/foo/classes.html\", \"./reports/multitest/foo/main.html\", \"./reports/multitest/foo/Command
line test.xml\", \"./reports/multitest/foo/toc.html\", \"./[Parser] Running:
  foo


===============================================
    Command line test
    Tests run: 0, Failures: 0, Skips: 0
===============================================


===============================================
foo
Total tests run: 0, Failures: 0, Skips: 0
===============================================

[org.testng.internal.PoolService] Shutting down poolservice org.testng.internal.PoolService@5a77a7f9
terminated:false
src/test\", \"./src/test/java\", \"./src/test/java/PassingTest.java\", \"./target/test\",
\"./target/test/classes\", \"./target/test/classes/PassingTest.class\"]"
..[Parser] Running:
  foo

PASSED: annotated

===============================================
    Command line test
    Tests run: 1, Failures: 0, Skips: 0
===============================================


===============================================
foo
Total tests run: 1, Failures: 0, Skips: 0
===============================================

[org.testng.internal.PoolService] Shutting down poolservice org.testng.internal.PoolService@31f26605
terminated:false
..**......
Time: 0.0070s

Total: 1. Success!
..
Time: 0.0080s

Total: 1. Success!
........................................................................All checks passed.
.........mkdir -p <https://builds.apache.org/job/Buildr-ci-build-jruby-jdk1.5/ws/tmp/home>
mkdir -p <https://builds.apache.org/job/Buildr-ci-build-jruby-jdk1.5/ws/tmp/home/.buildr>
.........................................................................................<https://builds.apache.org/job/Buildr-ci-build-jruby-jdk1.5/ws/tmp/failed.java>:1:
'class' or 'interface' expected
not a class
^
<https://builds.apache.org/job/Buildr-ci-build-jruby-jdk1.5/ws/tmp/failed.java>:1: <identifier>
expected
not a class
           ^
2 errors
............................................................javadoc: error - No public or
protected classes found to document.
1 error
......................................................................................................................F"unexpected
exception #<Errno::ENOENT: No such file or directory - <https://builds.apache.org/job/Buildr-ci-build-jruby-jdk1.5/ws/tmp/foo/src/main/java>">
"\"org/jruby/RubyFile.java:1615:in `mtime'\\n<https://builds.apache.org/job/Buildr-ci-build-jruby-jdk1.5/ws/lib/buildr/core/cc.rb>:74:in
`monitor_and_compile'\\norg/jruby/RubyArray.java:1615:in `each'\\n<https://builds.apache.org/job/Buildr-ci-build-jruby-jdk1.5/ws/lib/buildr/core/cc.rb>:70:in
`monitor_and_compile'\\norg/jruby/RubyProc.java:270:in `call'\\norg/jruby/RubyProc.java:220:in
`call'\\n<https://builds.apache.org/job/Buildr-ci-build-jruby-jdk1.5/ws/lib/buildr/core/cc.rb>:85:in
`monitor_and_compile'\\n<https://builds.apache.org/job/Buildr-ci-build-jruby-jdk1.5/ws/lib/buildr/core/cc.rb>:25:in
`initialize'\\norg/jruby/RubyProc.java:270:in `call'\\norg/jruby/RubyProc.java:220:in `call'\\n/home/hudson/.rvm/gems/jruby-1.6.7@global/gems/rake-0.9.2.2/lib/rake/task.rb:205:in
`execute'\\norg/jruby/RubyArray.java:1615:in `each'\\n/home/hudson/.rvm/gems/jruby-1.6.7@global/gems/rake-0.9.2.2/lib/rake/task.rb:200:in
`execute'\\n<https://builds.apache.org/job/Buildr-ci-build-jruby-jdk1.5/ws/spec/spec_helpers.rb>:154:in
`execute'\\n<https://builds.apache.org/job/Buildr-ci-build-jruby-jdk1.5/ws/lib/buildr/core/application.rb>:673:in
`invoke_with_call_chain'\\n<https://builds.apache.org/job/Buildr-ci-build-jruby-jdk1.5/ws/lib/buildr/core/application.rb>:671:in
`invoke_with_call_chain'\\n/home/hudson/.rvm/rubies/jruby-1.6.7/lib/ruby/1.8/monitor.rb:191:in
`mon_synchronize'\\n/home/hudson/.rvm/rubies/jruby-1.6.7/lib/ruby/1.8/monitor.rb:190:in `mon_synchronize'\\n<https://builds.apache.org/job/Buildr-ci-build-jruby-jdk1.5/ws/lib/buildr/core/application.rb>:659:in
`invoke_with_call_chain'\\n<https://builds.apache.org/job/Buildr-ci-build-jruby-jdk1.5/ws/lib/buildr/core/application.rb>:654:in
`invoke'\\n<https://builds.apache.org/job/Buildr-ci-build-jruby-jdk1.5/ws/spec/core/cc_spec.rb>:138:in
`(root)'\\norg/jruby/RubyProc.java:270:in `call'\\norg/jruby/RubyProc.java:224:in `call'\""
mkdir -p <https://builds.apache.org/job/Buildr-ci-build-jruby-jdk1.5/ws/tmp/home>
mkdir -p <https://builds.apache.org/job/Buildr-ci-build-jruby-jdk1.5/ws/tmp/home/.buildr>
mkdir -p <https://builds.apache.org/job/Buildr-ci-build-jruby-jdk1.5/ws/tmp/home>
mkdir -p <https://builds.apache.org/job/Buildr-ci-build-jruby-jdk1.5/ws/tmp/home/.buildr>
mkdir -p <https://builds.apache.org/job/Buildr-ci-build-jruby-jdk1.5/ws/tmp/home>
mkdir -p <https://builds.apache.org/job/Buildr-ci-build-jruby-jdk1.5/ws/tmp/home/.buildr>
rm -rf <https://builds.apache.org/job/Buildr-ci-build-jruby-jdk1.5/ws/tmp/reports/junit>
rm -rf <https://builds.apache.org/job/Buildr-ci-build-jruby-jdk1.5/ws/tmp/target/junit-failed>
mkdir -p <https://builds.apache.org/job/Buildr-ci-build-jruby-jdk1.5/ws/tmp/reports/junit>
touch <https://builds.apache.org/job/Buildr-ci-build-jruby-jdk1.5/ws/tmp/reports/junit/last_successful_run>
rm -rf <https://builds.apache.org/job/Buildr-ci-build-jruby-jdk1.5/ws/tmp/reports/junit>
rm -rf <https://builds.apache.org/job/Buildr-ci-build-jruby-jdk1.5/ws/tmp/target/junit-failed>
mkdir -p <https://builds.apache.org/job/Buildr-ci-build-jruby-jdk1.5/ws/tmp/target>
rm -rf <https://builds.apache.org/job/Buildr-ci-build-jruby-jdk1.5/ws/tmp/reports/junit>
rm -rf <https://builds.apache.org/job/Buildr-ci-build-jruby-jdk1.5/ws/tmp/target/junit-failed>
mkdir -p <https://builds.apache.org/job/Buildr-ci-build-jruby-jdk1.5/ws/tmp/target>
    [junit] Test FailingTest FAILED
    [junit] Test FailingTest FAILED
** Execute (dry run) <https://builds.apache.org/job/Buildr-ci-build-jruby-jdk1.5/ws/tmp/home/.m2/repository/com/example/library/2.0/library-2.0.jar>
** Execute (dry run) <https://builds.apache.org/job/Buildr-ci-build-jruby-jdk1.5/ws/tmp/home/.m2/repository/com/example/library/2.0/library-2.0-all.jar>
     0 Tue Sep 25 05:29:20 UTC 2012 test/
    21 Tue Sep 25 05:29:20 UTC 2012 test/Test1.txt
     0 Tue Sep 25 05:29:20 UTC 2012 test/EmptyDir2/
    22 Tue Sep 25 05:29:20 UTC 2012 test/Text2.html
     0 Tue Sep 25 05:29:20 UTC 2012 test/EmptyDir1/
    21 Tue Sep 25 05:29:20 UTC 2012 Test1.txt
     0 Tue Sep 25 05:29:20 UTC 2012 EmptyDir2/
    22 Tue Sep 25 05:29:20 UTC 2012 Text2.html
     0 Tue Sep 25 05:29:20 UTC 2012 EmptyDir1/
     0 Tue Sep 25 05:29:20 UTC 2012 code/
    21 Tue Sep 25 05:29:20 UTC 2012 code/Test1.txt
    22 Tue Sep 25 05:29:20 UTC 2012 code/Text2.html
     0 Tue Sep 25 05:29:22 UTC 2012 code/
    21 Tue Sep 25 05:29:22 UTC 2012 code/Test1.txt
     0 Tue Sep 25 05:29:22 UTC 2012 code/EmptyDir2/
    22 Tue Sep 25 05:29:22 UTC 2012 code/Text2.html
     0 Tue Sep 25 05:29:22 UTC 2012 code/EmptyDir1/
    21 Tue Sep 25 05:29:24 UTC 2012 Test1.txt
    22 Tue Sep 25 05:29:24 UTC 2012 Text2.html
    21 Tue Sep 25 05:29:24 UTC 2012 Test1.txt
    22 Tue Sep 25 05:29:24 UTC 2012 Text2.html
     0 Tue Sep 25 05:29:24 UTC 2012 included
    11 Tue Sep 25 05:29:26 UTC 2012 library-1.0.txt
    22 Tue Sep 25 05:29:26 UTC 2012 p1-1.0.zip
     0 Tue Sep 25 05:29:26 UTC 2012 test/
    21 Tue Sep 25 05:29:26 UTC 2012 test/Test1.txt
     0 Tue Sep 25 05:29:26 UTC 2012 test/EmptyDir2/
    22 Tue Sep 25 05:29:26 UTC 2012 test/Text2.html
     0 Tue Sep 25 05:29:26 UTC 2012 test/EmptyDir1/
    21 Tue Sep 25 05:29:26 UTC 2012 Test1.txt
     0 Tue Sep 25 05:29:28 UTC 2012 test/
    21 Tue Sep 25 05:29:28 UTC 2012 test/Test1.txt
     0 Tue Sep 25 05:29:28 UTC 2012 test/EmptyDir2/
     0 Tue Sep 25 05:29:28 UTC 2012 test/EmptyDir1/
    21 Tue Sep 25 05:29:28 UTC 2012 Test1.txt
     0 Tue Sep 25 05:29:28 UTC 2012 EmptyDir2/
     0 Tue Sep 25 05:29:28 UTC 2012 EmptyDir1/
     0 Tue Sep 25 05:29:28 UTC 2012 test/
    21 Tue Sep 25 05:29:28 UTC 2012 test/Test1.txt
     0 Tue Sep 25 05:29:28 UTC 2012 test/EmptyDir2/
    22 Tue Sep 25 05:29:28 UTC 2012 test/Text2.html
     0 Tue Sep 25 05:29:28 UTC 2012 test/EmptyDir1/
     0 Tue Sep 25 05:29:28 UTC 2012 test/
    21 Tue Sep 25 05:29:28 UTC 2012 test/Test1.txt
     0 Tue Sep 25 05:29:28 UTC 2012 test/EmptyDir2/
     0 Tue Sep 25 05:29:28 UTC 2012 test/file.txt
    22 Tue Sep 25 05:29:28 UTC 2012 test/Text2.html
     0 Tue Sep 25 05:29:28 UTC 2012 test/EmptyDir1/
     0 Tue Sep 25 05:29:30 UTC 2012 code/
    21 Tue Sep 25 05:29:30 UTC 2012 code/Test1.txt
    22 Tue Sep 25 05:29:30 UTC 2012 code/Text2.html
     0 Tue Sep 25 05:29:30 UTC 2012 test/
    21 Tue Sep 25 05:29:30 UTC 2012 test/Test1.txt
     0 Tue Sep 25 05:29:30 UTC 2012 test/EmptyDir2/
    22 Tue Sep 25 05:29:30 UTC 2012 test/Text2.html
     0 Tue Sep 25 05:29:30 UTC 2012 test/EmptyDir1/
     0 Tue Sep 25 05:29:30 UTC 2012 code/
    21 Tue Sep 25 05:29:30 UTC 2012 code/Test1.txt
    22 Tue Sep 25 05:29:30 UTC 2012 code/Text2.html
     0 Tue Sep 25 05:29:30 UTC 2012 code/
     0 Tue Sep 25 05:29:30 UTC 2012 code/test/
    21 Tue Sep 25 05:29:30 UTC 2012 code/test/Test1.txt
     0 Tue Sep 25 05:29:30 UTC 2012 code/test/EmptyDir2/
    22 Tue Sep 25 05:29:30 UTC 2012 code/test/Text2.html
     0 Tue Sep 25 05:29:30 UTC 2012 code/test/EmptyDir1/
     0 Tue Sep 25 05:29:32 UTC 2012 test/
    21 Tue Sep 25 05:29:32 UTC 2012 test/sample
    21 Tue Sep 25 05:29:32 UTC 2012 Test1.txt
     0 Tue Sep 25 05:29:32 UTC 2012 EmptyDir2/
    22 Tue Sep 25 05:29:32 UTC 2012 Text2.html
     0 Tue Sep 25 05:29:32 UTC 2012 EmptyDir1/
     0 Tue Sep 25 05:29:34 UTC 2012 test/
    21 Tue Sep 25 05:29:34 UTC 2012 test/Test1.txt
     0 Tue Sep 25 05:29:34 UTC 2012 test/EmptyDir2/
    22 Tue Sep 25 05:29:34 UTC 2012 test/Text2.html
     0 Tue Sep 25 05:29:34 UTC 2012 test/EmptyDir1/
     0 Tue Sep 25 05:29:34 UTC 2012 path/
     0 Tue Sep 25 05:29:34 UTC 2012 path/test/
    21 Tue Sep 25 05:29:34 UTC 2012 path/test/sample
     0 Tue Sep 25 05:29:34 UTC 2012 test/
    21 Tue Sep 25 05:29:34 UTC 2012 test/Test1.txt
     0 Tue Sep 25 05:29:34 UTC 2012 test/EmptyDir2/
    22 Tue Sep 25 05:29:34 UTC 2012 test/Text2.html
     0 Tue Sep 25 05:29:34 UTC 2012 test/EmptyDir1/
    15 Tue Sep 25 05:29:34 UTC 2012 test/.config
     0 Tue Sep 25 05:29:34 UTC 2012 code/
    21 Tue Sep 25 05:29:34 UTC 2012 code/Test1.txt
     0 Tue Sep 25 05:29:34 UTC 2012 code/EmptyDir2/
    22 Tue Sep 25 05:29:34 UTC 2012 code/Text2.html
     0 Tue Sep 25 05:29:34 UTC 2012 code/EmptyDir1/
     0 Tue Sep 25 05:29:34 UTC 2012 path/
     0 Tue Sep 25 05:29:34 UTC 2012 path/code/
    21 Tue Sep 25 05:29:34 UTC 2012 path/code/Test1.txt
     0 Tue Sep 25 05:29:34 UTC 2012 path/code/EmptyDir2/
    22 Tue Sep 25 05:29:34 UTC 2012 path/code/Text2.html
     0 Tue Sep 25 05:29:34 UTC 2012 path/code/EmptyDir1/
    21 Tue Sep 25 05:29:36 UTC 2012 Test1.txt
     0 Tue Sep 25 05:29:36 UTC 2012 EmptyDir2/
    22 Tue Sep 25 05:29:36 UTC 2012 Text2.html
     0 Tue Sep 25 05:29:36 UTC 2012 EmptyDir1/
     0 Tue Sep 25 05:29:36 UTC 2012 path/
    21 Tue Sep 25 05:29:36 UTC 2012 path/Test1.txt
     0 Tue Sep 25 05:29:36 UTC 2012 path/EmptyDir2/
    22 Tue Sep 25 05:29:36 UTC 2012 path/Text2.html
     0 Tue Sep 25 05:29:36 UTC 2012 path/EmptyDir1/
    21 Tue Sep 25 05:29:36 UTC 2012 Test1.txt
    22 Tue Sep 25 05:29:36 UTC 2012 Text2.html
    21 Tue Sep 25 05:29:38 UTC 2012 Test1.txt
    22 Tue Sep 25 05:29:38 UTC 2012 Text2.html
     0 Tue Sep 25 05:29:38 UTC 2012 test/
    21 Tue Sep 25 05:29:38 UTC 2012 test/Test1.txt
    22 Tue Sep 25 05:29:38 UTC 2012 test/Text2.html
     0 Tue Sep 25 05:29:38 UTC 2012 test/
    21 Tue Sep 25 05:29:38 UTC 2012 test/Test1.txt
    22 Tue Sep 25 05:29:38 UTC 2012 test/Text2.html
    21 Tue Sep 25 05:29:40 UTC 2012 Test1.txt
    22 Tue Sep 25 05:29:40 UTC 2012 Text2.html
    21 Tue Sep 25 05:29:40 UTC 2012 Test1.txt
    22 Tue Sep 25 05:29:40 UTC 2012 Text2.html
    21 Tue Sep 25 05:29:40 UTC 2012 Test1.txt
    22 Tue Sep 25 05:29:40 UTC 2012 Text2.html
    21 Tue Sep 25 05:29:40 UTC 2012 Test1.txt
     0 Tue Sep 25 05:29:40 UTC 2012 EmptyDir2/
    22 Tue Sep 25 05:29:40 UTC 2012 Text2.html
     0 Tue Sep 25 05:29:40 UTC 2012 subdir/
     0 Tue Sep 25 05:29:40 UTC 2012 EmptyDir1/
    15 Tue Sep 25 05:29:40 UTC 2012 subdir/test3.css
    21 Tue Sep 25 05:29:42 UTC 2012 Test1.txt
    22 Tue Sep 25 05:29:42 UTC 2012 Text2.html
    15 Tue Sep 25 05:29:42 UTC 2012 Test1.txt
    22 Tue Sep 25 05:29:42 UTC 2012 Text2.html
    22 Tue Sep 25 05:29:42 UTC 2012 Text2.html
mkdir -p <https://builds.apache.org/job/Buildr-ci-build-jruby-jdk1.5/ws/tmp/home>
mkdir -p <https://builds.apache.org/job/Buildr-ci-build-jruby-jdk1.5/ws/tmp/home/.buildr>
org.jruby.exceptions.RaiseException: (SystemExit) exit
rake aborted!
/home/hudson/.rvm/rubies/jruby-1.6.7/bin/jruby -S rspec spec/version_requirement_spec.rb spec/addon/bnd_spec.rb
spec/addon/drb_spec.rb spec/addon/jaxb_xjc_spec.rb spec/java/commands_spec.rb spec/java/external_spec.rb
spec/java/ecj_spec.rb spec/java/doc_spec.rb spec/java/run_spec.rb spec/java/pom_spec.rb spec/java/packaging_spec.rb
spec/java/tests_spec.rb spec/java/bdd_spec.rb spec/java/emma_spec.rb spec/java/ant_spec.rb
spec/java/cobertura_spec.rb spec/java/compiler_spec.rb spec/java/java_spec.rb spec/core/compile_spec.rb
spec/core/doc_spec.rb spec/core/run_spec.rb spec/core/common_spec.rb spec/core/cc_spec.rb
spec/core/project_spec.rb spec/core/generate_spec.rb spec/core/generate_from_eclipse_spec.rb
spec/core/checks_spec.rb spec/core/application_spec.rb spec/core/util_spec.rb spec/core/extension_spec.rb
spec/core/transport_spec.rb spec/core/shell_spec.rb spec/core/test_spec.rb spec/core/build_spec.rb
spec/ide/idea_spec.rb spec/ide/eclipse_spec.rb spec/packaging/artifact_spec.rb spec/packaging/artifact_namespace_spec.rb
spec/packaging/packaging_spec.rb spec/packaging/archive_spec.rb spec/scala/doc_spec.rb spec/scala/tests_spec.rb
spec/scala/bdd_spec.rb spec/scala/compiler_spec.rb --format html --out _reports/specs.html
--backtrace failed
/home/hudson/.rvm/gems/jruby-1.6.7@Buildr-ci-build-jruby-jdk1.5/gems/rspec-core-2.9.0/lib/rspec/core/rake_task.rb:137:in
`initialize'
/home/hudson/.rvm/gems/jruby-1.6.7@global/gems/rake-0.9.2.2/lib/rake/file_utils_ext.rb:60:in
`verbose'
org/jruby/RubyKernel.java:2080:in `send'
/home/hudson/.rvm/gems/jruby-1.6.7@Buildr-ci-build-jruby-jdk1.5/gems/rspec-core-2.9.0/lib/rspec/core/rake_task.rb:127:in
`initialize'
org/jruby/RubyProc.java:270:in `call'
org/jruby/RubyProc.java:220:in `call'
/home/hudson/.rvm/gems/jruby-1.6.7@global/gems/rake-0.9.2.2/lib/rake/task.rb:205:in `execute'
org/jruby/RubyArray.java:1615:in `each'
/home/hudson/.rvm/gems/jruby-1.6.7@global/gems/rake-0.9.2.2/lib/rake/task.rb:200:in `execute'
/home/hudson/.rvm/gems/jruby-1.6.7@global/gems/rake-0.9.2.2/lib/rake/task.rb:158:in `invoke_with_call_chain'
/home/hudson/.rvm/rubies/jruby-1.6.7/lib/ruby/1.8/monitor.rb:191:in `mon_synchronize'
/home/hudson/.rvm/gems/jruby-1.6.7@global/gems/rake-0.9.2.2/lib/rake/task.rb:151:in `invoke_with_call_chain'
/home/hudson/.rvm/gems/jruby-1.6.7@global/gems/rake-0.9.2.2/lib/rake/task.rb:176:in `invoke_prerequisites'
org/jruby/RubyArray.java:1615:in `each'
/home/hudson/.rvm/gems/jruby-1.6.7@global/gems/rake-0.9.2.2/lib/rake/task.rb:174:in `invoke_prerequisites'
/home/hudson/.rvm/gems/jruby-1.6.7@global/gems/rake-0.9.2.2/lib/rake/task.rb:157:in `invoke_with_call_chain'
/home/hudson/.rvm/rubies/jruby-1.6.7/lib/ruby/1.8/monitor.rb:191:in `mon_synchronize'
/home/hudson/.rvm/gems/jruby-1.6.7@global/gems/rake-0.9.2.2/lib/rake/task.rb:151:in `invoke_with_call_chain'
/home/hudson/.rvm/gems/jruby-1.6.7@global/gems/rake-0.9.2.2/lib/rake/task.rb:144:in `invoke'
/home/hudson/.rvm/gems/jruby-1.6.7@global/gems/rake-0.9.2.2/lib/rake/application.rb:116:in
`invoke_task'
/home/hudson/.rvm/gems/jruby-1.6.7@global/gems/rake-0.9.2.2/lib/rake/application.rb:94:in
`top_level'
org/jruby/RubyArray.java:1615:in `each'
/home/hudson/.rvm/gems/jruby-1.6.7@global/gems/rake-0.9.2.2/lib/rake/application.rb:94:in
`top_level'
/home/hudson/.rvm/gems/jruby-1.6.7@global/gems/rake-0.9.2.2/lib/rake/application.rb:133:in
`standard_exception_handling'
/home/hudson/.rvm/gems/jruby-1.6.7@global/gems/rake-0.9.2.2/lib/rake/application.rb:88:in
`top_level'
/home/hudson/.rvm/gems/jruby-1.6.7@global/gems/rake-0.9.2.2/lib/rake/application.rb:66:in
`run'
/home/hudson/.rvm/gems/jruby-1.6.7@global/gems/rake-0.9.2.2/lib/rake/application.rb:133:in
`standard_exception_handling'
/home/hudson/.rvm/gems/jruby-1.6.7@global/gems/rake-0.9.2.2/lib/rake/application.rb:63:in
`run'
/home/hudson/.rvm/gems/jruby-1.6.7@global/gems/rake-0.9.2.2/bin/rake:33:in `(root)'
org/jruby/RubyKernel.java:1058:in `load'
/home/hudson/.rvm/gems/jruby-1.6.7@global/bin/rake:19:in `(root)'
Tasks: TOP => ci => spec
Build step 'Execute shell' marked build as failure
Recording test results

Mime
View raw message