buildr-ci mailing list archives

Site index · List index
Message view « Date » · « Thread »
Top « Date » · « Thread »
From Apache Jenkins Server <jenk...@builds.apache.org>
Subject Build failed in Jenkins: Buildr-ci-build-1.9 #36
Date Sun, 23 Sep 2012 08:58:07 GMT
See <https://builds.apache.org/job/Buildr-ci-build-1.9/36/changes>

Changes:

[donaldp] Add some more build tasks to CI

[donaldp] Fix indentation

[donaldp] Cleanup whitespace

[donaldp] Add a script in an attempt to simplify management of the ci jobs by importing it
into the source tree

[donaldp] Ignore the generated directory

[donaldp] Update the bnd extension documentation (Niklaus Giger)

[donaldp] Remove the installation of bin stubs as it overwrites our scripts

[donaldp] Rework the .rvmrc to work with on interactive shells

[donaldp] Improve the .rvmrc by;
 * allowing it to auto-install the appropriate ruby it it fails to find one
 * Guessing the gemset name based on the JOB_NAME environment variables (useful in buildr)
but defaulting to the dir name
 * Cleaning up the gems to remove older versions

[donaldp] Mark Buildr:Bnd.remote_repository as deprecated as dependencies appear in maven
central.

[donaldp] BUILDR-654 Add the ability to configure the version of BND used by bnd addon. (Niklaus
Giger)

[donaldp] Use RbConfig instead of obsolete and deprecated Config.

[donaldp] Remove amusing misspelling

[donaldp] Create the git_auto_aversion addon that automatically specifies a version for a
git project based on git describe

[boisvert] Integrate with Zinc (incremental compilation wrapper for scalac 2.9+)

[boisvert] * Changed: Default to Scala 2.9.2, ScalaTest 1.8, Scala Specs2 1.11,
           ScalaCheck 1.10.0.

* Changed: Scala artifact repository changed to
           http://oss.sonatype.org/content/repositories/releases

[boisvert] BUILDR-645 Support Mercurial as a version control system (Tan Quach)

[boisvert] BUILDR-646 TGZ files do not keep their permissions when extracted via Buildr::Unzip#extract

[donaldp] Add add_exploded_ear_artifact and add_exploded_ejb_artifact to the idea project
extension.

[donaldp] Default to using Checkstyle 5.5 in the checkstyle addon.

[donaldp] Fix the undefined default_web_xml variable in the add_web_facet method on the idea
project.

[donaldp] Fix the add_exploded_war_artifact method on the idea project by adding in missing
method `partition_dependencies`

[donaldp] 

[boisvert] Fix: gems weren't actually pushed to Rubygems.org

[boisvert] Comestic

[boisvert] Update What's New section for Buildr 1.4.7

[boisvert] Update download.textile

[boisvert] Update CHANGELOG

[boisvert] Update release date

[donaldp] Remove the lock file prior to invoking bundle install

[boisvert] Clear POM cache in Sandbox.reset

[boisvert] Revert "Provide local POMs to allow spec to run without network access."
(These POMs conflict with other specs with all specs are run together)

This reverts commit 36146cd5b8de53e7eb220d6603c445d7267336ae.

[boisvert] Provide local POMs to allow spec to run without network access.

[boisvert] Fix pom properties substitution on CRuby
(XML parser implementation can return multiple text nodes)

[boisvert] Update release date

[boisvert] Upgrade to jekyll 0.11.2 (fix @substitutions@)
Upgrade to RJB 1.4.0 (avoid compile issue on Windows)

[donaldp] BUILDR-618 - pom properties feature does not support hierarchy

[donaldp] Add some minimal documentation for the sonar plugin

[donaldp] Simplify the way we use rvm+bundler to invoke the tests

[donaldp] Stop attempting to run the emma and cobertura specs under jdk 1.7 as the underlying
tools are not compatible

[donaldp] Add a task that runs the tests against all the rubies

[donaldp] Attempt to get the tests passing more successfully across a range of platforms by
increasing the length of sleeps. One ugly way to address the indeterminacy

[donaldp] Ensure the Rake symbol is fully qualified else it fails to be found under jruby.
Unsure as to the root cause.

[donaldp] Update the BDD plugin to work with the latest versions of the dependencies

[donaldp] Migrate some requires out of the buildr.rb ad back into test_result as this file
is required directly by the bdd extension

[donaldp] Change the default configuration of RSpec to be RSpec 3 compatible

[donaldp] Rework the way we invoke the spec runner so that the budler cache is eliminated
prior to a run

[donaldp] Reference the rspec version we use

[donaldp] Reference the rspec version we use

[donaldp] Add ffi-ncurses as a jruby development dependecy to avoid an annoying warning

[donaldp] Set the $platform global variable to the platform as a string and use that to guard
construction of the gem as newer versions of rubygems use a complex object for platform rather
than a string

[donaldp] Update test so that tests have deterministic ordering with the new versions of Rake

[donaldp] Update test infrastructure so that it uses rvm to run tests. Update staging process
so that it runs tests against our 3 blessed platforms

[donaldp] Add personal key to KEYS registry

[donaldp] Update the changelog to indicate current release

[donaldp] Ignore the rake directory that is linked in during build process

[donaldp] Ensure that the environment variables required to run the jruby tests through to
completion and fast are set up when changing into the directory

[donaldp] Update .rvmrc to list all the versions of ruby that we support

[donaldp] Update matcher to conform with rspec latest requirements

[donaldp] Improve the handling of the include method on doc object to handle FileList, FileTask
etc

[donaldp] Recent versions of rake will resolve paths in FileList so we need to do the same

[donaldp] Rollback update of rubyzip package as it causes several issues in our tests

[donaldp] The recent version version of the zip library does not support to_s on entries so
do to_s on name field instead

[donaldp] Use monkey patched end_with? rather than end_with as the second form has disappeared
from whatever dependency provided it in the past.

[donaldp] Revert to always recording task metadata as our tests assume that the metadata is
recorded

[donaldp] Only use psych yml library for ruby versions 1.9.2 or later

[donaldp] Improve the way pygmentize is detected to be less noisy

[donaldp] Add a Sonar extension

[donaldp] Rename pmd.rake to pmd.rb to match other addons

[donaldp] BUILDR-638 Update to rake 0.9.2.2 

Dervived from patch supplied by: Russell Teabeault

[donaldp] BUILDR-316 Add GWT extension

[donaldp] BUILDR-624 Update rspec version to 2.9.0

Submitted By: Russell Teabeault

[donaldp] BUILDR-632 

Update net-ssh version to 2.3.0
Update net-sftp version to 2.0.5

Submitted By: Russell Teabeault

[donaldp] BUILDR-635 JRE container entry to be declared before user sources and dependencies


Submitted By: Dani Perez

[donaldp] BUILDR-637 Update rubyzip version to 0.9.8 

Submitted By: Russell Teabeault

[donaldp] BUILDR-639 Stop requiring pygmentize to run "rake -T" 

Submitted By: Russell Teabeault

[donaldp] Update changelog to reflect the fact that 1.4.7 was not released on the specified
date

[donaldp] Update the helper method for configuring the GWT facet to the format recognized
by the most recent version of IDEA

[donaldp] Enhance the exploded war artifact configuration so that it can be EJB enabled

[donaldp] Enhance the IDEA project extension further and add some notes to the changelog

[toulmean] BUILDR-628 Move to Apache Ant 1.8.3 and use canonical repository

[toulmean] Make sure tests pass, interdependency between specs

[toulmean] BUILDR-629 and BUILDR-630  thanks to Russell Teabault
* Change: BUILDR-630 Run task should not add test dependencies (Russell Teabeault)
* Change: BUILDR-629 JavaRunner should include target/resources in classpath (Russell Teabeault)

[donaldp] Rename several .rake files to .rb to match other addons

[donaldp] Add several utility methods to IDEA extension for defining artifacts and configurations.

[boisvert] Upgrade to RedCloth 4.2.9 due to issues on linux/x64
http://jgarber.lighthouseapp.com/projects/13054/tickets/219-427-installation-issue-on-arch-linux-x64

[donaldp] Make minimumTokenCount and encoding configurable for the PMD/CPD action and default
encoding to UTF-8 for compatibility with external tools (i.e. Jenkins)

[donaldp] Fix bug where the specified iml group was being overridden by default value

[boisvert] BUILDR-615 VersionRequirement.version? now returns true for versions following
pattern "r9999", e.g. "r09"

[boisvert] Rename spec

[boisvert] BUILDR-617 pom exclusion does not work (Kafka Liu)

[toulmean] put back the SVN check when staging for releases

[toulmean] Small fixes required for the release process

[toulmean] fix a few problems with the stage script

[toulmean] Committing the date of the release to publish a first RC for 1.4.7

[toulmean] Change the way we create the method tag as it clashes with an existing method

[toulmean] add a few svn:ignore entries for target folders on integration tests

[toulmean] upgrade to RJB 1.3.7

[toulmean] change version to 1.4.7, so we can start doing RCs

[toulmean] BUILDR-614 Buildr development - Using rvm, bundler and OSX installs the wrong rjb
(Russell Teabeault)

[toulmean] BUILDR-616 Buildr development - If using rvm a default .rvmrc file would be helpful
(Russell Teabeault)

[boisvert] sort added/changed/fixed items in CHANGELOG

[boisvert] Added:  MultiTest framework that allows combining multiple test frameworks for
a single project.

[boisvert] Added:  Scala Specs2 framework support.
Change: Scala Specs upgraded to 1.6.9 if using Scala 2.9.1

[boisvert] Fixed: ArtifactNamespace fails when using artifacts with classfier.

[boisvert] Buildr.transitive() now accepts hash with :scopes, :optional and :scopes_transitive
parameters

[boisvert] Improve scala file change detection

[boisvert] Scala 2.9.1 is now default

[boisvert] Buildr.artifacts() should handle any object with :to_spec method
(i.e., any object that ActsAsArtifact)

[boisvert] Handle HTTP Unauthorized (501) result code when downloading artifacts.

[donaldp] Add a FindBugs extension to buildr

[donaldp] Call to_s on target_paths to ensure the path is a string

[boisvert] Fix typos

[donaldp] Update the jdepend extension to make it parameterizable like the other analysis
extensions. Update the documetation to reflect this change

[donaldp] Updated the PMD extension so that it is consistent with the javancss extension wrt
how it is enabled

[donaldp] Add a PMD extension and some minimalistic documentation

[donaldp] Remove redundant language in Checkstyle documentation

[donaldp] Update JavaNCSS documentation to refer to JavaNCSS as extesion name

[donaldp] Add in a javancss extension and some basic documentation

[donaldp] Add in a checkstyle extension and some basic documentation

[donaldp] Update the documentation regarding the task for generating idea artifacts

[donaldp] Revert accidental change of cobertura data_file parameter

[donaldp] Parameterize the the directory where the top level cobertura tasks will generate
reports. Specify using Buildr::Cobertura.report_dir = '....'

[donaldp] Move the invocation of report_to from the task definition time to task execution
time to allow it to be monkey patched

[boisvert] All-in-one distro should have 'all-in-one' naming

[boisvert] Update all-in-one packaging: use latest rubygems and install ffi-ncurses

[donaldp] Exclude a test from the CI under jdk1.5. Unsure the cause of the failure but jdk
1.5 compatibility does not seem a high priority at this stage.

[boisvert] setup task no longer exists

[boisvert] BUILDR-611 Buildr should not unnecessarily recompile Java files explicitly added
to compile.from

[boisvert] ScalaTest now automatically loads the Mockito library

[toulmean] move to atoulme-Antwrap 0.7.2

[boisvert] Fix ToC entry for IRC

[boisvert] Fixed:  scaladoc generation with scala 2.9.x

[donaldp] Default build_on_make to false as otherwise every test requires a rebuild of the
artifacts

[donaldp] Stop pretty printing the Intellij IDEA project files to avoid IDEA breaking in the
presence of non-normalized whitespace content.

[donaldp] Revert to the default value of local_repository_env_override being MAVEN_REPOSITORY

[donaldp] Ensure the local_repository_env_override attribute has a writer method

[donaldp] Change the Intellij IDEA extension to always rebuild the project files.

[donaldp] Enhance the Intellij IDEA extension to support the addition of "artifacts" and "configurations"
to the generated project file.

[donaldp] Changed the default output directory for Intellij IDEA to be _(:target, :main, :idea,
:classes) from _(:target, :main, :java) and the default test output directory to be _(:target,
:test, :idea, :classes) from _(:target, :test, :java)

------------------------------------------
[...truncated 948 lines...]
     0 Sun Sep 23 08:57:06 UTC 2012 test/EmptyDir1/
     0 Sun Sep 23 08:57:06 UTC 2012 test/EmptyDir2/
    21 Sun Sep 23 08:57:06 UTC 2012 test/Test1.txt
    22 Sun Sep 23 08:57:06 UTC 2012 test/Text2.html
     0 Sun Sep 23 08:57:06 UTC 2012 path/
     0 Sun Sep 23 08:57:06 UTC 2012 path/test/
    21 Sun Sep 23 08:57:06 UTC 2012 path/test/sample
     0 Sun Sep 23 08:57:06 UTC 2012 test/
    15 Sun Sep 23 08:57:06 UTC 2012 test/.config
     0 Sun Sep 23 08:57:06 UTC 2012 test/EmptyDir1/
     0 Sun Sep 23 08:57:06 UTC 2012 test/EmptyDir2/
    21 Sun Sep 23 08:57:06 UTC 2012 test/Test1.txt
    22 Sun Sep 23 08:57:06 UTC 2012 test/Text2.html
     0 Sun Sep 23 08:57:08 UTC 2012 code/
     0 Sun Sep 23 08:57:08 UTC 2012 code/EmptyDir1/
     0 Sun Sep 23 08:57:08 UTC 2012 code/EmptyDir2/
    21 Sun Sep 23 08:57:08 UTC 2012 code/Test1.txt
    22 Sun Sep 23 08:57:08 UTC 2012 code/Text2.html
     0 Sun Sep 23 08:57:08 UTC 2012 path/
     0 Sun Sep 23 08:57:08 UTC 2012 path/code/
     0 Sun Sep 23 08:57:08 UTC 2012 path/code/EmptyDir1/
     0 Sun Sep 23 08:57:08 UTC 2012 path/code/EmptyDir2/
    21 Sun Sep 23 08:57:08 UTC 2012 path/code/Test1.txt
    22 Sun Sep 23 08:57:08 UTC 2012 path/code/Text2.html
     0 Sun Sep 23 08:57:08 UTC 2012 EmptyDir1/
     0 Sun Sep 23 08:57:08 UTC 2012 EmptyDir2/
    21 Sun Sep 23 08:57:08 UTC 2012 Test1.txt
    22 Sun Sep 23 08:57:08 UTC 2012 Text2.html
     0 Sun Sep 23 08:57:08 UTC 2012 path/
     0 Sun Sep 23 08:57:08 UTC 2012 path/EmptyDir1/
     0 Sun Sep 23 08:57:08 UTC 2012 path/EmptyDir2/
    21 Sun Sep 23 08:57:08 UTC 2012 path/Test1.txt
    22 Sun Sep 23 08:57:08 UTC 2012 path/Text2.html
    21 Sun Sep 23 08:57:08 UTC 2012 Test1.txt
    22 Sun Sep 23 08:57:08 UTC 2012 Text2.html
    21 Sun Sep 23 08:57:08 UTC 2012 Test1.txt
    22 Sun Sep 23 08:57:08 UTC 2012 Text2.html
     0 Sun Sep 23 08:57:08 UTC 2012 test/
    21 Sun Sep 23 08:57:08 UTC 2012 test/Test1.txt
    22 Sun Sep 23 08:57:08 UTC 2012 test/Text2.html
     0 Sun Sep 23 08:57:08 UTC 2012 test/
    21 Sun Sep 23 08:57:08 UTC 2012 test/Test1.txt
    22 Sun Sep 23 08:57:08 UTC 2012 test/Text2.html
    21 Sun Sep 23 08:57:08 UTC 2012 Test1.txt
    22 Sun Sep 23 08:57:08 UTC 2012 Text2.html
    21 Sun Sep 23 08:57:10 UTC 2012 Test1.txt
    22 Sun Sep 23 08:57:10 UTC 2012 Text2.html
    21 Sun Sep 23 08:57:10 UTC 2012 Test1.txt
    22 Sun Sep 23 08:57:10 UTC 2012 Text2.html
     0 Sun Sep 23 08:57:10 UTC 2012 EmptyDir1/
     0 Sun Sep 23 08:57:10 UTC 2012 EmptyDir2/
    21 Sun Sep 23 08:57:10 UTC 2012 Test1.txt
    22 Sun Sep 23 08:57:10 UTC 2012 Text2.html
     0 Sun Sep 23 08:57:10 UTC 2012 subdir/
    15 Sun Sep 23 08:57:10 UTC 2012 subdir/test3.css
    21 Sun Sep 23 08:57:10 UTC 2012 Test1.txt
    22 Sun Sep 23 08:57:10 UTC 2012 Text2.html
    15 Sun Sep 23 08:57:10 UTC 2012 Test1.txt
    22 Sun Sep 23 08:57:10 UTC 2012 Text2.html
    22 Sun Sep 23 08:57:10 UTC 2012 Text2.html
model contains 4 documentable templates
model contains 2 documentable templates
Run starting. Expected test count is: 1
MySuite:
- addition
Run completed in 76 milliseconds.
Total number of tests run: 1
Suites: completed 1, aborted 0
Tests: succeeded 1, failed 0, ignored 0, pending 0
All tests passed.
Run starting. Expected test count is: 1
InnerClassTest:
- addition
Run completed in 52 milliseconds.
Total number of tests run: 1
Suites: completed 1, aborted 0
Tests: succeeded 1, failed 0, ignored 0, pending 0
All tests passed.
Run starting. Expected test count is: 1
PassingSuite:
- addition
Run completed in 51 milliseconds.
Total number of tests run: 1
Suites: completed 1, aborted 0
Tests: succeeded 1, failed 0, ignored 0, pending 0
All tests passed.
Run starting. Expected test count is: 1
FailingSuite:
- failing *** FAILED ***
  org.scalatest.exceptions.TestFailedException was thrown. (FailingSuite.scala:3)
Run completed in 54 milliseconds.
Total number of tests run: 1
Suites: completed 1, aborted 0
Tests: succeeded 0, failed 1, ignored 0, pending 0
*** 1 TEST FAILED ***
Run starting. Expected test count is: 1
FailingSuite:
- failing *** FAILED ***
  org.scalatest.exceptions.TestFailedException was thrown. (FailingSuite.scala:3)
Run completed in 52 milliseconds.
Total number of tests run: 1
Suites: completed 1, aborted 0
Tests: succeeded 0, failed 1, ignored 0, pending 0
*** 1 TEST FAILED ***
Run starting. Expected test count is: 1
PassingSuite:
- passing
Run completed in 49 milliseconds.
Total number of tests run: 1
Suites: completed 1, aborted 0
Tests: succeeded 1, failed 0, ignored 0, pending 0
All tests passed.
Run starting. Expected test count is: 1
PassingSuite:
- passing
Run completed in 48 milliseconds.
Total number of tests run: 1
Suites: completed 1, aborted 0
Tests: succeeded 1, failed 0, ignored 0, pending 0
All tests passed.
Run starting. Expected test count is: 1
PropertyTestSuite:
- testProperty
Run completed in 52 milliseconds.
Total number of tests run: 1
Suites: completed 1, aborted 0
Tests: succeeded 1, failed 0, ignored 0, pending 0
All tests passed.
Run starting. Expected test count is: 2
MySuite:
- list concatenation
- list concatenation using a test method
Run completed in 297 milliseconds.
Total number of tests run: 2
Suites: completed 1, aborted 0
Tests: succeeded 2, failed 0, ignored 0, pending 0
All tests passed.
Run starting. Expected test count is: 5
StringSuite:
- startsWith
- endsWith
- concat *** FAILED ***
  GeneratorDrivenPropertyCheckFailedException was thrown during property evaluation.
 (StringSuite.scala:17)
  Falsified after 0 successful property evaluations.
  Location: (StringSuite.scala:17)
  Occurred when passed generated values (
    arg0 = "",
    arg1 = ""
  )
- substring2
- substring3
Run completed in 281 milliseconds.
Total number of tests run: 5
Suites: completed 1, aborted 0
Tests: succeeded 4, failed 1, ignored 0, pending 0
*** 1 TEST FAILED ***
Specification "MySpecs"
  it should
  + add

Total for specification "MySpecs":
Finished in 0 second, 68 ms
1 example, 1 expectation, 0 failure, 0 error

Specification "MySpecs"
  it should
  + add

Total for specification "MySpecs":
Finished in 0 second, 63 ms
1 example, 1 expectation, 0 failure, 0 error

Specification "PassingSpecs"
  it should
  + add

Total for specification "PassingSpecs":
Finished in 0 second, 64 ms
1 example, 1 expectation, 0 failure, 0 error

Specification "StringSpecs"
  empty string should
  x have a zero length
    '0' is not equal to '1' (StringSpecs.scala:7)

Total for specification "StringSpecs":
Finished in 0 second, 65 ms
1 example, 1 expectation, 1 failure, 0 error

MySpecs

it should
+ add
 
 
Total for specification MySpecs
Finished in 53 ms
1 example, 0 failure, 0 error

MySpecs

The 'Hello world' string should
+ contain 11 characters
+ start with 'Hello'
+ end with 'world'
 
Total for specification MySpecs
Finished in 55 ms
3 examples, 0 failure, 0 error

PassingSpecs

it should
+ add
 
 
Total for specification PassingSpecs
Finished in 45 ms
1 example, 0 failure, 0 error

StringSpecs

empty string should
x have a zero length
   '0' is not equal to '1' (StringSpecs.scala:6)
 
 
Total for specification StringSpecs
Finished in 46 ms
1 example, 1 failure, 0 error

mkdir -p <https://builds.apache.org/job/Buildr-ci-build-1.9/ws/tmp/home>
mkdir -p <https://builds.apache.org/job/Buildr-ci-build-1.9/ws/tmp/home/.buildr>
[info] Compiling 1 Scala source to <https://builds.apache.org/job/Buildr-ci-build-1.9/ws/tmp/target/dependency...>
[info] Compile success at Sep 23, 2012 8:58:03 AM [2.921s]
[info] Compiling 1 Scala source to <https://builds.apache.org/job/Buildr-ci-build-1.9/ws/tmp/target/classes...>
[info] Compile success at Sep 23, 2012 8:58:03 AM [0.678s]
[info] Compiling 1 Scala source to <https://builds.apache.org/job/Buildr-ci-build-1.9/ws/tmp/target/classes...>
[info] Compile success at Sep 23, 2012 8:58:04 AM [0.621s]
[info] Compiling 1 Scala source to <https://builds.apache.org/job/Buildr-ci-build-1.9/ws/tmp/target/classes...>
[info] Compile success at Sep 23, 2012 8:58:05 AM [0.479s]
[info] Compiling 1 Scala source and 1 Java source to <https://builds.apache.org/job/Buildr-ci-build-1.9/ws/tmp/target/classes...>
[info] Compile success at Sep 23, 2012 8:58:05 AM [0.466s]
[info] Compiling 1 Scala source and 1 Java source to <https://builds.apache.org/job/Buildr-ci-build-1.9/ws/tmp/target/classes...>
[info] Compile success at Sep 23, 2012 8:58:06 AM [0.400s]
Recording test results
No test report files were found. Configuration error?
Build step 'Publish JUnit test result report' changed build result to FAILURE

Mime
View raw message