buildr-ci mailing list archives

Site index · List index
Message view « Date » · « Thread »
Top « Date » · « Thread »
From Apache Jenkins Server <jenk...@builds.apache.org>
Subject Build failed in Jenkins: buildr-ci-build-jruby-jdk5 #89
Date Fri, 28 Oct 2011 11:54:39 GMT
See <https://builds.apache.org/job/buildr-ci-build-jruby-jdk5/89/changes>

Changes:

[donaldp] Update the documentation regarding the task for generating idea artifacts

------------------------------------------
[...truncated 344 lines...]
    Command line test
    Tests run: 0, Failures: 0, Skips: 0
===============================================


===============================================
foo
Total tests run: 0, Failures: 0, Skips: 0
===============================================

[org.testng.internal.PoolService] Shutting down poolservice org.testng.internal.PoolService@f6a746
terminated:false
[Parser] Running:
  foo

PASSED: annotated

===============================================
    Command line test
    Tests run: 1, Failures: 0, Skips: 0
===============================================


===============================================
foo
Total tests run: 1, Failures: 0, Skips: 0
===============================================

[org.testng.internal.PoolService] Shutting down poolservice org.testng.internal.PoolService@1eed786
terminated:false
.
Time: 0.018s

Total: 1. Success!
.
Time: 0.0080s

Total: 1. Success!
All checks passed.
mkdir -p <https://builds.apache.org/job/buildr-ci-build-jruby-jdk5/ws/tmp/home>
mkdir -p <https://builds.apache.org/job/buildr-ci-build-jruby-jdk5/ws/tmp/home/.buildr>
<https://builds.apache.org/job/buildr-ci-build-jruby-jdk5/ws/tmp/failed.java>:1: 'class'
or 'interface' expected
not a class
^
<https://builds.apache.org/job/buildr-ci-build-jruby-jdk5/ws/tmp/failed.java>:1: <identifier>
expected
not a class
           ^
2 errors
1 error
2 warnings
javadoc: warning - No source files for package Test.java
javadoc: warning - No source files for package Test.java
javadoc: error - No public or protected classes found to document.
mkdir -p <https://builds.apache.org/job/buildr-ci-build-jruby-jdk5/ws/tmp/home>
mkdir -p <https://builds.apache.org/job/buildr-ci-build-jruby-jdk5/ws/tmp/home/.buildr>
mkdir -p <https://builds.apache.org/job/buildr-ci-build-jruby-jdk5/ws/tmp/home>
mkdir -p <https://builds.apache.org/job/buildr-ci-build-jruby-jdk5/ws/tmp/home/.buildr>
mkdir -p <https://builds.apache.org/job/buildr-ci-build-jruby-jdk5/ws/tmp/home>
mkdir -p <https://builds.apache.org/job/buildr-ci-build-jruby-jdk5/ws/tmp/home/.buildr>
rm -rf <https://builds.apache.org/job/buildr-ci-build-jruby-jdk5/ws/tmp/reports/junit>
rm -rf <https://builds.apache.org/job/buildr-ci-build-jruby-jdk5/ws/tmp/target/junit-failed>
mkdir -p <https://builds.apache.org/job/buildr-ci-build-jruby-jdk5/ws/tmp/reports/junit>
touch <https://builds.apache.org/job/buildr-ci-build-jruby-jdk5/ws/tmp/reports/junit/last_successful_run>
rm -rf <https://builds.apache.org/job/buildr-ci-build-jruby-jdk5/ws/tmp/reports/junit>
rm -rf <https://builds.apache.org/job/buildr-ci-build-jruby-jdk5/ws/tmp/target/junit-failed>
mkdir -p <https://builds.apache.org/job/buildr-ci-build-jruby-jdk5/ws/tmp/target>
rm -rf <https://builds.apache.org/job/buildr-ci-build-jruby-jdk5/ws/tmp/reports/junit>
rm -rf <https://builds.apache.org/job/buildr-ci-build-jruby-jdk5/ws/tmp/target/junit-failed>
mkdir -p <https://builds.apache.org/job/buildr-ci-build-jruby-jdk5/ws/tmp/target>
    [junit] Test FailingTest FAILED
    [junit] Test FailingTest FAILED
#<Method: RSpec::Core::ExampleGroup::Nested_146(Buildr)#install>
     0 Fri Oct 28 11:53:18 UTC 2011 test/
    21 Fri Oct 28 11:53:18 UTC 2011 test/Test1.txt
     0 Fri Oct 28 11:53:18 UTC 2011 test/EmptyDir2/
    22 Fri Oct 28 11:53:18 UTC 2011 test/Text2.html
     0 Fri Oct 28 11:53:18 UTC 2011 test/EmptyDir1/
    21 Fri Oct 28 11:53:18 UTC 2011 Test1.txt
     0 Fri Oct 28 11:53:18 UTC 2011 EmptyDir2/
    22 Fri Oct 28 11:53:18 UTC 2011 Text2.html
     0 Fri Oct 28 11:53:18 UTC 2011 EmptyDir1/
     0 Fri Oct 28 11:53:18 UTC 2011 code/
    21 Fri Oct 28 11:53:18 UTC 2011 code/Test1.txt
    22 Fri Oct 28 11:53:18 UTC 2011 code/Text2.html
     0 Fri Oct 28 11:53:20 UTC 2011 code/
    21 Fri Oct 28 11:53:20 UTC 2011 code/Test1.txt
     0 Fri Oct 28 11:53:20 UTC 2011 code/EmptyDir2/
    22 Fri Oct 28 11:53:20 UTC 2011 code/Text2.html
     0 Fri Oct 28 11:53:20 UTC 2011 code/EmptyDir1/
    21 Fri Oct 28 11:53:20 UTC 2011 Test1.txt
    22 Fri Oct 28 11:53:20 UTC 2011 Text2.html
    21 Fri Oct 28 11:53:20 UTC 2011 Test1.txt
    22 Fri Oct 28 11:53:20 UTC 2011 Text2.html
     0 Fri Oct 28 11:53:20 UTC 2011 included
    11 Fri Oct 28 11:53:22 UTC 2011 library-1.0.txt
    22 Fri Oct 28 11:53:22 UTC 2011 p1-1.0.zip
     0 Fri Oct 28 11:53:22 UTC 2011 test/
    21 Fri Oct 28 11:53:22 UTC 2011 test/Test1.txt
     0 Fri Oct 28 11:53:22 UTC 2011 test/EmptyDir2/
    22 Fri Oct 28 11:53:22 UTC 2011 test/Text2.html
     0 Fri Oct 28 11:53:22 UTC 2011 test/EmptyDir1/
    21 Fri Oct 28 11:53:22 UTC 2011 Test1.txt
     0 Fri Oct 28 11:53:22 UTC 2011 test/
    21 Fri Oct 28 11:53:22 UTC 2011 test/Test1.txt
     0 Fri Oct 28 11:53:22 UTC 2011 test/EmptyDir2/
     0 Fri Oct 28 11:53:22 UTC 2011 test/EmptyDir1/
    21 Fri Oct 28 11:53:24 UTC 2011 Test1.txt
     0 Fri Oct 28 11:53:24 UTC 2011 EmptyDir2/
     0 Fri Oct 28 11:53:24 UTC 2011 EmptyDir1/
     0 Fri Oct 28 11:53:24 UTC 2011 test/
    21 Fri Oct 28 11:53:24 UTC 2011 test/Test1.txt
     0 Fri Oct 28 11:53:24 UTC 2011 test/EmptyDir2/
    22 Fri Oct 28 11:53:24 UTC 2011 test/Text2.html
     0 Fri Oct 28 11:53:24 UTC 2011 test/EmptyDir1/
     0 Fri Oct 28 11:53:24 UTC 2011 test/
    21 Fri Oct 28 11:53:24 UTC 2011 test/Test1.txt
     0 Fri Oct 28 11:53:24 UTC 2011 test/EmptyDir2/
     0 Fri Oct 28 11:53:24 UTC 2011 test/file.txt
    22 Fri Oct 28 11:53:24 UTC 2011 test/Text2.html
     0 Fri Oct 28 11:53:24 UTC 2011 test/EmptyDir1/
     0 Fri Oct 28 11:53:24 UTC 2011 code/
    21 Fri Oct 28 11:53:24 UTC 2011 code/Test1.txt
    22 Fri Oct 28 11:53:24 UTC 2011 code/Text2.html
     0 Fri Oct 28 11:53:24 UTC 2011 test/
    21 Fri Oct 28 11:53:24 UTC 2011 test/Test1.txt
     0 Fri Oct 28 11:53:24 UTC 2011 test/EmptyDir2/
    22 Fri Oct 28 11:53:24 UTC 2011 test/Text2.html
     0 Fri Oct 28 11:53:24 UTC 2011 test/EmptyDir1/
     0 Fri Oct 28 11:53:26 UTC 2011 code/
    21 Fri Oct 28 11:53:26 UTC 2011 code/Test1.txt
    22 Fri Oct 28 11:53:26 UTC 2011 code/Text2.html
     0 Fri Oct 28 11:53:26 UTC 2011 code/
     0 Fri Oct 28 11:53:26 UTC 2011 code/test/
    21 Fri Oct 28 11:53:26 UTC 2011 code/test/Test1.txt
     0 Fri Oct 28 11:53:26 UTC 2011 code/test/EmptyDir2/
    22 Fri Oct 28 11:53:26 UTC 2011 code/test/Text2.html
     0 Fri Oct 28 11:53:26 UTC 2011 code/test/EmptyDir1/
     0 Fri Oct 28 11:53:26 UTC 2011 test/
    21 Fri Oct 28 11:53:26 UTC 2011 test/sample
    21 Fri Oct 28 11:53:26 UTC 2011 Test1.txt
     0 Fri Oct 28 11:53:26 UTC 2011 EmptyDir2/
    22 Fri Oct 28 11:53:26 UTC 2011 Text2.html
     0 Fri Oct 28 11:53:26 UTC 2011 EmptyDir1/
     0 Fri Oct 28 11:53:26 UTC 2011 test/
    21 Fri Oct 28 11:53:26 UTC 2011 test/Test1.txt
     0 Fri Oct 28 11:53:26 UTC 2011 test/EmptyDir2/
    22 Fri Oct 28 11:53:26 UTC 2011 test/Text2.html
     0 Fri Oct 28 11:53:26 UTC 2011 test/EmptyDir1/
     0 Fri Oct 28 11:53:28 UTC 2011 path/
     0 Fri Oct 28 11:53:28 UTC 2011 path/test/
    21 Fri Oct 28 11:53:28 UTC 2011 path/test/sample
     0 Fri Oct 28 11:53:28 UTC 2011 test/
    21 Fri Oct 28 11:53:28 UTC 2011 test/Test1.txt
     0 Fri Oct 28 11:53:28 UTC 2011 test/EmptyDir2/
    22 Fri Oct 28 11:53:28 UTC 2011 test/Text2.html
     0 Fri Oct 28 11:53:28 UTC 2011 test/EmptyDir1/
    15 Fri Oct 28 11:53:28 UTC 2011 test/.config
     0 Fri Oct 28 11:53:28 UTC 2011 code/
    21 Fri Oct 28 11:53:28 UTC 2011 code/Test1.txt
     0 Fri Oct 28 11:53:28 UTC 2011 code/EmptyDir2/
    22 Fri Oct 28 11:53:28 UTC 2011 code/Text2.html
     0 Fri Oct 28 11:53:28 UTC 2011 code/EmptyDir1/
     0 Fri Oct 28 11:53:28 UTC 2011 path/
     0 Fri Oct 28 11:53:28 UTC 2011 path/code/
    21 Fri Oct 28 11:53:28 UTC 2011 path/code/Test1.txt
     0 Fri Oct 28 11:53:28 UTC 2011 path/code/EmptyDir2/
    22 Fri Oct 28 11:53:28 UTC 2011 path/code/Text2.html
     0 Fri Oct 28 11:53:28 UTC 2011 path/code/EmptyDir1/
    21 Fri Oct 28 11:53:28 UTC 2011 Test1.txt
     0 Fri Oct 28 11:53:28 UTC 2011 EmptyDir2/
    22 Fri Oct 28 11:53:28 UTC 2011 Text2.html
     0 Fri Oct 28 11:53:28 UTC 2011 EmptyDir1/
     0 Fri Oct 28 11:53:30 UTC 2011 path/
    21 Fri Oct 28 11:53:30 UTC 2011 path/Test1.txt
     0 Fri Oct 28 11:53:30 UTC 2011 path/EmptyDir2/
    22 Fri Oct 28 11:53:30 UTC 2011 path/Text2.html
     0 Fri Oct 28 11:53:30 UTC 2011 path/EmptyDir1/
    21 Fri Oct 28 11:53:30 UTC 2011 Test1.txt
    22 Fri Oct 28 11:53:30 UTC 2011 Text2.html
    21 Fri Oct 28 11:53:30 UTC 2011 Test1.txt
    22 Fri Oct 28 11:53:30 UTC 2011 Text2.html
     0 Fri Oct 28 11:53:30 UTC 2011 test/
    21 Fri Oct 28 11:53:30 UTC 2011 test/Test1.txt
    22 Fri Oct 28 11:53:30 UTC 2011 test/Text2.html
     0 Fri Oct 28 11:53:32 UTC 2011 test/
    21 Fri Oct 28 11:53:32 UTC 2011 test/Test1.txt
    22 Fri Oct 28 11:53:32 UTC 2011 test/Text2.html
    21 Fri Oct 28 11:53:32 UTC 2011 Test1.txt
    22 Fri Oct 28 11:53:32 UTC 2011 Text2.html
    21 Fri Oct 28 11:53:32 UTC 2011 Test1.txt
    22 Fri Oct 28 11:53:32 UTC 2011 Text2.html
    21 Fri Oct 28 11:53:32 UTC 2011 Test1.txt
    22 Fri Oct 28 11:53:32 UTC 2011 Text2.html
    21 Fri Oct 28 11:53:34 UTC 2011 Test1.txt
     0 Fri Oct 28 11:53:34 UTC 2011 EmptyDir2/
    22 Fri Oct 28 11:53:34 UTC 2011 Text2.html
     0 Fri Oct 28 11:53:34 UTC 2011 subdir/
     0 Fri Oct 28 11:53:34 UTC 2011 EmptyDir1/
    15 Fri Oct 28 11:53:34 UTC 2011 subdir/test3.css
    21 Fri Oct 28 11:53:34 UTC 2011 Test1.txt
    22 Fri Oct 28 11:53:34 UTC 2011 Text2.html
    15 Fri Oct 28 11:53:34 UTC 2011 Test1.txt
    22 Fri Oct 28 11:53:34 UTC 2011 Text2.html
    22 Fri Oct 28 11:53:34 UTC 2011 Text2.html
No known dependencies. Compiling everything
model contains 0 documentable templates
No known dependencies. Compiling everything
No known dependencies. Compiling everything
No known dependencies. Compiling everything
No known dependencies. Compiling everything
No known dependencies. Compiling everything
No known dependencies. Compiling everything
No known dependencies. Compiling everything
No known dependencies. Compiling everything
mkdir -p <https://builds.apache.org/job/buildr-ci-build-jruby-jdk5/ws/tmp/home>
mkdir -p <https://builds.apache.org/job/buildr-ci-build-jruby-jdk5/ws/tmp/home/.buildr>
rake aborted!
ruby -S bundle exec rspec --format html --out _reports/specs.html --backtrace spec/version_requirement_spec.rb
spec/addon/bnd_spec.rb spec/addon/drb_spec.rb spec/addon/jaxb_xjc_spec.rb spec/java/commands_spec.rb
spec/java/external_spec.rb spec/java/ecj_spec.rb spec/java/doc_spec.rb spec/java/run_spec.rb
spec/java/packaging_spec.rb spec/java/tests_spec.rb spec/java/bdd_spec.rb spec/java/emma_spec.rb
spec/java/ant_spec.rb spec/java/cobertura_spec.rb spec/java/compiler_spec.rb spec/java/java_spec.rb
spec/core/compile_spec.rb spec/core/doc_spec.rb spec/core/run_spec.rb spec/core/common_spec.rb
spec/core/cc_spec.rb spec/core/project_spec.rb spec/core/generate_spec.rb spec/core/checks_spec.rb
spec/core/application_spec.rb spec/core/util_spec.rb spec/core/extension_spec.rb spec/core/transport_spec.rb
spec/core/shell_spec.rb spec/core/test_spec.rb spec/core/build_spec.rb spec/ide/idea_spec.rb
spec/ide/eclipse_spec.rb spec/packaging/artifact_spec.rb spec/packaging/artifact_namespace_spec.rb
spec/packaging/packaging_spec.rb spec/packaging/archive_spec.rb spec/scala/doc_spec.rb spec/scala/tests_spec.rb
spec/scala/bdd_spec.rb spec/scala/compiler_spec.rb failed
/home/hudson/.rvm/gems/jruby-1.6.2/gems/rspec-core-2.1.0/lib/rspec/core/rake_task.rb:139:in
`initialize'
/home/hudson/.rvm/gems/jruby-1.6.2/gems/rake-0.8.7/lib/rake.rb:1112:in `verbose'
org/jruby/RubyKernel.java:2063:in `send'
/home/hudson/.rvm/gems/jruby-1.6.2/gems/rspec-core-2.1.0/lib/rspec/core/rake_task.rb:131:in
`initialize'
org/jruby/RubyProc.java:268:in `call'
org/jruby/RubyProc.java:228:in `call'
/home/hudson/.rvm/gems/jruby-1.6.2/gems/rake-0.8.7/lib/rake.rb:636:in `execute'
org/jruby/RubyArray.java:1602:in `each'
/home/hudson/.rvm/gems/jruby-1.6.2/gems/rake-0.8.7/lib/rake.rb:631:in `execute'
/home/hudson/.rvm/gems/jruby-1.6.2/gems/rake-0.8.7/lib/rake.rb:597:in `invoke_with_call_chain'
/home/hudson/.rvm/rubies/jruby-1.6.2/lib/ruby/1.8/monitor.rb:191:in `mon_synchronize'
/home/hudson/.rvm/gems/jruby-1.6.2/gems/rake-0.8.7/lib/rake.rb:590:in `invoke_with_call_chain'
/home/hudson/.rvm/gems/jruby-1.6.2/gems/rake-0.8.7/lib/rake.rb:607:in `invoke_prerequisites'
org/jruby/RubyArray.java:1602:in `each'
/home/hudson/.rvm/gems/jruby-1.6.2/gems/rake-0.8.7/lib/rake.rb:604:in `invoke_prerequisites'
/home/hudson/.rvm/gems/jruby-1.6.2/gems/rake-0.8.7/lib/rake.rb:596:in `invoke_with_call_chain'
/home/hudson/.rvm/rubies/jruby-1.6.2/lib/ruby/1.8/monitor.rb:191:in `mon_synchronize'
/home/hudson/.rvm/gems/jruby-1.6.2/gems/rake-0.8.7/lib/rake.rb:590:in `invoke_with_call_chain'
/home/hudson/.rvm/gems/jruby-1.6.2/gems/rake-0.8.7/lib/rake.rb:583:in `invoke'
/home/hudson/.rvm/gems/jruby-1.6.2/gems/rake-0.8.7/lib/rake.rb:2051:in `invoke_task'
/home/hudson/.rvm/gems/jruby-1.6.2/gems/rake-0.8.7/lib/rake.rb:2029:in `top_level'
org/jruby/RubyArray.java:1602:in `each'
/home/hudson/.rvm/gems/jruby-1.6.2/gems/rake-0.8.7/lib/rake.rb:2029:in `top_level'
/home/hudson/.rvm/gems/jruby-1.6.2/gems/rake-0.8.7/lib/rake.rb:2068:in `standard_exception_handling'
/home/hudson/.rvm/gems/jruby-1.6.2/gems/rake-0.8.7/lib/rake.rb:2023:in `top_level'
/home/hudson/.rvm/gems/jruby-1.6.2/gems/rake-0.8.7/lib/rake.rb:2001:in `run'
/home/hudson/.rvm/gems/jruby-1.6.2/gems/rake-0.8.7/lib/rake.rb:2068:in `standard_exception_handling'
/home/hudson/.rvm/gems/jruby-1.6.2/gems/rake-0.8.7/lib/rake.rb:1998:in `run'
/home/hudson/.rvm/gems/jruby-1.6.2/gems/rake-0.8.7/bin/rake:31:in `(root)'
org/jruby/RubyKernel.java:1063:in `load'
/home/hudson/.rvm/gems/jruby-1.6.2/bin/rake:19:in `(root)'
Build step 'Execute shell' marked build as failure
Recording test results


Mime
View raw message