buildr-ci mailing list archives

Site index · List index
Message view « Date » · « Thread »
Top « Date » · « Thread »
From Apache Jenkins Server <jenk...@builds.apache.org>
Subject Build failed in Jenkins: buildr-ci-build-jruby-jdk5 #76
Date Sun, 07 Aug 2011 09:54:51 GMT
See <https://builds.apache.org/job/buildr-ci-build-jruby-jdk5/76/>

------------------------------------------
[...truncated 682 lines...]
    21 Sun Aug 07 09:46:32 UTC 2011 test/Test1.txt
     0 Sun Aug 07 09:46:32 UTC 2011 test/EmptyDir2/
    22 Sun Aug 07 09:46:32 UTC 2011 test/Text2.html
     0 Sun Aug 07 09:46:32 UTC 2011 test/EmptyDir1/
    15 Sun Aug 07 09:46:32 UTC 2011 test/.config
     0 Sun Aug 07 09:46:32 UTC 2011 code/
    21 Sun Aug 07 09:46:32 UTC 2011 code/Test1.txt
     0 Sun Aug 07 09:46:32 UTC 2011 code/EmptyDir2/
    22 Sun Aug 07 09:46:32 UTC 2011 code/Text2.html
     0 Sun Aug 07 09:46:32 UTC 2011 code/EmptyDir1/
     0 Sun Aug 07 09:46:32 UTC 2011 path/
     0 Sun Aug 07 09:46:32 UTC 2011 path/code/
    21 Sun Aug 07 09:46:32 UTC 2011 path/code/Test1.txt
     0 Sun Aug 07 09:46:32 UTC 2011 path/code/EmptyDir2/
    22 Sun Aug 07 09:46:32 UTC 2011 path/code/Text2.html
     0 Sun Aug 07 09:46:32 UTC 2011 path/code/EmptyDir1/
    21 Sun Aug 07 09:46:32 UTC 2011 Test1.txt
     0 Sun Aug 07 09:46:32 UTC 2011 EmptyDir2/
    22 Sun Aug 07 09:46:32 UTC 2011 Text2.html
     0 Sun Aug 07 09:46:32 UTC 2011 EmptyDir1/
     0 Sun Aug 07 09:46:32 UTC 2011 path/
    21 Sun Aug 07 09:46:32 UTC 2011 path/Test1.txt
     0 Sun Aug 07 09:46:32 UTC 2011 path/EmptyDir2/
    22 Sun Aug 07 09:46:32 UTC 2011 path/Text2.html
     0 Sun Aug 07 09:46:32 UTC 2011 path/EmptyDir1/
    21 Sun Aug 07 09:46:32 UTC 2011 Test1.txt
    22 Sun Aug 07 09:46:32 UTC 2011 Text2.html
    21 Sun Aug 07 09:46:32 UTC 2011 Test1.txt
    22 Sun Aug 07 09:46:32 UTC 2011 Text2.html
     0 Sun Aug 07 09:46:32 UTC 2011 test/
    21 Sun Aug 07 09:46:32 UTC 2011 test/Test1.txt
    22 Sun Aug 07 09:46:32 UTC 2011 test/Text2.html
     0 Sun Aug 07 09:46:32 UTC 2011 test/
    21 Sun Aug 07 09:46:32 UTC 2011 test/Test1.txt
    22 Sun Aug 07 09:46:32 UTC 2011 test/Text2.html
    21 Sun Aug 07 09:46:34 UTC 2011 Test1.txt
    22 Sun Aug 07 09:46:34 UTC 2011 Text2.html
    21 Sun Aug 07 09:46:34 UTC 2011 Test1.txt
    22 Sun Aug 07 09:46:34 UTC 2011 Text2.html
    21 Sun Aug 07 09:46:34 UTC 2011 Test1.txt
    22 Sun Aug 07 09:46:34 UTC 2011 Text2.html
    21 Sun Aug 07 09:46:34 UTC 2011 Test1.txt
     0 Sun Aug 07 09:46:34 UTC 2011 EmptyDir2/
    22 Sun Aug 07 09:46:34 UTC 2011 Text2.html
     0 Sun Aug 07 09:46:34 UTC 2011 subdir/
     0 Sun Aug 07 09:46:34 UTC 2011 EmptyDir1/
    15 Sun Aug 07 09:46:34 UTC 2011 subdir/test3.css
    21 Sun Aug 07 09:46:34 UTC 2011 Test1.txt
    22 Sun Aug 07 09:46:34 UTC 2011 Text2.html
    15 Sun Aug 07 09:46:34 UTC 2011 Test1.txt
    22 Sun Aug 07 09:46:34 UTC 2011 Text2.html
    22 Sun Aug 07 09:46:34 UTC 2011 Text2.html
No known dependencies. Compiling everything
model contains 0 documentable templates
No known dependencies. Compiling everything
No known dependencies. Compiling everything
E, [2011-08-07T09:46:50.428000 #16654] ERROR -- : Error instantiating 'scalatest' task: java.lang.NoSuchMethodError:
java.lang.String.isEmpty()Z
No known dependencies. Compiling everything
No known dependencies. Compiling everything
E, [2011-08-07T09:46:53.896000 #16654] ERROR -- : Error instantiating 'scalatest' task: java.lang.NoSuchMethodError:
java.lang.String.isEmpty()Z
No known dependencies. Compiling everything
E, [2011-08-07T09:46:56.716000 #16654] ERROR -- : Error instantiating 'scalatest' task: java.lang.NoSuchMethodError:
java.lang.String.isEmpty()Z
No known dependencies. Compiling everything
E, [2011-08-07T09:46:58.715000 #16654] ERROR -- : Error instantiating 'scalatest' task: java.lang.NoSuchMethodError:
java.lang.String.isEmpty()Z
No known dependencies. Compiling everything
E, [2011-08-07T09:47:00.714000 #16654] ERROR -- : Error instantiating 'scalatest' task: java.lang.NoSuchMethodError:
java.lang.String.isEmpty()Z
No known dependencies. Compiling everything
E, [2011-08-07T09:47:03.350000 #16654] ERROR -- : Error instantiating 'scalatest' task: java.lang.NoSuchMethodError:
java.lang.String.isEmpty()Z
No known dependencies. Compiling everything
E, [2011-08-07T09:47:05.984000 #16654] ERROR -- : Error instantiating 'scalatest' task: java.lang.NoSuchMethodError:
java.lang.String.isEmpty()Z
No known dependencies. Compiling everything
E, [2011-08-07T09:47:08.172000 #16654] ERROR -- : Error instantiating 'scalatest' task: java.lang.NoSuchMethodError:
java.lang.String.isEmpty()Z
No known dependencies. Compiling everything
E, [2011-08-07T09:47:10.879000 #16654] ERROR -- : Error instantiating 'scalatest' task: java.lang.NoSuchMethodError:
java.lang.String.isEmpty()Z
No known dependencies. Compiling everything
E, [2011-08-07T09:47:13.664000 #16654] ERROR -- : Error instantiating 'scalatest' task: java.lang.NoSuchMethodError:
java.lang.String.isEmpty()Z
No known dependencies. Compiling everything
Exception in thread "main" java.lang.RuntimeException: java.lang.reflect.InvocationTargetException
	at org.apache.buildr.SpecsSingletonRunner.run(SpecsSingletonRunner.java:54)
	at org.apache.buildr.SpecsSingletonRunner.main(SpecsSingletonRunner.java:35)
Caused by: java.lang.reflect.InvocationTargetException
	at sun.reflect.NativeMethodAccessorImpl.invoke0(Native Method)
	at sun.reflect.NativeMethodAccessorImpl.invoke(NativeMethodAccessorImpl.java:39)
	at sun.reflect.DelegatingMethodAccessorImpl.invoke(DelegatingMethodAccessorImpl.java:25)
	at java.lang.reflect.Method.invoke(Method.java:592)
	at org.apache.buildr.SpecsSingletonRunner.run(SpecsSingletonRunner.java:52)
	... 1 more
Caused by: java.lang.NoSuchMethodError: java.lang.String.isEmpty()Z
	at org.specs.runner.OutputReporter$class.reportSpec(ConsoleReporter.scala:93)
	at org.specs.Specification.reportSpec(Specification.scala:43)
	at org.specs.runner.OutputReporter$$anonfun$report$1.apply(ConsoleReporter.scala:74)
	at org.specs.runner.OutputReporter$$anonSpecification "MySpecs"
  it should
  + add

fun$report$1.apply(ConsoleReporter.scala:74)
	at scala.collection.LinearSeqOptimized$class.foreach(LinearSeqOptimized.scala:61)
	at scala.collection.immutable.List.foreach(List.scala:45)
	at org.specs.runner.OutputReporter$class.report(ConsoleReporter.scala:74)
	at org.specs.Specification.report(Specification.scala:43)
	at org.specs.runner.OutputReporter$class.report(ConsoleReporter.scala:65)
	at org.specs.Specification.report(Specification.scala:43)
	at org.specs.Specification.report(Specification.scala:43)
	at org.specs.runner.Reporter$class.reportSpecs(Reporter.scala:195)
	at org.specs.Specification.reportSpecs(Specification.scala:43)
	at org.specs.runner.Reporter$class.main(Reporter.scala:140)
	at org.specs.Specification.main(Specification.scala:43)
	... 6 more
No known dependencies. Compiling everything
Exception in thread "main" java.lang.RuntimeException: java.lang.reflect.InvocationTargetException
	at org.apache.buildr.SpecsSingletonRunner.run(SpecsSingletonRunner.java:54)
	at org.apache.buildr.SpecsSingletonRunner.main(SpecsSingletonRunner.java:35)
Caused by: java.lang.reflect.InvocationTargetException
	at sun.reflect.NativeMethodAccessorImpl.invoke0(Native Method)
	at sun.reflect.NativeMethodAccessorImpl.invoke(NativeMethodAccessorImpl.java:39)
	at sun.reflect.DelegatingMethodAccessorImpl.invoke(DelegatingMethodAccessorImpl.java:25)
	at java.lang.reflect.Method.invoke(Method.java:592)
	at org.apache.buildr.SpecsSingletonRunner.run(SpecsSingletonRunner.java:52)
	... 1 more
Caused by: java.lang.NoSuchMethodError: java.lang.String.isEmpty()Z
	at org.specs.runner.OutputReporter$class.reportSpec(ConsoleReporter.scala:93)
	at org.specs.Specification.reportSpec(Specification.scala:43)
	at org.specs.runner.OutputReporter$$anonfun$report$1.apply(ConsoleReporter.scala:74)
	at org.specs.runner.OutputReporter$$anonSpecification "MySpecs"
  it should
  + add

fun$report$1.apply(ConsoleReporter.scala:74)
	at scala.collection.LinearSeqOptimized$class.foreach(LinearSeqOptimized.scala:61)
	at scala.collection.immutable.List.foreach(List.scala:45)
	at org.specs.runner.OutputReporter$class.report(ConsoleReporter.scala:74)
	at org.specs.Specification.report(Specification.scala:43)
	at org.specs.runner.OutputReporter$class.report(ConsoleReporter.scala:65)
	at org.specs.Specification.report(Specification.scala:43)
	at org.specs.Specification.report(Specification.scala:43)
	at org.specs.runner.Reporter$class.reportSpecs(Reporter.scala:195)
	at org.specs.Specification.reportSpecs(Specification.scala:43)
	at org.specs.runner.Reporter$class.main(Reporter.scala:140)
	at org.specs.Specification.main(Specification.scala:43)
	... 6 more
No known dependencies. Compiling everything
Exception in thread "main" java.lang.RuntimeException: java.lang.reflect.InvocationTargetException
	at org.apache.buildr.SpecsSingletonRunner.run(SpecsSingletonRunner.java:54)
	at org.apache.buildr.SpecsSingletonRunner.main(SpecsSingletonRunner.java:35)
Caused by: java.lang.reflect.InvocationTargetException
	at sun.reflect.NativeMethodAccessorImpl.invoke0(Native Method)
	at sun.reflect.NativeMethodAccessorImpl.invoke(NativeMethodAccessorImpl.java:39)
	at sun.reflect.DelegatingMethodAccessorImpl.invoke(DelegatingMethodAccessorImpl.java:25)
	at java.lang.reflect.Method.invoke(Method.java:592)
	at org.apache.buildr.SpecsSingletonRunner.run(SpecsSingletonRunner.java:52)
	... 1 more
Caused by: java.lang.NoSuchMethodError: java.lang.String.isEmpty()Z
	at org.specs.runner.OutputReporter$class.reportSpec(ConsoleReporter.scala:93)
	at org.specs.Specification.reportSpec(Specification.scala:43)
	at org.specs.runner.OutputReporter$$anonfun$report$1.apply(ConsoleReporter.scala:74)
	at org.specs.runner.OutputReporter$$anonSpecification "PassingSpecs"
  it should
  + add

fun$report$1.apply(ConsoleReporter.scala:74)
	at scala.collection.LinearSeqOptimized$class.foreach(LinearSeqOptimized.scala:61)
	at scala.collection.immutable.List.foreach(List.scala:45)
	at org.specs.runner.OutputReporter$class.report(ConsoleReporter.scala:74)
	at org.specs.Specification.report(Specification.scala:43)
	at org.specs.runner.OutputReporter$class.report(ConsoleReporter.scala:65)
	at org.specs.Specification.report(Specification.scala:43)
	at org.specs.Specification.report(Specification.scala:43)
	at org.specs.runner.Reporter$class.reportSpecs(Reporter.scala:195)
	at org.specs.Specification.reportSpecs(Specification.scala:43)
	at org.specs.runner.Reporter$class.main(Reporter.scala:140)
	at org.specs.Specification.main(Specification.scala:43)
	... 6 more
No known dependencies. Compiling everything
Exception in thread "main" java.lang.RuntimeException: java.lang.reflect.InvocationTargetException
	at org.apache.buildr.SpecsSingletonRunner.run(SpecsSingletonRunner.java:54)
	at org.apache.buildr.SpecsSingletonRunner.main(SpecsSingletonRunner.java:35)
Caused by: java.lang.reflect.InvocationTargetException
	at sun.reflect.NativeMethodAccessorImpl.invoke0(Native Method)
	at sun.reflect.NativeMethodAccessorImpl.invoke(NativeMethodAccessorImpl.java:39)
	at sun.reflect.DelegatingMethodAccessorImpl.invoke(DelegatingMethodAccessorImpl.java:25)
	at java.lang.reflect.Method.invoke(Method.java:592)
	at org.apache.buildr.SpecsSingletonRunner.run(SpecsSingletonRunner.java:52)
	... 1 more
Caused by: java.lang.NoSuchMethodError: java.lang.String.isEmpty()Z
	at org.specs.runner.OutputReporter$class.reportSpec(ConsoleReporter.scala:93)
	at org.specs.Specification.reportSpec(Specification.scala:43)
	at org.specs.runner.OutputReporter$$anonfun$report$1.apply(ConsoleReporter.scala:74)
	at org.specs.runner.OutputReporter$$anonSpecification "StringSpecs"
  empty string should
  x have a zero length
    '0' is not equal to '1' (StringSpecs.scala:7)

fun$report$1.apply(ConsoleReporter.scala:74)
	at scala.collection.LinearSeqOptimized$class.foreach(LinearSeqOptimized.scala:61)
	at scala.collection.immutable.List.foreach(List.scala:45)
	at org.specs.runner.OutputReporter$class.report(ConsoleReporter.scala:74)
	at org.specs.Specification.report(Specification.scala:43)
	at org.specs.runner.OutputReporter$class.report(ConsoleReporter.scala:65)
	at org.specs.Specification.report(Specification.scala:43)
	at org.specs.Specification.report(Specification.scala:43)
	at org.specs.runner.Reporter$class.reportSpecs(Reporter.scala:195)
	at org.specs.Specification.reportSpecs(Specification.scala:43)
	at org.specs.runner.Reporter$class.main(Reporter.scala:140)
	at org.specs.Specification.main(Specification.scala:43)
	... 6 more
No known dependencies. Compiling everything
No known dependencies. Compiling everything
No known dependencies. Compiling everything
No known dependencies. Compiling everything
No known dependencies. Compiling everything
No known dependencies. Compiling everything
No known dependencies. Compiling everything
No known dependencies. Compiling everything
mkdir -p <https://builds.apache.org/job/buildr-ci-build-jruby-jdk5/ws/tmp/home>
mkdir -p <https://builds.apache.org/job/buildr-ci-build-jruby-jdk5/ws/tmp/home/.buildr>
rake aborted!
ruby -S bundle exec rspec --format html --out _reports/specs.html --backtrace spec/version_requirement_spec.rb
spec/addon/bnd_spec.rb spec/addon/drb_spec.rb spec/addon/jaxb_xjc_spec.rb spec/java/commands_spec.rb
spec/java/external_spec.rb spec/java/ecj_spec.rb spec/java/doc_spec.rb spec/java/run_spec.rb
spec/java/packaging_spec.rb spec/java/tests_spec.rb spec/java/bdd_spec.rb spec/java/emma_spec.rb
spec/java/ant_spec.rb spec/java/cobertura_spec.rb spec/java/compiler_spec.rb spec/java/java_spec.rb
spec/core/compile_spec.rb spec/core/doc_spec.rb spec/core/run_spec.rb spec/core/common_spec.rb
spec/core/cc_spec.rb spec/core/project_spec.rb spec/core/generate_spec.rb spec/core/checks_spec.rb
spec/core/application_spec.rb spec/core/util_spec.rb spec/core/extension_spec.rb spec/core/transport_spec.rb
spec/core/shell_spec.rb spec/core/test_spec.rb spec/core/build_spec.rb spec/ide/idea_spec.rb
spec/ide/eclipse_spec.rb spec/packaging/artifact_spec.rb spec/packaging/artifact_namespace_spec.rb
spec/packaging/packaging_spec.rb spec/packaging/archive_spec.rb spec/scala/doc_spec.rb spec/scala/tests_spec.rb
spec/scala/bdd_spec.rb spec/scala/compiler_spec.rb failed
/home/hudson/.rvm/gems/jruby-1.6.2/gems/rspec-core-2.1.0/lib/rspec/core/rake_task.rb:139:in
`initialize'
/home/hudson/.rvm/gems/jruby-1.6.2/gems/rake-0.8.7/lib/rake.rb:1112:in `verbose'
org/jruby/RubyKernel.java:2063:in `send'
/home/hudson/.rvm/gems/jruby-1.6.2/gems/rspec-core-2.1.0/lib/rspec/core/rake_task.rb:131:in
`initialize'
org/jruby/RubyProc.java:268:in `call'
org/jruby/RubyProc.java:228:in `call'
/home/hudson/.rvm/gems/jruby-1.6.2/gems/rake-0.8.7/lib/rake.rb:636:in `execute'
org/jruby/RubyArray.java:1602:in `each'
/home/hudson/.rvm/gems/jruby-1.6.2/gems/rake-0.8.7/lib/rake.rb:631:in `execute'
/home/hudson/.rvm/gems/jruby-1.6.2/gems/rake-0.8.7/lib/rake.rb:597:in `invoke_with_call_chain'
/home/hudson/.rvm/rubies/jruby-1.6.2/lib/ruby/1.8/monitor.rb:191:in `mon_synchronize'
/home/hudson/.rvm/gems/jruby-1.6.2/gems/rake-0.8.7/lib/rake.rb:590:in `invoke_with_call_chain'
/home/hudson/.rvm/gems/jruby-1.6.2/gems/rake-0.8.7/lib/rake.rb:607:in `invoke_prerequisites'
org/jruby/RubyArray.java:1602:in `each'
/home/hudson/.rvm/gems/jruby-1.6.2/gems/rake-0.8.7/lib/rake.rb:604:in `invoke_prerequisites'
/home/hudson/.rvm/gems/jruby-1.6.2/gems/rake-0.8.7/lib/rake.rb:596:in `invoke_with_call_chain'
/home/hudson/.rvm/rubies/jruby-1.6.2/lib/ruby/1.8/monitor.rb:191:in `mon_synchronize'
/home/hudson/.rvm/gems/jruby-1.6.2/gems/rake-0.8.7/lib/rake.rb:590:in `invoke_with_call_chain'
/home/hudson/.rvm/gems/jruby-1.6.2/gems/rake-0.8.7/lib/rake.rb:583:in `invoke'
/home/hudson/.rvm/gems/jruby-1.6.2/gems/rake-0.8.7/lib/rake.rb:2051:in `invoke_task'
/home/hudson/.rvm/gems/jruby-1.6.2/gems/rake-0.8.7/lib/rake.rb:2029:in `top_level'
org/jruby/RubyArray.java:1602:in `each'
/home/hudson/.rvm/gems/jruby-1.6.2/gems/rake-0.8.7/lib/rake.rb:2029:in `top_level'
/home/hudson/.rvm/gems/jruby-1.6.2/gems/rake-0.8.7/lib/rake.rb:2068:in `standard_exception_handling'
/home/hudson/.rvm/gems/jruby-1.6.2/gems/rake-0.8.7/lib/rake.rb:2023:in `top_level'
/home/hudson/.rvm/gems/jruby-1.6.2/gems/rake-0.8.7/lib/rake.rb:2001:in `run'
/home/hudson/.rvm/gems/jruby-1.6.2/gems/rake-0.8.7/lib/rake.rb:2068:in `standard_exception_handling'
/home/hudson/.rvm/gems/jruby-1.6.2/gems/rake-0.8.7/lib/rake.rb:1998:in `run'
/home/hudson/.rvm/gems/jruby-1.6.2/gems/rake-0.8.7/bin/rake:31:in `(root)'
org/jruby/RubyKernel.java:1063:in `load'
/home/hudson/.rvm/gems/jruby-1.6.2/bin/rake:19:in `(root)'
Recording test results


Mime
View raw message