buildr-ci mailing list archives

Site index · List index
Message view « Date » · « Thread »
Top « Date » · « Thread »
From Apache Jenkins Server <jenk...@builds.apache.org>
Subject Build failed in Jenkins: Buildr-ci-build #226
Date Wed, 08 Jun 2011 01:26:47 GMT
See <https://builds.apache.org/job/Buildr-ci-build/226/changes>

Changes:

[boisvert] BUILDR-586 ScalaTest uses deprecated ant task (Martin Partel)
BUILDR-586 ScalaTest uses deprecated ant task (Martin Partel)# with '#' will be ignored, and
an empty message aborts the commit.

------------------------------------------
[...truncated 501 lines...]
  org.scalatest.TestFailedException
  at org.scalatest.Assertions$class.newAssertionFailedException(Assertions.scala:316)
  at FailingSuite.newAssertionFailedException(FailingSuite.scala:1)
  at org.scalatest.Assertions$class.assert(Assertions.scala:311)
  at FailingSuite.assert(FailingSuite.scala:1)
  at FailingSuite$$anonfun$1.apply$mcV$sp(FailingSuite.scala:3)
  at FailingSuite$$anonfun$1.apply(FailingSuite.scala:3)
  at FailingSuite$$anonfun$1.apply(FailingSuite.scala:3)
  at org.scalatest.FunSuite$$anon$2.apply(FunSuite.scala:1146)
  at org.scalatest.Suite$class.withFixture(Suite.scala:1477)
  at FailingSuite.withFixture(FailingSuite.scala:1)
  at org.scalatest.FunSuite$class.runTest(FunSuite.scala:1143)
  at FailingSuite.runTest(FailingSuite.scala:1)
  at org.scalatest.FunSuite$$anonfun$runTests$1.apply(FunSuite.scala:1252)
  at org.scalatest.FunSuite$$anonfun$runTests$1.apply(FunSuite.scala:1243)
  at scala.collection.LinearSeqOptimized$class.foreach(LinearSeqOptimized.scala:61)
  at scala.collection.immutable.List.foreach(List.scala:45)
  at org.scalatest.FunSuite$class.runTests(FunSuite.scala:1243)
  at FailingSuite.runTests(FailingSuite.scala:1)
  at org.scalatest.Suite$class.run(Suite.scala:1772)
  at FailingSuite.org$scalatest$FunSuite$$super$run(FailingSuite.scala:1)
  at org.scalatest.FunSuite$class.run(FunSuite.scala:1289)
  at FailingSuite.run(FailingSuite.scala:1)
  at org.scalatest.tools.SuiteRunner.run(SuiteRunner.scala:59)
  at org.scalatest.tools.Runner$$anonfun$doRunRunRunADoRunRun$3.apply(Runner.scala:1515)
  at org.scalatest.tools.Runner$$anonfun$doRunRunRunADoRunRun$3.apply(Runner.scala:1512)
  at scala.collection.LinearSeqOptimized$class.foreach(LinearSeqOptimized.scala:61)
  at scala.collection.immutable.List.foreach(List.scala:45)
  at org.scalatest.tools.Runner$.doRunRunRunADoRunRun(Runner.scala:1512)
  at org.scalatest.tools.Runner$$anonfun$runOptionallyWithPassFailReporter$2.apply(Runner.scala:594)
  at org.scalatest.tools.Runner$$anonfun$runOptionallyWithPassFailReporter$2.apply(Runner.scala:593)
  at org.scalatest.tools.Runner$.withClassLoaderAndDispatchReporter(Runner.scala:1556)
  at org.scalatest.tools.Runner$.runOptionallyWithPassFailReporter(Runner.scala:592)
  at org.scalatest.tools.Runner$.run(Runner.scala:495)
  at org.scalatest.tools.ScalaTestAntTask.execute(ScalaTestAntTask.scala:259)
  at org.apache.tools.ant.UnknownElement.execute(UnknownElement.java:291)
Suite Completed - FailingSuite
Run completed in 155 milliseconds.
Total number of tests run: 1
Suites: completed 1, aborted 0
Tests: succeeded 0, failed 1, ignored 0, pending 0
*** 1 TEST FAILED ***
No known dependencies. Compiling everything
Run starting. Expected test count is: 1
Suite Starting - FailingSuite
Test Starting - FailingSuite: failing
TEST FAILED - FailingSuite: failing (FailingSuite.scala:3)
  org.scalatest.TestFailedException
  at org.scalatest.Assertions$class.newAssertionFailedException(Assertions.scala:316)
  at FailingSuite.newAssertionFailedException(FailingSuite.scala:1)
  at org.scalatest.Assertions$class.assert(Assertions.scala:311)
  at FailingSuite.assert(FailingSuite.scala:1)
  at FailingSuite$$anonfun$1.apply$mcV$sp(FailingSuite.scala:3)
  at FailingSuite$$anonfun$1.apply(FailingSuite.scala:3)
  at FailingSuite$$anonfun$1.apply(FailingSuite.scala:3)
  at org.scalatest.FunSuite$$anon$2.apply(FunSuite.scala:1146)
  at org.scalatest.Suite$class.withFixture(Suite.scala:1477)
  at FailingSuite.withFixture(FailingSuite.scala:1)
  at org.scalatest.FunSuite$class.runTest(FunSuite.scala:1143)
  at FailingSuite.runTest(FailingSuite.scala:1)
  at org.scalatest.FunSuite$$anonfun$runTests$1.apply(FunSuite.scala:1252)
  at org.scalatest.FunSuite$$anonfun$runTests$1.apply(FunSuite.scala:1243)
  at scala.collection.LinearSeqOptimized$class.foreach(LinearSeqOptimized.scala:61)
  at scala.collection.immutable.List.foreach(List.scala:45)
  at org.scalatest.FunSuite$class.runTests(FunSuite.scala:1243)
  at FailingSuite.runTests(FailingSuite.scala:1)
  at org.scalatest.Suite$class.run(Suite.scala:1772)
  at FailingSuite.org$scalatest$FunSuite$$super$run(FailingSuite.scala:1)
  at org.scalatest.FunSuite$class.run(FunSuite.scala:1289)
  at FailingSuite.run(FailingSuite.scala:1)
  at org.scalatest.tools.SuiteRunner.run(SuiteRunner.scala:59)
  at org.scalatest.tools.Runner$$anonfun$doRunRunRunADoRunRun$3.apply(Runner.scala:1515)
  at org.scalatest.tools.Runner$$anonfun$doRunRunRunADoRunRun$3.apply(Runner.scala:1512)
  at scala.collection.LinearSeqOptimized$class.foreach(LinearSeqOptimized.scala:61)
  at scala.collection.immutable.List.foreach(List.scala:45)
  at org.scalatest.tools.Runner$.doRunRunRunADoRunRun(Runner.scala:1512)
  at org.scalatest.tools.Runner$$anonfun$runOptionallyWithPassFailReporter$2.apply(Runner.scala:594)
  at org.scalatest.tools.Runner$$anonfun$runOptionallyWithPassFailReporter$2.apply(Runner.scala:593)
  at org.scalatest.tools.Runner$.withClassLoaderAndDispatchReporter(Runner.scala:1556)
  at org.scalatest.tools.Runner$.runOptionallyWithPassFailReporter(Runner.scala:592)
  at org.scalatest.tools.Runner$.run(Runner.scala:495)
  at org.scalatest.tools.ScalaTestAntTask.execute(ScalaTestAntTask.scala:259)
  at org.apache.tools.ant.UnknownElement.execute(UnknownElement.java:291)
Suite Completed - FailingSuite
Run completed in 149 milliseconds.
Total number of tests run: 1
Suites: completed 1, aborted 0
Tests: succeeded 0, failed 1, ignored 0, pending 0
*** 1 TEST FAILED ***
No known dependencies. Compiling everything
Run starting. Expected test count is: 1
Suite Starting - PassingSuite
Test Starting - PassingSuite: passing
Test Succeeded - PassingSuite: passing
Suite Completed - PassingSuite
Run completed in 141 milliseconds.
Total number of tests run: 1
Suites: completed 1, aborted 0
Tests: succeeded 1, failed 0, ignored 0, pending 0
All tests passed.
No known dependencies. Compiling everything
Run starting. Expected test count is: 1
Suite Starting - PassingSuite
Test Starting - PassingSuite: passing
Test Succeeded - PassingSuite: passing
Suite Completed - PassingSuite
Run completed in 139 milliseconds.
Total number of tests run: 1
Suites: completed 1, aborted 0
Tests: succeeded 1, failed 0, ignored 0, pending 0
All tests passed.
No known dependencies. Compiling everything
Run starting. Expected test count is: 1
Suite Starting - PropertyTestSuite
Test Starting - PropertyTestSuite: testProperty
Test Succeeded - PropertyTestSuite: testProperty
Suite Completed - PropertyTestSuite
Run completed in 141 milliseconds.
Total number of tests run: 1
Suites: completed 1, aborted 0
Tests: succeeded 1, failed 0, ignored 0, pending 0
All tests passed.
No known dependencies. Compiling everything
Run starting. Expected test count is: 2
Suite Starting - MySuite
Test Starting - MySuite: list concatenation
Test Succeeded - MySuite: list concatenation
Test Starting - MySuite: list concatenation using a test method
Test Succeeded - MySuite: list concatenation using a test method
Suite Completed - MySuite
Run completed in 604 milliseconds.
Total number of tests run: 2
Suites: completed 1, aborted 0
Tests: succeeded 2, failed 0, ignored 0, pending 0
All tests passed.
No known dependencies. Compiling everything
Run starting. Expected test count is: 5
Suite Starting - StringSuite
Test Starting - StringSuite: startsWith
Test Succeeded - StringSuite: startsWith
Test Starting - StringSuite: endsWith
Test Succeeded - StringSuite: endsWith
Test Starting - StringSuite: concat
TEST FAILED - StringSuite: concat (Checkers.scala:241)
  Falsified after 0 passed tests:
> ARG_0 = ""
> ARG_1 = ""
  org.scalatest.prop.PropertyTestFailedException: Falsified after 0 passed tests:
> ARG_0 = ""
> ARG_1 = ""
  at org.scalatest.prop.Checkers$class.check(Checkers.scala:241)
  at StringSuite.check(StringSuite.scala:6)
  at org.scalatest.prop.Checkers$class.check(Checkers.scala:304)
  at StringSuite.check(StringSuite.scala:6)
  at org.scalatest.prop.Checkers$class.check(Checkers.scala:115)
  at StringSuite.check(StringSuite.scala:6)
  at StringSuite$$anonfun$3.apply$mcV$sp(StringSuite.scala:17)
  at StringSuite$$anonfun$3.apply(StringSuite.scala:17)
  at StringSuite$$anonfun$3.apply(StringSuite.scala:17)
  at org.scalatest.FunSuite$$anon$2.apply(FunSuite.scala:1146)
  at org.scalatest.Suite$class.withFixture(Suite.scala:1477)
  at StringSuite.withFixture(StringSuite.scala:6)
  at org.scalatest.FunSuite$class.runTest(FunSuite.scala:1143)
  at StringSuite.runTest(StringSuite.scala:6)
  at org.scalatest.FunSuite$$anonfun$runTests$1.apply(FunSuite.scala:1252)
  at org.scalatest.FunSuite$$anonfun$runTests$1.apply(FunSuite.scala:1243)
  at scala.collection.LinearSeqOptimized$class.foreach(LinearSeqOptimized.scala:61)
  at scala.collection.immutable.List.foreach(List.scala:45)
  at org.scalatest.FunSuite$class.runTests(FunSuite.scala:1243)
  at StringSuite.runTests(StringSuite.scala:6)
  at org.scalatest.Suite$class.run(Suite.scala:1772)
  at StringSuite.org$scalatest$FunSuite$$super$run(StringSuite.scala:6)
  at org.scalatest.FunSuite$class.run(FunSuite.scala:1289)
  at StringSuite.run(StringSuite.scala:6)
  at org.scalatest.tools.SuiteRunner.run(SuiteRunner.scala:59)
  at org.scalatest.tools.Runner$$anonfun$doRunRunRunADoRunRun$3.apply(Runner.scala:1515)
  at org.scalatest.tools.Runner$$anonfun$doRunRunRunADoRunRun$3.apply(Runner.scala:1512)
  at scala.collection.LinearSeqOptimized$class.foreach(LinearSeqOptimized.scala:61)
  at scala.collection.immutable.List.foreach(List.scala:45)
  at org.scalatest.tools.Runner$.doRunRunRunADoRunRun(Runner.scala:1512)
  at org.scalatest.tools.Runner$$anonfun$runOptionallyWithPassFailReporter$2.apply(Runner.scala:594)
  at org.scalatest.tools.Runner$$anonfun$runOptionallyWithPassFailReporter$2.apply(Runner.scala:593)
  at org.scalatest.tools.Runner$.withClassLoaderAndDispatchReporter(Runner.scala:1556)
  at org.scalatest.tools.Runner$.runOptionallyWithPassFailReporter(Runner.scala:592)
  at org.scalatest.tools.Runner$.run(Runner.scala:495)
  at org.scalatest.tools.ScalaTestAntTask.execute(ScalaTestAntTask.scala:259)
  at org.apache.tools.ant.UnknownElement.execute(UnknownElement.java:291)
Test Starting - StringSuite: substring2
Test Succeeded - StringSuite: substring2
Test Starting - StringSuite: substring3
Test Succeeded - StringSuite: substring3
Suite Completed - StringSuite
Run completed in 525 milliseconds.
Total number of tests run: 5
Suites: completed 1, aborted 0
Tests: succeeded 4, failed 1, ignored 0, pending 0
*** 1 TEST FAILED ***
No known dependencies. Compiling everything
Specification "MySpecs"
  it should
  + add

Total for specification "MySpecs":
Finished in 0 second, 64 ms
1 example, 1 expectation, 0 failure, 0 error

No known dependencies. Compiling everything
Specification "MySpecs"
  it should
  + add

Total for specification "MySpecs":
Finished in 0 second, 62 ms
1 example, 1 expectation, 0 failure, 0 error

No known dependencies. Compiling everything
Specification "PassingSpecs"
  it should
  + add

Total for specification "PassingSpecs":
Finished in 0 second, 62 ms
1 example, 1 expectation, 0 failure, 0 error

No known dependencies. Compiling everything
Specification "StringSpecs"
  empty string should
  x have a zero length
    '0' is not equal to '1' (StringSpecs.scala:7)

Total for specification "StringSpecs":
Finished in 0 second, 64 ms
1 example, 1 expectation, 1 failure, 0 error

No known dependencies. Compiling everything
No known dependencies. Compiling everything
No known dependencies. Compiling everything
No known dependencies. Compiling everything
No known dependencies. Compiling everything
No known dependencies. Compiling everything
No known dependencies. Compiling everything
No known dependencies. Compiling everything
mkdir -p <https://builds.apache.org/job/Buildr-ci-build/ws/tmp/home>
mkdir -p <https://builds.apache.org/job/Buildr-ci-build/ws/tmp/home/.buildr>
rake aborted!
ruby -S bundle exec rspec --format html --out _reports/specs.html --backtrace spec/groovy/doc_spec.rb
spec/groovy/bdd_spec.rb spec/groovy/compiler_spec.rb spec/addon/bnd_spec.rb spec/addon/drb_spec.rb
spec/addon/jaxb_xjc_spec.rb spec/java/commands_spec.rb spec/java/external_spec.rb spec/java/ecj_spec.rb
spec/java/doc_spec.rb spec/java/run_spec.rb spec/java/packaging_spec.rb spec/java/tests_spec.rb
spec/java/bdd_spec.rb spec/java/emma_spec.rb spec/java/ant_spec.rb spec/java/cobertura_spec.rb
spec/java/compiler_spec.rb spec/java/java_spec.rb spec/core/compile_spec.rb spec/core/doc_spec.rb
spec/core/run_spec.rb spec/core/common_spec.rb spec/core/cc_spec.rb spec/core/project_spec.rb
spec/core/generate_spec.rb spec/core/checks_spec.rb spec/core/application_spec.rb spec/core/util_spec.rb
spec/core/extension_spec.rb spec/core/transport_spec.rb spec/core/shell_spec.rb spec/core/test_spec.rb
spec/core/build_spec.rb spec/ide/idea_spec.rb spec/ide/eclipse_spec.rb spec/packaging/artifact_spec.rb
spec/packaging/artifact_namespace_spec.rb spec/packaging/packaging_spec.rb spec/packaging/archive_spec.rb
spec/version_requirement_spec.rb spec/scala/doc_spec.rb spec/scala/tests_spec.rb spec/scala/bdd_spec.rb
spec/scala/compiler_spec.rb failed

(See full trace by running task with --trace)
Recording test results


Mime
View raw message