buildr-ci mailing list archives

Site index · List index
Message view « Date » · « Thread »
Top « Date » · « Thread »
From Apache Hudson Server <hud...@hudson.apache.org>
Subject Build failed in Hudson: Buildr-ci-build #160
Date Tue, 19 Oct 2010 17:34:28 GMT
See <https://hudson.apache.org/hudson/job/Buildr-ci-build/160/changes>

Changes:

[boisvert] Refactor Buildr::Shell module.
Complete standard interface:  shell.with, shell.using and shell.classpath methods.       
 
Move Buildr::Shell::JavaRebel to Buildr::JRebel module
Add minimal specs for Buildr::Shell
(Needed before I go and add new features)

[boisvert] Fix Run::Base.to_sym for case where specify :name => :foo isn't used
Cleanup runner? method.

------------------------------------------
[...truncated 482 lines...]
Test Succeeded - StringSuite: substring2
Test Starting - StringSuite: substring3
Test Succeeded - StringSuite: substring3
Suite Completed - StringSuite
Run completed in 470 milliseconds.
Total number of tests run: 5
Suites: completed 1, aborted 0
Tests: succeeded 4, failed 1, ignored 0, pending 0
*** 1 TEST FAILED ***
.....No known dependencies. Compiling everything
Specification "MySpecs"
  it should
  + add

Total for specification "MySpecs":
Finished in 0 second, 62 ms
1 example, 1 expectation, 0 failure, 0 error

.No known dependencies. Compiling everything
Specification "MySpecs"
  it should
  + add

Total for specification "MySpecs":
Finished in 0 second, 59 ms
1 example, 1 expectation, 0 failure, 0 error

.No known dependencies. Compiling everything
Specification "PassingSpecs"
  it should
  + add

Total for specification "PassingSpecs":
Finished in 0 second, 59 ms
1 example, 1 expectation, 0 failure, 0 error

.No known dependencies. Compiling everything
Specification "StringSpecs"
  empty string should
  x have a zero length
    '0' is not equal to '1' (StringSpecs.scala:7)

Total for specification "StringSpecs":
Finished in 0 second, 61 ms
1 example, 1 expectation, 1 failure, 0 error

.......No known dependencies. Compiling everything
No known dependencies. Compiling everything
.No known dependencies. Compiling everything
.No known dependencies. Compiling everything
.........No known dependencies. Compiling everything
No known dependencies. Compiling everything
.No known dependencies. Compiling everything
.No known dependencies. Compiling everything
....mkdir -p <https://hudson.apache.org/hudson/job/Buildr-ci-build/ws/tmp/home>
.mkdir -p <https://hudson.apache.org/hudson/job/Buildr-ci-build/ws/tmp/home/.buildr>
.......................

Pending:

Buildr::Compiler::Ecj should not issue warnings for type casting when warnings are set to
warn:none, by default (RJB doesn't support well instantiating a class that has several constructors)
./spec/java/ecj_spec.rb:77

Buildr::Compiler::Ecj should issue warnings for type casting when warnings are set (RJB doesn't
support well instantiating a class that has several constructors)
./spec/java/ecj_spec.rb:86

1)
'Buildr::Run::JavaRunner should fail on error' FAILED
expected RuntimeError with message matching /Failed to execute java/ but nothing was raised
/home/toulmean/buildr-gems/gems/rspec-1.3.0/lib/spec/expectations/fail_with.rb:41:in `fail_with'
/home/toulmean/buildr-gems/gems/rspec-1.3.0/lib/spec/expectations/handler.rb:21:in `handle_matcher'
/home/toulmean/buildr-gems/gems/rspec-1.3.0/lib/spec/expectations/extensions/kernel.rb:27:in
`should'
./spec/java/run_spec.rb:26:
/home/toulmean/buildr-gems/gems/rspec-1.3.0/lib/spec/example/example_methods.rb:40:in `instance_eval'
/home/toulmean/buildr-gems/gems/rspec-1.3.0/lib/spec/example/example_methods.rb:40:in `execute'
/usr/lib/ruby/1.8/timeout.rb:53:in `timeout'
/home/toulmean/buildr-gems/gems/rspec-1.3.0/lib/spec/example/example_methods.rb:37:in `execute'
/home/toulmean/buildr-gems/gems/rspec-1.3.0/lib/spec/example/example_group_methods.rb:214:in
`run_examples'
/home/toulmean/buildr-gems/gems/rspec-1.3.0/lib/spec/example/example_group_methods.rb:212:in
`each'
/home/toulmean/buildr-gems/gems/rspec-1.3.0/lib/spec/example/example_group_methods.rb:212:in
`run_examples'
/home/toulmean/buildr-gems/gems/rspec-1.3.0/lib/spec/example/example_group_methods.rb:103:in
`run'
/home/toulmean/buildr-gems/gems/rspec-1.3.0/lib/spec/runner/example_group_runner.rb:23:in
`run'
/home/toulmean/buildr-gems/gems/rspec-1.3.0/lib/spec/runner/example_group_runner.rb:22:in
`each'
/home/toulmean/buildr-gems/gems/rspec-1.3.0/lib/spec/runner/example_group_runner.rb:22:in
`run'
/home/toulmean/buildr-gems/gems/rspec-1.3.0/lib/spec/runner/options.rb:152:in `run_examples'
/home/toulmean/buildr-gems/gems/rspec-1.3.0/lib/spec/runner/command_line.rb:9:in `run'
/home/toulmean/buildr-gems/gems/rspec-1.3.0/bin/spec:5:

2)
Spec::Mocks::MockExpectationError in 'Buildr::Run::JavaRunner should accept :main option as
an array including parameters for the main class'
Java::Commands expected :java with (no args) once, but received it 0 times
./spec/java/run_spec.rb:48:
/home/toulmean/buildr-gems/gems/rspec-1.3.0/lib/spec/mocks/error_generator.rb:64:in `__raise'
/home/toulmean/buildr-gems/gems/rspec-1.3.0/lib/spec/mocks/error_generator.rb:27:in `raise_expectation_error'
/home/toulmean/buildr-gems/gems/rspec-1.3.0/lib/spec/mocks/message_expectation.rb:248:in `generate_error'
/home/toulmean/buildr-gems/gems/rspec-1.3.0/lib/spec/mocks/message_expectation.rb:211:in `verify_messages_received'
/home/toulmean/buildr-gems/gems/rspec-1.3.0/lib/spec/mocks/proxy.rb:224:in `verify_expectations'
/home/toulmean/buildr-gems/gems/rspec-1.3.0/lib/spec/mocks/proxy.rb:224:in `map'
/home/toulmean/buildr-gems/gems/rspec-1.3.0/lib/spec/mocks/proxy.rb:224:in `verify_expectations'
/home/toulmean/buildr-gems/gems/rspec-1.3.0/lib/spec/mocks/proxy.rb:79:in `verify'
/home/toulmean/buildr-gems/gems/rspec-1.3.0/lib/spec/mocks/methods.rb:76:in `rspec_verify'
/home/toulmean/buildr-gems/gems/rspec-1.3.0/lib/spec/mocks/space.rb:10:in `verify_all'
/home/toulmean/buildr-gems/gems/rspec-1.3.0/lib/spec/mocks/space.rb:9:in `each'
/home/toulmean/buildr-gems/gems/rspec-1.3.0/lib/spec/mocks/space.rb:9:in `verify_all'
/home/toulmean/buildr-gems/gems/rspec-1.3.0/lib/spec/adapters/mock_frameworks/rspec.rb:13:in
`verify_mocks_for_rspec'
/home/toulmean/buildr-gems/gems/rspec-1.3.0/lib/spec/example/example_methods.rb:133:in `after_each_example'
/home/toulmean/buildr-gems/gems/rspec-1.3.0/lib/spec/example/example_methods.rb:47:in `execute'
/usr/lib/ruby/1.8/timeout.rb:53:in `timeout'
/home/toulmean/buildr-gems/gems/rspec-1.3.0/lib/spec/example/example_methods.rb:37:in `execute'
/home/toulmean/buildr-gems/gems/rspec-1.3.0/lib/spec/example/example_group_methods.rb:214:in
`run_examples'
/home/toulmean/buildr-gems/gems/rspec-1.3.0/lib/spec/example/example_group_methods.rb:212:in
`each'
/home/toulmean/buildr-gems/gems/rspec-1.3.0/lib/spec/example/example_group_methods.rb:212:in
`run_examples'
/home/toulmean/buildr-gems/gems/rspec-1.3.0/lib/spec/example/example_group_methods.rb:103:in
`run'
/home/toulmean/buildr-gems/gems/rspec-1.3.0/lib/spec/runner/example_group_runner.rb:23:in
`run'
/home/toulmean/buildr-gems/gems/rspec-1.3.0/lib/spec/runner/example_group_runner.rb:22:in
`each'
/home/toulmean/buildr-gems/gems/rspec-1.3.0/lib/spec/runner/example_group_runner.rb:22:in
`run'
/home/toulmean/buildr-gems/gems/rspec-1.3.0/lib/spec/runner/options.rb:152:in `run_examples'
/home/toulmean/buildr-gems/gems/rspec-1.3.0/lib/spec/runner/command_line.rb:9:in `run'
/home/toulmean/buildr-gems/gems/rspec-1.3.0/bin/spec:5:

3)
Spec::Mocks::MockExpectationError in 'Buildr::Run::JavaRunner should accept :java_args and
pass them to java'
Java::Commands expected :java with (no args) once, but received it 0 times
./spec/java/run_spec.rb:58:
/home/toulmean/buildr-gems/gems/rspec-1.3.0/lib/spec/mocks/error_generator.rb:64:in `__raise'
/home/toulmean/buildr-gems/gems/rspec-1.3.0/lib/spec/mocks/error_generator.rb:27:in `raise_expectation_error'
/home/toulmean/buildr-gems/gems/rspec-1.3.0/lib/spec/mocks/message_expectation.rb:248:in `generate_error'
/home/toulmean/buildr-gems/gems/rspec-1.3.0/lib/spec/mocks/message_expectation.rb:211:in `verify_messages_received'
/home/toulmean/buildr-gems/gems/rspec-1.3.0/lib/spec/mocks/proxy.rb:224:in `verify_expectations'
/home/toulmean/buildr-gems/gems/rspec-1.3.0/lib/spec/mocks/proxy.rb:224:in `map'
/home/toulmean/buildr-gems/gems/rspec-1.3.0/lib/spec/mocks/proxy.rb:224:in `verify_expectations'
/home/toulmean/buildr-gems/gems/rspec-1.3.0/lib/spec/mocks/proxy.rb:79:in `verify'
/home/toulmean/buildr-gems/gems/rspec-1.3.0/lib/spec/mocks/methods.rb:76:in `rspec_verify'
/home/toulmean/buildr-gems/gems/rspec-1.3.0/lib/spec/mocks/space.rb:10:in `verify_all'
/home/toulmean/buildr-gems/gems/rspec-1.3.0/lib/spec/mocks/space.rb:9:in `each'
/home/toulmean/buildr-gems/gems/rspec-1.3.0/lib/spec/mocks/space.rb:9:in `verify_all'
/home/toulmean/buildr-gems/gems/rspec-1.3.0/lib/spec/adapters/mock_frameworks/rspec.rb:13:in
`verify_mocks_for_rspec'
/home/toulmean/buildr-gems/gems/rspec-1.3.0/lib/spec/example/example_methods.rb:133:in `after_each_example'
/home/toulmean/buildr-gems/gems/rspec-1.3.0/lib/spec/example/example_methods.rb:47:in `execute'
/usr/lib/ruby/1.8/timeout.rb:53:in `timeout'
/home/toulmean/buildr-gems/gems/rspec-1.3.0/lib/spec/example/example_methods.rb:37:in `execute'
/home/toulmean/buildr-gems/gems/rspec-1.3.0/lib/spec/example/example_group_methods.rb:214:in
`run_examples'
/home/toulmean/buildr-gems/gems/rspec-1.3.0/lib/spec/example/example_group_methods.rb:212:in
`each'
/home/toulmean/buildr-gems/gems/rspec-1.3.0/lib/spec/example/example_group_methods.rb:212:in
`run_examples'
/home/toulmean/buildr-gems/gems/rspec-1.3.0/lib/spec/example/example_group_methods.rb:103:in
`run'
/home/toulmean/buildr-gems/gems/rspec-1.3.0/lib/spec/runner/example_group_runner.rb:23:in
`run'
/home/toulmean/buildr-gems/gems/rspec-1.3.0/lib/spec/runner/example_group_runner.rb:22:in
`each'
/home/toulmean/buildr-gems/gems/rspec-1.3.0/lib/spec/runner/example_group_runner.rb:22:in
`run'
/home/toulmean/buildr-gems/gems/rspec-1.3.0/lib/spec/runner/options.rb:152:in `run_examples'
/home/toulmean/buildr-gems/gems/rspec-1.3.0/lib/spec/runner/command_line.rb:9:in `run'
/home/toulmean/buildr-gems/gems/rspec-1.3.0/bin/spec:5:

4)
Spec::Mocks::MockExpectationError in 'Buildr::Run::JavaRunner should accept :properties and
pass them as -Dproperty=value to java'
Java::Commands expected :java with (no args) once, but received it 0 times
./spec/java/run_spec.rb:69:
/home/toulmean/buildr-gems/gems/rspec-1.3.0/lib/spec/mocks/error_generator.rb:64:in `__raise'
/home/toulmean/buildr-gems/gems/rspec-1.3.0/lib/spec/mocks/error_generator.rb:27:in `raise_expectation_error'
/home/toulmean/buildr-gems/gems/rspec-1.3.0/lib/spec/mocks/message_expectation.rb:248:in `generate_error'
/home/toulmean/buildr-gems/gems/rspec-1.3.0/lib/spec/mocks/message_expectation.rb:211:in `verify_messages_received'
/home/toulmean/buildr-gems/gems/rspec-1.3.0/lib/spec/mocks/proxy.rb:224:in `verify_expectations'
/home/toulmean/buildr-gems/gems/rspec-1.3.0/lib/spec/mocks/proxy.rb:224:in `map'
/home/toulmean/buildr-gems/gems/rspec-1.3.0/lib/spec/mocks/proxy.rb:224:in `verify_expectations'
/home/toulmean/buildr-gems/gems/rspec-1.3.0/lib/spec/mocks/proxy.rb:79:in `verify'
/home/toulmean/buildr-gems/gems/rspec-1.3.0/lib/spec/mocks/methods.rb:76:in `rspec_verify'
/home/toulmean/buildr-gems/gems/rspec-1.3.0/lib/spec/mocks/space.rb:10:in `verify_all'
/home/toulmean/buildr-gems/gems/rspec-1.3.0/lib/spec/mocks/space.rb:9:in `each'
/home/toulmean/buildr-gems/gems/rspec-1.3.0/lib/spec/mocks/space.rb:9:in `verify_all'
/home/toulmean/buildr-gems/gems/rspec-1.3.0/lib/spec/adapters/mock_frameworks/rspec.rb:13:in
`verify_mocks_for_rspec'
/home/toulmean/buildr-gems/gems/rspec-1.3.0/lib/spec/example/example_methods.rb:133:in `after_each_example'
/home/toulmean/buildr-gems/gems/rspec-1.3.0/lib/spec/example/example_methods.rb:47:in `execute'
/usr/lib/ruby/1.8/timeout.rb:53:in `timeout'
/home/toulmean/buildr-gems/gems/rspec-1.3.0/lib/spec/example/example_methods.rb:37:in `execute'
/home/toulmean/buildr-gems/gems/rspec-1.3.0/lib/spec/example/example_group_methods.rb:214:in
`run_examples'
/home/toulmean/buildr-gems/gems/rspec-1.3.0/lib/spec/example/example_group_methods.rb:212:in
`each'
/home/toulmean/buildr-gems/gems/rspec-1.3.0/lib/spec/example/example_group_methods.rb:212:in
`run_examples'
/home/toulmean/buildr-gems/gems/rspec-1.3.0/lib/spec/example/example_group_methods.rb:103:in
`run'
/home/toulmean/buildr-gems/gems/rspec-1.3.0/lib/spec/runner/example_group_runner.rb:23:in
`run'
/home/toulmean/buildr-gems/gems/rspec-1.3.0/lib/spec/runner/example_group_runner.rb:22:in
`each'
/home/toulmean/buildr-gems/gems/rspec-1.3.0/lib/spec/runner/example_group_runner.rb:22:in
`run'
/home/toulmean/buildr-gems/gems/rspec-1.3.0/lib/spec/runner/options.rb:152:in `run_examples'
/home/toulmean/buildr-gems/gems/rspec-1.3.0/lib/spec/runner/command_line.rb:9:in `run'
/home/toulmean/buildr-gems/gems/rspec-1.3.0/bin/spec:5:

5)
RuntimeError in 'Buildr::RSpec should read passed specs from result yaml'
Tests failed!
<https://hudson.apache.org/hudson/job/Buildr-ci-build/ws/lib/buildr/core/test.rb>:531:in
`run_tests'
<https://hudson.apache.org/hudson/job/Buildr-ci-build/ws/lib/buildr/core/test.rb>:242:
/home/toulmean/buildr-gems/gems/rake-0.8.7/lib/rake.rb:636:in `call'
/home/toulmean/buildr-gems/gems/rake-0.8.7/lib/rake.rb:636:in `execute_without_a_record'
/home/toulmean/buildr-gems/gems/rake-0.8.7/lib/rake.rb:631:in `each'
/home/toulmean/buildr-gems/gems/rake-0.8.7/lib/rake.rb:631:in `execute_without_a_record'
<https://hudson.apache.org/hudson/job/Buildr-ci-build/ws/spec/spec_helpers.rb>:154:in
`execute'
<https://hudson.apache.org/hudson/job/Buildr-ci-build/ws/lib/buildr/core/test.rb>:270:in
`execute'
<https://hudson.apache.org/hudson/job/Buildr-ci-build/ws/lib/buildr/core/application.rb>:664:in
`invoke_with_call_chain'
/usr/lib/ruby/1.8/monitor.rb:242:in `synchronize'
<https://hudson.apache.org/hudson/job/Buildr-ci-build/ws/lib/buildr/core/application.rb>:650:in
`invoke_with_call_chain'
<https://hudson.apache.org/hudson/job/Buildr-ci-build/ws/lib/buildr/core/application.rb>:645:in
`invoke'
./spec/java/bdd_spec.rb:33:
/home/toulmean/buildr-gems/gems/rspec-1.3.0/lib/spec/example/example_methods.rb:40:in `instance_eval'
/home/toulmean/buildr-gems/gems/rspec-1.3.0/lib/spec/example/example_methods.rb:40:in `execute'
/usr/lib/ruby/1.8/timeout.rb:53:in `timeout'
/home/toulmean/buildr-gems/gems/rspec-1.3.0/lib/spec/example/example_methods.rb:37:in `execute'
/home/toulmean/buildr-gems/gems/rspec-1.3.0/lib/spec/example/example_group_methods.rb:214:in
`run_examples'
/home/toulmean/buildr-gems/gems/rspec-1.3.0/lib/spec/example/example_group_methods.rb:212:in
`each'
/home/toulmean/buildr-gems/gems/rspec-1.3.0/lib/spec/example/example_group_methods.rb:212:in
`run_examples'
/home/toulmean/buildr-gems/gems/rspec-1.3.0/lib/spec/example/example_group_methods.rb:103:in
`run'
/home/toulmean/buildr-gems/gems/rspec-1.3.0/lib/spec/runner/example_group_runner.rb:23:in
`run'
/home/toulmean/buildr-gems/gems/rspec-1.3.0/lib/spec/runner/example_group_runner.rb:22:in
`each'
/home/toulmean/buildr-gems/gems/rspec-1.3.0/lib/spec/runner/example_group_runner.rb:22:in
`run'
/home/toulmean/buildr-gems/gems/rspec-1.3.0/lib/spec/runner/options.rb:152:in `run_examples'
/home/toulmean/buildr-gems/gems/rspec-1.3.0/lib/spec/runner/command_line.rb:9:in `run'
/home/toulmean/buildr-gems/gems/rspec-1.3.0/bin/spec:5:

6)
'Buildr::RSpec should read result yaml to obtain the list of failed specs' FAILED

expected ["<https://hudson.apache.org/hudson/job/Buildr-ci-build/ws/tmp/src/spec/ruby/error_spec.rb",>
"<https://hudson.apache.org/hudson/job/Buildr-ci-build/ws/tmp/src/spec/ruby/failure_spec.rb"]>
     got ["<https://hudson.apache.org/hudson/job/Buildr-ci-build/ws/tmp/src/spec/ruby/error_spec.rb",>
"<https://hudson.apache.org/hudson/job/Buildr-ci-build/ws/tmp/src/spec/ruby/failure_spec.rb",>
"<https://hudson.apache.org/hudson/job/Buildr-ci-build/ws/tmp/src/spec/ruby/success_spec.rb"]>

(compared using eql?)
/home/toulmean/buildr-gems/gems/rspec-1.3.0/lib/spec/expectations/fail_with.rb:41:in `fail_with'
/home/toulmean/buildr-gems/gems/rspec-1.3.0/lib/spec/expectations/handler.rb:21:in `handle_matcher'
/home/toulmean/buildr-gems/gems/rspec-1.3.0/lib/spec/expectations/extensions/kernel.rb:27:in
`should'
./spec/java/bdd_spec.rb:47:
/home/toulmean/buildr-gems/gems/rspec-1.3.0/lib/spec/example/example_methods.rb:40:in `instance_eval'
/home/toulmean/buildr-gems/gems/rspec-1.3.0/lib/spec/example/example_methods.rb:40:in `execute'
/usr/lib/ruby/1.8/timeout.rb:53:in `timeout'
/home/toulmean/buildr-gems/gems/rspec-1.3.0/lib/spec/example/example_methods.rb:37:in `execute'
/home/toulmean/buildr-gems/gems/rspec-1.3.0/lib/spec/example/example_group_methods.rb:214:in
`run_examples'
/home/toulmean/buildr-gems/gems/rspec-1.3.0/lib/spec/example/example_group_methods.rb:212:in
`each'
/home/toulmean/buildr-gems/gems/rspec-1.3.0/lib/spec/example/example_group_methods.rb:212:in
`run_examples'
/home/toulmean/buildr-gems/gems/rspec-1.3.0/lib/spec/example/example_group_methods.rb:103:in
`run'
/home/toulmean/buildr-gems/gems/rspec-1.3.0/lib/spec/runner/example_group_runner.rb:23:in
`run'
/home/toulmean/buildr-gems/gems/rspec-1.3.0/lib/spec/runner/example_group_runner.rb:22:in
`each'
/home/toulmean/buildr-gems/gems/rspec-1.3.0/lib/spec/runner/example_group_runner.rb:22:in
`run'
/home/toulmean/buildr-gems/gems/rspec-1.3.0/lib/spec/runner/options.rb:152:in `run_examples'
/home/toulmean/buildr-gems/gems/rspec-1.3.0/lib/spec/runner/command_line.rb:9:in `run'
/home/toulmean/buildr-gems/gems/rspec-1.3.0/bin/spec:5:

Finished in 347.557261 seconds

2132 examples, 6 failures, 2 pending
rake aborted!
Command /usr/bin/ruby1.8 -I"lib"  "/home/toulmean/buildr-gems/gems/rspec-1.3.0/bin/spec" "spec/groovy/bdd_spec.rb"
"spec/groovy/compiler_spec.rb" "spec/addon/drb_spec.rb" "spec/java/commands_spec.rb" "spec/java/external_spec.rb"
"spec/java/ecj_spec.rb" "spec/java/doc_spec.rb" "spec/java/run_spec.rb" "spec/java/packaging_spec.rb"
"spec/java/tests_spec.rb" "spec/java/bdd_spec.rb" "spec/java/emma_spec.rb" "spec/java/ant_spec.rb"
"spec/java/cobertura_spec.rb" "spec/java/compiler_spec.rb" "spec/java/java_spec.rb" "spec/core/compile_spec.rb"
"spec/core/doc_spec.rb" "spec/core/run_spec.rb" "spec/core/common_spec.rb" "spec/core/cc_spec.rb"
"spec/core/project_spec.rb" "spec/core/generate_spec.rb" "spec/core/checks_spec.rb" "spec/core/application_spec.rb"
"spec/core/util_spec.rb" "spec/core/extension_spec.rb" "spec/core/transport_spec.rb" "spec/core/shell_spec.rb"
"spec/core/test_spec.rb" "spec/core/build_spec.rb" "spec/ide/idea7x_spec.rb" "spec/ide/eclipse_spec.rb"
"spec/packaging/artifact_spec.rb" "spec/packaging/artifact_namespace_spec.rb" "spec/packaging/packaging_spec.rb"
"spec/packaging/archive_spec.rb" "spec/version_requirement_spec.rb" "spec/scala/doc_spec.rb"
"spec/scala/tests_spec.rb" "spec/scala/bdd_spec.rb" "spec/scala/compiler_spec.rb"  --format
failing_examples:failed --format html:_reports/specs.html --backtrace --require "/home/toulmean/buildr-gems/gems/ci_reporter-1.6.2/lib/ci/reporter/rake/rspec_loader.rb"
--format CI::Reporter::RSpec failed

(See full trace by running task with --trace)
Recording test results


Mime
View raw message